incubator-ooo-dev mailing list archives

Site index · List index
Message view « Date » · « Thread »
Top « Date » · « Thread »
From Damjan Jovanovic <>
Subject AOO fails to compile with Subversion 1.7
Date Thu, 10 May 2012 00:27:50 GMT

Don't know if anyone picked this up, but trying to compile the latest
SVN of AOO on Linux with Subversion 1.7 installed is failing:

gcc -pthread -c -fno-strict-aliasing -DNDEBUG -g -fwrapv -O3 -Wall
-Wstrict-prototypes  -I. -IInclude -I./Include  -fPIC -DPy_BUILD_CORE
-DSVNVERSION=\"`LC_ALL=C svnversion .`\" -o Modules/getbuildinfo.o
gcc: error: directory": No such file or directory
make: *** [Modules/getbuildinfo.o] Error 1
dmake:  Error code 2, while making

1 module(s):
need(s) to be rebuilt


ERROR: error 65280 occurred while making /home/user/OO.o/ooo/main/python

When you have fixed the errors in that module you can resume the build
by running:

	build --from python

Apparently the problem is that Subversion 1.7 gives different and
unexpected output for "svnversion ." thus breaking the Python build

You can hack around it by changing the SVNVERSION line to:
in main/python/

Hope this helps someone
Damjan Jovanovic

View raw message