incubator-ooo-dev mailing list archives

Site index · List index
Message view « Date » · « Thread »
Top « Date » · « Thread »
From Chao Huang <chao.de...@gmail.com>
Subject Re: Build Problem with the hunspell modul
Date Mon, 14 May 2012 07:53:11 GMT
Could you please run
   svn info
to get the code revision ?

2012/5/14 Raphael Bircher <r.bircher@gmx.ch>

> Am 14.05.12 09:32, schrieb Chao Huang:
> > 2012/5/14 Raphael Bircher <rbircher@apache.org>
> >
> >> Hi at all
> >>
> >> Maybe Samday was not the best time to bring this topic to the list. I
> >> get no answares util now. Therefore my question, has sameone a idea?
> >>
> >> Greetings Raphael
> >>
> >> Am 12.05.12 13:48, schrieb Raphael Bircher:
> >>> Hi at all
> >>>
> >>> I have a build problem with Mac OS X on the hunspell modul. I tryed the
> >>> trunk/ and branches/AOO340 source, both has the same problem. Here is
> >>> the log output:
> >>>
> >>> /Users/server3/Documents/build52/main/solenv/bin/checkdll.sh
> >>> -L../unxmacxi.pro/lib
> >>> -L/Users/server3/Documents/build52/main/solver/340/unxmacxi.pro/lib
> >>> ../unxmacxi.pro/lib/libsc.dylib
> >>> Making:    libsc.dylib
> >>> cp ../unxmacxi.pro/misc/scui_scui.map.exported-symbols
> >>> ../unxmacxi.pro/misc/scui_scui.map
> >>> cp ../unxmacxi.pro/misc/component_vbaobj.uno.map.exported-symbols
> >>> ../unxmacxi.pro/misc/component_vbaobj.uno.map
> >>> Making:    scen-US.res
> >>> Checking DLL ../unxmacxi.pro/lib/libsc.dylib ...: ok
> >>> /Users/server3/Documents/build52/main/solenv/bin/checkdll.sh
> >>> -L../unxmacxi.pro/lib
> >>> -L/Users/server3/Documents/build52/main/solver/340/unxmacxi.pro/lib
> >>> ../unxmacxi.pro/lib/libscd.dylib
> >>> Making:    libscd.dylib
> >>> /Users/server3/Documents/build52/main/solenv/bin/checkdll.sh
> >>> -L../unxmacxi.pro/lib
> >>> -L/Users/server3/Documents/build52/main/solver/340/unxmacxi.pro/lib
> >>> ../unxmacxi.pro/lib/libscfilt.dylib
> >>> Making:    libscfilt.dylib
> >>> Checking DLL ../unxmacxi.pro/lib/libscd.dylib ...: ok
> >>> /Users/server3/Documents/build52/main/solenv/bin/checkdll.sh
> >>> -L../unxmacxi.pro/lib
> >>> -L/Users/server3/Documents/build52/main/solver/340/unxmacxi.pro/lib
> >>> ../unxmacxi.pro/lib/libscui.dylib
> >>> Making:    libscui.dylib
> >>> Checking DLL ../unxmacxi.pro/lib/libscfilt.dylib ...Checking DLL
> >>> ../unxmacxi.pro/lib/libscui.dylib ...: ok
> >>> Compiling: rsc_sc
> >>> : ok
> >>> : &&
> >>> DYLD_LIBRARY_PATH=/Users/server3/Documents/build52/main/solver/340/
> >> unxmacxi.pro/lib${DYLD_LIBRARY_PATH:+:${DYLD_LIBRARY_PATH}}<http://unxmacxi.pro/lib$%7BDYLD_LIBRARY_PATH:+:$%7BDYLD_LIBRARY_PATH%7D%7D>
> <
> http://unxmacxi.pro/lib$%7BDYLD_LIBRARY_PATH:+:$%7BDYLD_LIBRARY_PATH%7D%7D
> >
> >>> xsltproc --nonet --stringparam uri \
> >>>         'vnd.sun.star.expand:$OOO_BASE_DIR/program/libsc.dylib' -o
> >>> ../unxmacxi.pro/misc/sc.component \
> >>>
> >>> /Users/server3/Documents/build52/main/solenv/bin/createcomponent.xslt
> >>> sc.component
> >>> : &&
> >>> DYLD_LIBRARY_PATH=/Users/server3/Documents/build52/main/solver/340/
> >> unxmacxi.pro/lib${DYLD_LIBRARY_PATH:+:${DYLD_LIBRARY_PATH}}<http://unxmacxi.pro/lib$%7BDYLD_LIBRARY_PATH:+:$%7BDYLD_LIBRARY_PATH%7D%7D>
> <
> http://unxmacxi.pro/lib$%7BDYLD_LIBRARY_PATH:+:$%7BDYLD_LIBRARY_PATH%7D%7D
> >
> >>> xsltproc --nonet --stringparam uri \
> >>>         'vnd.sun.star.expand:$OOO_BASE_DIR/program/libscd.dylib' -o
> >>> ../unxmacxi.pro/misc/scd.component \
> >>>
> >>> /Users/server3/Documents/build52/main/solenv/bin/createcomponent.xslt
> >>> scd.component
> >>> : &&
> >>> DYLD_LIBRARY_PATH=/Users/server3/Documents/build52/main/solver/340/
> >> unxmacxi.pro/lib${DYLD_LIBRARY_PATH:+:${DYLD_LIBRARY_PATH}}<http://unxmacxi.pro/lib$%7BDYLD_LIBRARY_PATH:+:$%7BDYLD_LIBRARY_PATH%7D%7D>
> <
> http://unxmacxi.pro/lib$%7BDYLD_LIBRARY_PATH:+:$%7BDYLD_LIBRARY_PATH%7D%7D
> >
> >>> xsltproc --nonet --stringparam uri \
> >>>         'vnd.sun.star.expand:$OOO_BASE_DIR/program/libvbaobj.uno.dylib'
> >>> -o ../unxmacxi.pro/misc/vbaobj.component \
> >>>
> >>> /Users/server3/Documents/build52/main/solenv/bin/createcomponent.xslt
> >>> vbaobj.component
> >>> /Users/server3/Documents/build52/main/solenv/bin/checkdll.sh
> >>> -L../unxmacxi.pro/lib
> >>> -L/Users/server3/Documents/build52/main/solver/340/unxmacxi.pro/lib
> >>> ../unxmacxi.pro/lib/libvbaobj.uno.dylib
> >>> Making:    libvbaobj.uno.dylib
> >>> Checking DLL ../unxmacxi.pro/lib/libvbaobj.uno.dylib ...: ok
> >>>
> >>> Entering /Users/server3/Documents/build52/main/sc/qa/complex/sc
> >>>
> >>>
> >>> Entering /Users/server3/Documents/build52/main/sc/qa/complex/cellRanges
> >>>
> >>> sc deliver
> >>> deliver -- version: 275594
> >>> Module 'sc' delivered successfully. 169 files copied, 6 files unchanged
> >>>
> >>> 1 module(s):
> >>>     hunspell
> >>> need(s) to be rebuilt
> >>>
> >>> Reason(s):
> >>>
> >>> ERROR: error 65280 occurred while making
> >>> /Users/server3/Documents/build52/main/hunspell
> >>>
> >>> When you have fixed the errors in that module you can resume the build
> >>> by running:
> >>>
> >>>     build --from hunspell
> >>>
> >>> server3:instsetoo_native server3$
> >>>
> >>>
> > Could you please run commands as below :
> >       cd ../hunspell
> >       build
> >
> > Then update the result here ?
>
> server3:hunspell server3$ build
> build -- version: 275224
>
>
> =============
> Building module hunspell
> =============
>
> Entering /Users/server3/Documents/build52/main/hunspell
>
> mkdir: ./unxmacxi.pro/misc/build/hunspell-1.2.9/: File exists
> make  all-recursive
> Making all in intl
> make[2]: Nothing to be done for `all'.
> Making all in po
> make[2]: Nothing to be done for `all'.
> Making all in src
> Making all in hunspell
> make[3]: Nothing to be done for `all'.
> Making all in parsers
> make[3]: Nothing to be done for `all'.
> Making all in tools
> /bin/sh ../../libtool --tag=CXX   --mode=link /usr/bin/g++-4.0  -g -O2
> -Wl,-syslibroot,/Developer/SDKs/MacOSX10.4u.sdk -o analyze analyze.o
> ../hunspell/libhunspell-1.2.la
> libtool: link: /usr/bin/g++-4.0 -g -O2 -Wl,-syslibroot
> -Wl,/Developer/SDKs/MacOSX10.4u.sdk -o analyze analyze.o
> ../hunspell/.libs/libhunspell-1.2.a
> /bin/sh ../../libtool --tag=CXX   --mode=link /usr/bin/g++-4.0  -g -O2
> -Wl,-syslibroot,/Developer/SDKs/MacOSX10.4u.sdk -o chmorph chmorph.o
> ../hunspell/libhunspell-1.2.la ../parsers/libparsers.a
> libtool: link: /usr/bin/g++-4.0 -g -O2 -Wl,-syslibroot
> -Wl,/Developer/SDKs/MacOSX10.4u.sdk -o chmorph chmorph.o
> ../hunspell/.libs/libhunspell-1.2.a ../parsers/libparsers.a
> /usr/bin/g++-4.0 -DHAVE_CONFIG_H -I. -I../.. -I../../src/hunspell
> -I../../src/parsers  -isysroot /Developer/SDKs/MacOSX10.4u.sdk
> -I/usr/local/include  -g -O2 -MT hunspell.o -MD -MP -MF
> .deps/hunspell.Tpo -c -o hunspell.o hunspell.cxx
> hunspell.cxx:111:36: error: ../../intl/libintl.h: No such file or directory
> hunspell.cxx: In function 'void pipe_interface(Hunspell**, int, FILE*)':
> hunspell.cxx:502: error: 'gettext' was not declared in this scope
> hunspell.cxx:547: error: 'gettext' was not declared in this scope
> hunspell.cxx:622: error: 'gettext' was not declared in this scope
> hunspell.cxx: In function 'int main(int, char**)':
> hunspell.cxx:1385: error: 'textdomain' was not declared in this scope
> hunspell.cxx:1425: error: 'gettext' was not declared in this scope
> hunspell.cxx:1457: error: 'gettext' was not declared in this scope
> hunspell.cxx:1470: error: 'gettext' was not declared in this scope
> hunspell.cxx:1547: error: 'gettext' was not declared in this scope
> hunspell.cxx:1594: error: 'gettext' was not declared in this scope
> hunspell.cxx:1607: error: 'gettext' was not declared in this scope
> hunspell.cxx:1625: error: 'gettext' was not declared in this scope
> hunspell.cxx:1629: error: 'gettext' was not declared in this scope
> hunspell.cxx:1690: error: 'gettext' was not declared in this scope
> make[3]: *** [hunspell.o] Error 1
> make[2]: *** [all-recursive] Error 1
> make[1]: *** [all-recursive] Error 1
> make: *** [all] Error 2
> dmake:  Error code 2, while making
> './unxmacxi.pro/misc/build/so_built_hunspell'
> ERROR: error 65280 occurred while making
> /Users/server3/Documents/build52/main/hunspell
>
>
> Looks like same problems with gettext. do I miss sam build requestments?
>
> Greetings Raphael
>
>
> --
> My private Homepage: http://www.raphaelbircher.ch/
>



-- 
Best regards,
Chao Huang

Mime
  • Unnamed multipart/alternative (inline, None, 0 bytes)
View raw message