incubator-odf-dev mailing list archives

Site index · List index
Message view « Date » · « Thread »
Top « Date » · « Thread »
From Apache Jenkins Server <jenk...@builds.apache.org>
Subject Build failed in Jenkins: ODFToolkit-windows #81
Date Tue, 22 Jul 2014 06:02:38 GMT
See <https://builds.apache.org/job/ODFToolkit-windows/81/changes>

Changes:

[fhopf] [maven-release-plugin] rollback the release of odftoolkit-0.6.1-incubating-maven-release

[fhopf] [maven-release-plugin] prepare release odftoolkit-0.6.1-incubating-maven-release

------------------------------------------
[...truncated 10348 lines...]
[INFO] org/ already added, skipping
[INFO] org/apache/ already added, skipping
[INFO] META-INF/maven/ already added, skipping
[INFO] META-INF/ already added, skipping
[INFO] META-INF/MANIFEST.MF already added, skipping
[INFO] org/ already added, skipping
[INFO] org/apache/ already added, skipping
[INFO] org/apache/commons/ already added, skipping
[INFO] META-INF/LICENSE.txt already added, skipping
[INFO] META-INF/NOTICE.txt already added, skipping
[INFO] META-INF/maven/ already added, skipping
[INFO] META-INF/ already added, skipping
[INFO] META-INF/MANIFEST.MF already added, skipping
[INFO] org/ already added, skipping
[INFO] org/apache/ already added, skipping
[INFO] org/apache/commons/ already added, skipping
[INFO] META-INF/LICENSE already added, skipping
[INFO] META-INF/NOTICE already added, skipping
[INFO] META-INF/maven/ already added, skipping
[INFO] META-INF/ already added, skipping
[INFO] META-INF/MANIFEST.MF already added, skipping
[INFO] org/ already added, skipping
[INFO] org/apache/ already added, skipping
[INFO] org/apache/commons/ already added, skipping
[INFO] META-INF/NOTICE.txt already added, skipping
[INFO] META-INF/LICENSE.txt already added, skipping
[INFO] META-INF/ already added, skipping
[INFO] META-INF/MANIFEST.MF already added, skipping
[INFO] org/ already added, skipping
[INFO] org/odftoolkit/ already added, skipping
[INFO] org/odftoolkit/odfdom/ already added, skipping
[INFO] META-INF/DEPENDENCIES already added, skipping
[INFO] META-INF/LICENSE already added, skipping
[INFO] META-INF/NOTICE already added, skipping
[INFO] META-INF/maven/ already added, skipping
[INFO] META-INF/maven/org.apache.odftoolkit/ already added, skipping
[INFO] 
[INFO] --- apache-rat-plugin:0.8:check (default) @ odfdom-java ---
[INFO] Exclude: src/main/resources/**
[INFO] Exclude: src/test/resources/**
[INFO] Exclude: src/main/javadoc/doc-files/OpenDocument-v1.2-part1.html
[INFO] Exclude: src/main/javadoc/doc-files/OpenDocument-v1.2-part3.html
[INFO] Exclude: src/codegen/resources/dom/*.rng
[INFO] Exclude: src/codegen/resources/pkg/*.rng
[PMD] No report found for mojo check
[INFO] 
[INFO] --- maven-install-plugin:2.3.1:install (default-install) @ odfdom-java ---
[INFO] Installing F:\jenkins\jenkins-slave\workspace\ODFToolkit-windows\trunk\odfdom\target\odfdom-java-0.8.10-incubating-SNAPSHOT.jar
to f:\jenkins\jenkins-slave\maven-repositories\1\org\apache\odftoolkit\odfdom-java\0.8.10-incubating-SNAPSHOT\odfdom-java-0.8.10-incubating-SNAPSHOT.jar
[INFO] Installing F:\jenkins\jenkins-slave\workspace\ODFToolkit-windows\trunk\odfdom\pom.xml
to f:\jenkins\jenkins-slave\maven-repositories\1\org\apache\odftoolkit\odfdom-java\0.8.10-incubating-SNAPSHOT\odfdom-java-0.8.10-incubating-SNAPSHOT.pom
[INFO] Installing F:\jenkins\jenkins-slave\workspace\ODFToolkit-windows\trunk\odfdom\target\odfdom-java-0.8.10-incubating-SNAPSHOT-javadoc.jar
to f:\jenkins\jenkins-slave\maven-repositories\1\org\apache\odftoolkit\odfdom-java\0.8.10-incubating-SNAPSHOT\odfdom-java-0.8.10-incubating-SNAPSHOT-javadoc.jar
[INFO] Installing F:\jenkins\jenkins-slave\workspace\ODFToolkit-windows\trunk\odfdom\target\odfdom-java-0.8.10-incubating-SNAPSHOT-sources.jar
to f:\jenkins\jenkins-slave\maven-repositories\1\org\apache\odftoolkit\odfdom-java\0.8.10-incubating-SNAPSHOT\odfdom-java-0.8.10-incubating-SNAPSHOT-sources.jar
[INFO] Installing F:\jenkins\jenkins-slave\workspace\ODFToolkit-windows\trunk\odfdom\target\odfdom-java-0.8.10-incubating-SNAPSHOT-jar-with-dependencies.jar
to f:\jenkins\jenkins-slave\maven-repositories\1\org\apache\odftoolkit\odfdom-java\0.8.10-incubating-SNAPSHOT\odfdom-java-0.8.10-incubating-SNAPSHOT-jar-with-dependencies.jar
[INFO]                                                                         
[INFO] ------------------------------------------------------------------------
[INFO] Building ODF XSLT-Runner 1.2.3-incubating-SNAPSHOT
[INFO] ------------------------------------------------------------------------
[INFO] 
[INFO] --- maven-clean-plugin:2.5:clean (default-clean) @ xslt-runner ---
[INFO] Deleting F:\jenkins\jenkins-slave\workspace\ODFToolkit-windows\trunk\xslt-runner\target
[TASKS] Scanning folder 'F:\jenkins\jenkins-slave\workspace\ODFToolkit-windows\trunk\xslt-runner'
for files matching the pattern '**/*.java' - excludes: 
[TASKS] Found 10 files to scan for tasks
Found 0 open tasks.
[TASKS] Computing warning deltas based on reference build #77
[INFO] 
[INFO] --- maven-remote-resources-plugin:1.4:process (default) @ xslt-runner ---
[INFO] 
[INFO] --- maven-resources-plugin:2.6:resources (default-resources) @ xslt-runner ---
[INFO] Using 'UTF-8' encoding to copy filtered resources.
[INFO] skip non existing resourceDirectory F:\jenkins\jenkins-slave\workspace\ODFToolkit-windows\trunk\xslt-runner\src\main\resources
[INFO] Copying 3 resources
[INFO] 
[INFO] --- maven-compiler-plugin:2.3.2:compile (default-compile) @ xslt-runner ---
[INFO] Compiling 10 source files to F:\jenkins\jenkins-slave\workspace\ODFToolkit-windows\trunk\xslt-runner\target\classes
[INFO] -------------------------------------------------------------
[ERROR] COMPILATION ERROR : 
[INFO] -------------------------------------------------------------
[ERROR] Failure executing javac, but could not parse the error:


The system is out of resources.
Consult the following stack trace for details.
java.lang.OutOfMemoryError: PermGen space
	at java.lang.ClassLoader.defineClass1(Native Method)
	at java.lang.ClassLoader.defineClassCond(ClassLoader.java:631)
	at java.lang.ClassLoader.defineClass(ClassLoader.java:615)
	at java.security.SecureClassLoader.defineClass(SecureClassLoader.java:141)
	at java.net.URLClassLoader.defineClass(URLClassLoader.java:283)
	at java.net.URLClassLoader.access$000(URLClassLoader.java:58)
	at java.net.URLClassLoader$1.run(URLClassLoader.java:197)
	at java.security.AccessController.doPrivileged(Native Method)
	at java.net.URLClassLoader.findClass(URLClassLoader.java:190)
	at org.codehaus.plexus.compiler.javac.IsolatedClassLoader.loadClass(IsolatedClassLoader.java:56)
	at com.sun.tools.javac.jvm.ClassReader.<init>(ClassReader.java:206)
	at com.sun.tools.javac.jvm.ClassReader.instance(ClassReader.java:168)
	at com.sun.tools.javac.main.JavaCompiler.<init>(JavaCompiler.java:293)
	at com.sun.tools.javac.main.JavaCompiler.instance(JavaCompiler.java:72)
	at com.sun.tools.javac.main.Main.compile(Main.java:340)
	at com.sun.tools.javac.main.Main.compile(Main.java:279)
	at com.sun.tools.javac.main.Main.compile(Main.java:270)
	at com.sun.tools.javac.Main.compile(Main.java:87)
	at sun.reflect.NativeMethodAccessorImpl.invoke0(Native Method)
	at sun.reflect.NativeMethodAccessorImpl.invoke(NativeMethodAccessorImpl.java:39)
	at sun.reflect.DelegatingMethodAccessorImpl.invoke(DelegatingMethodAccessorImpl.java:25)
	at java.lang.reflect.Method.invoke(Method.java:597)
	at org.codehaus.plexus.compiler.javac.JavacCompiler.compileInProcess(JavacCompiler.java:554)
	at org.codehaus.plexus.compiler.javac.JavacCompiler.compile(JavacCompiler.java:161)
	at org.apache.maven.plugin.AbstractCompilerMojo.execute(AbstractCompilerMojo.java:605)
	at org.apache.maven.plugin.CompilerMojo.execute(CompilerMojo.java:128)
	at org.apache.maven.plugin.DefaultBuildPluginManager.executeMojo(DefaultBuildPluginManager.java:106)
	at org.apache.maven.lifecycle.internal.MojoExecutor.execute(MojoExecutor.java:208)
	at org.apache.maven.lifecycle.internal.MojoExecutor.execute(MojoExecutor.java:153)
	at org.apache.maven.lifecycle.internal.MojoExecutor.execute(MojoExecutor.java:145)
	at org.apache.maven.lifecycle.internal.LifecycleModuleBuilder.buildProject(LifecycleModuleBuilder.java:84)
	at org.apache.maven.lifecycle.internal.LifecycleModuleBuilder.buildProject(LifecycleModuleBuilder.java:59)

[INFO] 1 error
[INFO] -------------------------------------------------------------
[INFO] ------------------------------------------------------------------------
[INFO] Reactor Summary:
[INFO] 
[INFO] Apache ODF Toolkit ................................ SUCCESS [17.760s]
[INFO] ODF Custom Javadoc Taglets ........................ SUCCESS [2:32.532s]
[INFO] XML Schema to Template Mapping Tool: Parent POM ... SUCCESS [0.302s]
[INFO] XML Schema to Template Mapping Tool: Library ...... SUCCESS [44.889s]
[INFO] XML Schema to Template Mapping Tool: Maven2 Plugin  SUCCESS [14.178s]
[INFO] ODFDOM ............................................ SUCCESS [4:48.036s]
[INFO] ODF XSLT-Runner ................................... FAILURE [4.483s]
[INFO] ODF XSLT-Runner Ant Task .......................... SKIPPED
[INFO] ODF Validator ..................................... SKIPPED
[INFO] Simple Java API for ODF (Simple ODF) .............. SKIPPED
[INFO] ------------------------------------------------------------------------
[INFO] BUILD FAILURE
[INFO] ------------------------------------------------------------------------
[INFO] Total time: 8:46.425s
[INFO] Finished at: Mon Jul 21 23:02:04 PDT 2014
[INFO] Final Memory: 26M/206M
[INFO] ------------------------------------------------------------------------
Waiting for Jenkins to finish collecting data
[ERROR] Failed to execute goal org.apache.maven.plugins:maven-compiler-plugin:2.3.2:compile
(default-compile) on project xslt-runner: Compilation failure
[ERROR] Failure executing javac, but could not parse the error:
[ERROR] 
[ERROR] 
[ERROR] The system is out of resources.
[ERROR] Consult the following stack trace for details.
[ERROR] java.lang.OutOfMemoryError: PermGen space
[ERROR] at java.lang.ClassLoader.defineClass1(Native Method)
[ERROR] at java.lang.ClassLoader.defineClassCond(ClassLoader.java:631)
[ERROR] at java.lang.ClassLoader.defineClass(ClassLoader.java:615)
[ERROR] at java.security.SecureClassLoader.defineClass(SecureClassLoader.java:141)
[ERROR] at java.net.URLClassLoader.defineClass(URLClassLoader.java:283)
[ERROR] at java.net.URLClassLoader.access$000(URLClassLoader.java:58)
[ERROR] at java.net.URLClassLoader$1.run(URLClassLoader.java:197)
[ERROR] at java.security.AccessController.doPrivileged(Native Method)
[ERROR] at java.net.URLClassLoader.findClass(URLClassLoader.java:190)
[ERROR] at org.codehaus.plexus.compiler.javac.IsolatedClassLoader.loadClass(IsolatedClassLoader.java:56)
[ERROR] at com.sun.tools.javac.jvm.ClassReader.<init>(ClassReader.java:206)
[ERROR] at com.sun.tools.javac.jvm.ClassReader.instance(ClassReader.java:168)
[ERROR] at com.sun.tools.javac.main.JavaCompiler.<init>(JavaCompiler.java:293)
[ERROR] at com.sun.tools.javac.main.JavaCompiler.instance(JavaCompiler.java:72)
[ERROR] at com.sun.tools.javac.main.Main.compile(Main.java:340)
[ERROR] at com.sun.tools.javac.main.Main.compile(Main.java:279)
[ERROR] at com.sun.tools.javac.main.Main.compile(Main.java:270)
[ERROR] at com.sun.tools.javac.Main.compile(Main.java:87)
[ERROR] at sun.reflect.NativeMethodAccessorImpl.invoke0(Native Method)
[ERROR] at sun.reflect.NativeMethodAccessorImpl.invoke(NativeMethodAccessorImpl.java:39)
[ERROR] at sun.reflect.DelegatingMethodAccessorImpl.invoke(DelegatingMethodAccessorImpl.java:25)
[ERROR] at java.lang.reflect.Method.invoke(Method.java:597)
[ERROR] at org.codehaus.plexus.compiler.javac.JavacCompiler.compileInProcess(JavacCompiler.java:554)
[ERROR] at org.codehaus.plexus.compiler.javac.JavacCompiler.compile(JavacCompiler.java:161)
[ERROR] at org.apache.maven.plugin.AbstractCompilerMojo.execute(AbstractCompilerMojo.java:605)
[ERROR] at org.apache.maven.plugin.CompilerMojo.execute(CompilerMojo.java:128)
[ERROR] at org.apache.maven.plugin.DefaultBuildPluginManager.executeMojo(DefaultBuildPluginManager.java:106)
[ERROR] at org.apache.maven.lifecycle.internal.MojoExecutor.execute(MojoExecutor.java:208)
[ERROR] at org.apache.maven.lifecycle.internal.MojoExecutor.execute(MojoExecutor.java:153)
[ERROR] at org.apache.maven.lifecycle.internal.MojoExecutor.execute(MojoExecutor.java:145)
[ERROR] at org.apache.maven.lifecycle.internal.LifecycleModuleBuilder.buildProject(LifecycleModuleBuilder.java:84)
[ERROR] at org.apache.maven.lifecycle.internal.LifecycleModuleBuilder.buildProject(LifecycleModuleBuilder.java:59)
[ERROR] -> [Help 1]
[ERROR] 
[ERROR] To see the full stack trace of the errors, re-run Maven with the -e switch.
[ERROR] Re-run Maven using the -X switch to enable full debug logging.
[ERROR] 
[ERROR] For more information about the errors and possible solutions, please read the following
articles:
[ERROR] [Help 1] http://cwiki.apache.org/confluence/display/MAVEN/MojoFailureException
[ERROR] 
[ERROR] After correcting the problems, you can resume the build with the command
[ERROR]   mvn <goals> -rf :xslt-runner
[JENKINS] Archiving F:\jenkins\jenkins-slave\workspace\ODFToolkit-windows\trunk\simple\pom.xml
to org.apache.odftoolkit/simple-odf/0.8.1-incubating-SNAPSHOT/simple-odf-0.8.1-incubating-SNAPSHOT.pom
Sending artifact delta relative to ODFToolkit-windows » Simple Java API for ODF (Simple ODF)
#77
Archived 1 artifacts
Archive block size is 32768
Received 0 blocks and 19307 bytes
Compression is 0.0%
Took 0.15 sec
[JENKINS] Archiving F:\jenkins\jenkins-slave\workspace\ODFToolkit-windows\trunk\odfdom\pom.xml
to org.apache.odftoolkit/odfdom-java/0.8.10-incubating-SNAPSHOT/odfdom-java-0.8.10-incubating-SNAPSHOT.pom
[JENKINS] Archiving F:\jenkins\jenkins-slave\workspace\ODFToolkit-windows\trunk\odfdom\target\odfdom-java-0.8.10-incubating-SNAPSHOT.jar
to org.apache.odftoolkit/odfdom-java/0.8.10-incubating-SNAPSHOT/odfdom-java-0.8.10-incubating-SNAPSHOT.jar
[JENKINS] Archiving F:\jenkins\jenkins-slave\workspace\ODFToolkit-windows\trunk\odfdom\target\odfdom-java-0.8.10-incubating-SNAPSHOT-javadoc.jar
to org.apache.odftoolkit/odfdom-java/0.8.10-incubating-SNAPSHOT/odfdom-java-0.8.10-incubating-SNAPSHOT-javadoc.jar
[JENKINS] Archiving F:\jenkins\jenkins-slave\workspace\ODFToolkit-windows\trunk\odfdom\target\odfdom-java-0.8.10-incubating-SNAPSHOT-sources.jar
to org.apache.odftoolkit/odfdom-java/0.8.10-incubating-SNAPSHOT/odfdom-java-0.8.10-incubating-SNAPSHOT-sources.jar
[JENKINS] Archiving F:\jenkins\jenkins-slave\workspace\ODFToolkit-windows\trunk\odfdom\target\odfdom-java-0.8.10-incubating-SNAPSHOT-jar-with-dependencies.jar
to org.apache.odftoolkit/odfdom-java/0.8.10-incubating-SNAPSHOT/odfdom-java-0.8.10-incubating-SNAPSHOT-jar-with-dependencies.jar
Sending artifact delta relative to ODFToolkit-windows » ODFDOM #77
Archived 5 artifacts
Archive block size is 32768
Received 126 blocks and 33035562 bytes
Compression is 11.1%
Took 17 sec
[JENKINS] Archiving F:\jenkins\jenkins-slave\workspace\ODFToolkit-windows\trunk\generator\pom.xml
to org.apache.odftoolkit/schema2template-pom/0.8.10-incubating-SNAPSHOT/schema2template-pom-0.8.10-incubating-SNAPSHOT.pom
No artifacts from ODFToolkit-windows » XML Schema to Template Mapping Tool: Parent POM #80
to compare, so performing full copy of artifacts
[JENKINS] Archiving F:\jenkins\jenkins-slave\workspace\ODFToolkit-windows\trunk\xslt-runner\pom.xml
to org.apache.odftoolkit/xslt-runner/1.2.3-incubating-SNAPSHOT/xslt-runner-1.2.3-incubating-SNAPSHOT.pom
Sending artifact delta relative to ODFToolkit-windows » ODF XSLT-Runner #77
Archived 1 artifacts
Archive block size is 32768
Received 0 blocks and 2863 bytes
Compression is 0.0%
Took 27 ms
[JENKINS] Archiving F:\jenkins\jenkins-slave\workspace\ODFToolkit-windows\trunk\taglets\pom.xml
to org.apache.odftoolkit/taglets/0.8.10-incubating-SNAPSHOT/taglets-0.8.10-incubating-SNAPSHOT.pom
[JENKINS] Archiving F:\jenkins\jenkins-slave\workspace\ODFToolkit-windows\trunk\taglets\target\taglets-0.8.10-incubating-SNAPSHOT.jar
to org.apache.odftoolkit/taglets/0.8.10-incubating-SNAPSHOT/taglets-0.8.10-incubating-SNAPSHOT.jar
[JENKINS] Archiving F:\jenkins\jenkins-slave\workspace\ODFToolkit-windows\trunk\taglets\target\taglets-0.8.10-incubating-SNAPSHOT-javadoc.jar
to org.apache.odftoolkit/taglets/0.8.10-incubating-SNAPSHOT/taglets-0.8.10-incubating-SNAPSHOT-javadoc.jar
[JENKINS] Archiving F:\jenkins\jenkins-slave\workspace\ODFToolkit-windows\trunk\taglets\target\taglets-0.8.10-incubating-SNAPSHOT-sources.jar
to org.apache.odftoolkit/taglets/0.8.10-incubating-SNAPSHOT/taglets-0.8.10-incubating-SNAPSHOT-sources.jar
[JENKINS] Archiving F:\jenkins\jenkins-slave\workspace\ODFToolkit-windows\trunk\taglets\target\taglets-0.8.10-incubating-SNAPSHOT-jar-with-dependencies.jar
to org.apache.odftoolkit/taglets/0.8.10-incubating-SNAPSHOT/taglets-0.8.10-incubating-SNAPSHOT-jar-with-dependencies.jar
No artifacts from ODFToolkit-windows » ODF Custom Javadoc Taglets #80 to compare, so performing
full copy of artifacts
[JENKINS] Archiving F:\jenkins\jenkins-slave\workspace\ODFToolkit-windows\trunk\validator\pom.xml
to org.apache.odftoolkit/odfvalidator/1.1.7-incubating-SNAPSHOT/odfvalidator-1.1.7-incubating-SNAPSHOT.pom
Sending artifact delta relative to ODFToolkit-windows » ODF Validator #77
Archived 1 artifacts
Archive block size is 32768
Received 0 blocks and 17885 bytes
Compression is 0.0%
Took 0.32 sec
[JENKINS] Archiving F:\jenkins\jenkins-slave\workspace\ODFToolkit-windows\trunk\generator\schema2template-maven-plugin\pom.xml
to org.apache.odftoolkit/schema2template-maven-plugin/0.8.10-incubating-SNAPSHOT/schema2template-maven-plugin-0.8.10-incubating-SNAPSHOT.pom
[JENKINS] Archiving F:\jenkins\jenkins-slave\workspace\ODFToolkit-windows\trunk\generator\schema2template-maven-plugin\target\schema2template-maven-plugin-0.8.10-incubating-SNAPSHOT.jar
to org.apache.odftoolkit/schema2template-maven-plugin/0.8.10-incubating-SNAPSHOT/schema2template-maven-plugin-0.8.10-incubating-SNAPSHOT.jar
[JENKINS] Archiving F:\jenkins\jenkins-slave\workspace\ODFToolkit-windows\trunk\generator\schema2template-maven-plugin\target\schema2template-maven-plugin-0.8.10-incubating-SNAPSHOT-sources.jar
to org.apache.odftoolkit/schema2template-maven-plugin/0.8.10-incubating-SNAPSHOT/schema2template-maven-plugin-0.8.10-incubating-SNAPSHOT-sources.jar
[JENKINS] Archiving F:\jenkins\jenkins-slave\workspace\ODFToolkit-windows\trunk\generator\schema2template-maven-plugin\target\schema2template-maven-plugin-0.8.10-incubating-SNAPSHOT-javadoc.jar
to org.apache.odftoolkit/schema2template-maven-plugin/0.8.10-incubating-SNAPSHOT/schema2template-maven-plugin-0.8.10-incubating-SNAPSHOT-javadoc.jar
No artifacts from ODFToolkit-windows » XML Schema to Template Mapping Tool: Maven2 Plugin
#80 to compare, so performing full copy of artifacts
[JENKINS] Archiving F:\jenkins\jenkins-slave\workspace\ODFToolkit-windows\trunk\generator\schema2template\pom.xml
to org.apache.odftoolkit/schema2template/0.8.10-incubating-SNAPSHOT/schema2template-0.8.10-incubating-SNAPSHOT.pom
[JENKINS] Archiving F:\jenkins\jenkins-slave\workspace\ODFToolkit-windows\trunk\generator\schema2template\target\schema2template-0.8.10-incubating-SNAPSHOT.jar
to org.apache.odftoolkit/schema2template/0.8.10-incubating-SNAPSHOT/schema2template-0.8.10-incubating-SNAPSHOT.jar
[JENKINS] Archiving F:\jenkins\jenkins-slave\workspace\ODFToolkit-windows\trunk\generator\schema2template\target\schema2template-0.8.10-incubating-SNAPSHOT-sources.jar
to org.apache.odftoolkit/schema2template/0.8.10-incubating-SNAPSHOT/schema2template-0.8.10-incubating-SNAPSHOT-sources.jar
[JENKINS] Archiving F:\jenkins\jenkins-slave\workspace\ODFToolkit-windows\trunk\generator\schema2template\target\schema2template-0.8.10-incubating-SNAPSHOT-javadoc.jar
to org.apache.odftoolkit/schema2template/0.8.10-incubating-SNAPSHOT/schema2template-0.8.10-incubating-SNAPSHOT-javadoc.jar
No artifacts from ODFToolkit-windows » XML Schema to Template Mapping Tool: Library #80 to
compare, so performing full copy of artifacts
[JENKINS] Archiving <https://builds.apache.org/job/ODFToolkit-windows/ws/trunk\pom.xml>
to org.apache.odftoolkit/odftoolkit/0.6.1-incubating-SNAPSHOT/odftoolkit-0.6.1-incubating-SNAPSHOT.pom
No artifacts from ODFToolkit-windows » Apache ODF Toolkit #80 to compare, so performing full
copy of artifacts
[JENKINS] Archiving F:\jenkins\jenkins-slave\workspace\ODFToolkit-windows\trunk\xslt-runner-task\pom.xml
to org.apache.odftoolkit/xslt-runner-task/1.2.3-incubating-SNAPSHOT/xslt-runner-task-1.2.3-incubating-SNAPSHOT.pom
Sending artifact delta relative to ODFToolkit-windows » ODF XSLT-Runner Ant Task #77
Archived 1 artifacts
Archive block size is 32768
Received 0 blocks and 2765 bytes
Compression is 0.0%
Took 22 ms
Sending e-mails to: odf-dev@incubator.apache.org mail@florian-hopf.de
Sending e-mails to: odf-dev@incubator.apache.org mail@florian-hopf.de
channel stopped

Mime
View raw message