incubator-odf-dev mailing list archives

Site index · List index
Message view « Date » · « Thread »
Top « Date » · « Thread »
From Apache Jenkins Server <jenk...@builds.apache.org>
Subject Build failed in Jenkins: ODFToolkit-windows #73
Date Fri, 26 Jul 2013 08:06:17 GMT
See <https://builds.apache.org/job/ODFToolkit-windows/73/changes>

Changes:

[fhopf] Updated CHANGES with a section on the 0.6.1 release

[fhopf] ODFTOOLKIT-362: Removed special replacement handling of cells when replacing with
string values

------------------------------------------
[...truncated 21000 lines...]
INFO: --- maven-antrun-plugin:1.2:run (unzip schema packages) @ odfvalidator ---
[INFO] Executing tasks
     [echo] unzip odf 1.2 schemas
    [unzip] Expanding: F:\hudson\hudson-slave\workspace\ODFToolkit-windows\trunk\validator\target\schemas\OpenDocument-v1.2-os-schemas.zip
into F:\hudson\hudson-slave\workspace\ODFToolkit-windows\trunk\validator\target\classes\schema\odf1.2
     [echo] unzip mathml 3.0 schemas
    [unzip] Expanding: F:\hudson\hudson-slave\workspace\ODFToolkit-windows\trunk\validator\target\schemas\mathml3-relaxng.zip
into F:\hudson\hudson-slave\workspace\ODFToolkit-windows\trunk\validator\target\schemas
     [echo] untar mathml 2.0 schemas
    [untar] Expanding: F:\hudson\hudson-slave\workspace\ODFToolkit-windows\trunk\validator\target\schemas\mathml2.tgz
into F:\hudson\hudson-slave\workspace\ODFToolkit-windows\trunk\validator\target\schemas
     [echo] unzip mathml 1.01 schemas
    [unzip] Expanding: F:\hudson\hudson-slave\workspace\ODFToolkit-windows\trunk\validator\target\schemas\mmlents.zip
into F:\hudson\hudson-slave\workspace\ODFToolkit-windows\trunk\validator\target\schemas
[INFO] Executed tasks
Jul 26, 2013 9:04:39 AM org.apache.maven.cli.event.ExecutionEventLogger mojoStarted
INFO: 
Jul 26, 2013 9:04:39 AM org.apache.maven.cli.event.ExecutionEventLogger mojoStarted
INFO: --- maven-remote-resources-plugin:1.4:process (default) @ odfvalidator ---
Jul 26, 2013 9:04:39 AM org.apache.maven.cli.event.ExecutionEventLogger mojoStarted
INFO: 
Jul 26, 2013 9:04:39 AM org.apache.maven.cli.event.ExecutionEventLogger mojoStarted
INFO: --- maven-resources-plugin:2.6:resources (default-resources) @ odfvalidator ---
[INFO] Using 'UTF-8' encoding to copy filtered resources.
[INFO] Copying 4 resources
[INFO] Copying 3 resources
Jul 26, 2013 9:04:39 AM org.apache.maven.cli.event.ExecutionEventLogger mojoStarted
INFO: 
Jul 26, 2013 9:04:39 AM org.apache.maven.cli.event.ExecutionEventLogger mojoStarted
INFO: --- maven-compiler-plugin:2.3.2:compile (default-compile) @ odfvalidator ---
[INFO] Compiling 41 source files to F:\hudson\hudson-slave\workspace\ODFToolkit-windows\trunk\validator\target\classes
Jul 26, 2013 9:04:41 AM org.apache.maven.cli.event.ExecutionEventLogger mojoStarted
INFO: 
Jul 26, 2013 9:04:41 AM org.apache.maven.cli.event.ExecutionEventLogger mojoStarted
INFO: --- maven-resources-plugin:2.6:testResources (default-testResources) @ odfvalidator
---
[INFO] Using 'UTF-8' encoding to copy filtered resources.
[INFO] Copying 8 resources
[INFO] Copying 3 resources
Jul 26, 2013 9:04:41 AM org.apache.maven.cli.event.ExecutionEventLogger mojoStarted
INFO: 
Jul 26, 2013 9:04:41 AM org.apache.maven.cli.event.ExecutionEventLogger mojoStarted
INFO: --- maven-compiler-plugin:2.3.2:testCompile (default-testCompile) @ odfvalidator ---
[INFO] Compiling 3 source files to F:\hudson\hudson-slave\workspace\ODFToolkit-windows\trunk\validator\target\test-classes
Jul 26, 2013 9:04:42 AM org.apache.maven.cli.event.ExecutionEventLogger mojoStarted
INFO: 
Jul 26, 2013 9:04:42 AM org.apache.maven.cli.event.ExecutionEventLogger mojoStarted
INFO: --- maven-surefire-plugin:2.6:test (default-test) @ odfvalidator ---
[INFO] Surefire report directory: F:\hudson\hudson-slave\workspace\ODFToolkit-windows\trunk\validator\target\surefire-reports

-------------------------------------------------------
 T E S T S
-------------------------------------------------------
Running org.odftoolkit.odfvalidator.ValidTest
Tests run: 3, Failures: 0, Errors: 0, Skipped: 2, Time elapsed: 1.476 sec
Running org.odftoolkit.odfvalidator.InvalidPackageTest
Tests run: 5, Failures: 0, Errors: 0, Skipped: 0, Time elapsed: 1.188 sec

Results :

Tests run: 8, Failures: 0, Errors: 0, Skipped: 2

[JENKINS] Recording test results
Jul 26, 2013 9:04:45 AM org.apache.maven.cli.event.ExecutionEventLogger mojoStarted
INFO: 
Jul 26, 2013 9:04:45 AM org.apache.maven.cli.event.ExecutionEventLogger mojoStarted
INFO: --- maven-war-plugin:2.1.1:war (default-war) @ odfvalidator ---
[INFO] Packaging webapp
[INFO] Assembling webapp [odfvalidator] in [F:\hudson\hudson-slave\workspace\ODFToolkit-windows\trunk\validator\target\odfvalidator-1.1.7-incubating-SNAPSHOT]
[INFO] Processing war project
[INFO] Copying webapp resources [F:\hudson\hudson-slave\workspace\ODFToolkit-windows\trunk\validator\src\main\webapp]
[INFO] Webapp assembled in [470 msecs]
[INFO] Building war: F:\hudson\hudson-slave\workspace\ODFToolkit-windows\trunk\validator\target\odfvalidator-1.1.7-incubating-SNAPSHOT.war
[WARNING] Warning: selected war files include a WEB-INF/web.xml which will be ignored 
(webxml attribute is missing from war task, or ignoreWebxml attribute is specified as 'true')
Jul 26, 2013 9:04:48 AM org.apache.maven.cli.event.ExecutionEventLogger mojoStarted
INFO: 
Jul 26, 2013 9:04:48 AM org.apache.maven.cli.event.ExecutionEventLogger mojoStarted
INFO: --- maven-site-plugin:3.2:attach-descriptor (attach-descriptor) @ odfvalidator ---
Jul 26, 2013 9:04:48 AM org.apache.maven.cli.event.ExecutionEventLogger mojoStarted
INFO: 
Jul 26, 2013 9:04:48 AM org.apache.maven.cli.event.ExecutionEventLogger mojoStarted
INFO: --- wagon-maven-plugin:1.0-beta-3:download-single (download-odf-schema-v1.2) @ odfvalidator
---
[INFO] Downloading: http://docs.oasis-open.org/office/v1.2/os/OpenDocument-v1.2-os-schemas.zip
to F:\hudson\hudson-slave\workspace\ODFToolkit-windows\trunk\validator\target\schemas\OpenDocument-v1.2-os-schemas.zip
Jul 26, 2013 9:04:49 AM org.apache.maven.cli.event.ExecutionEventLogger mojoStarted
INFO: 
Jul 26, 2013 9:04:49 AM org.apache.maven.cli.event.ExecutionEventLogger mojoStarted
INFO: --- wagon-maven-plugin:1.0-beta-3:download-single (download-odf-manifest-schema-v1.1)
@ odfvalidator ---
[INFO] Downloading: http://docs.oasis-open.org/office/v1.1/OS/OpenDocument-manifest-schema-v1.1.rng
to F:\hudson\hudson-slave\workspace\ODFToolkit-windows\trunk\validator\target\classes\schema\odf1.1\OpenDocument-manifest-schema-v1.1.rng
Jul 26, 2013 9:04:50 AM org.apache.maven.cli.event.ExecutionEventLogger mojoStarted
INFO: 
Jul 26, 2013 9:04:50 AM org.apache.maven.cli.event.ExecutionEventLogger mojoStarted
INFO: --- wagon-maven-plugin:1.0-beta-3:download-single (download-odf-schema-v1.1) @ odfvalidator
---
[INFO] Downloading: http://docs.oasis-open.org/office/v1.1/OS/OpenDocument-schema-v1.1.rng
to F:\hudson\hudson-slave\workspace\ODFToolkit-windows\trunk\validator\target\classes\schema\odf1.1\OpenDocument-schema-v1.1.rng
Jul 26, 2013 9:04:54 AM org.apache.maven.cli.event.ExecutionEventLogger mojoStarted
INFO: 
Jul 26, 2013 9:04:54 AM org.apache.maven.cli.event.ExecutionEventLogger mojoStarted
INFO: --- wagon-maven-plugin:1.0-beta-3:download-single (download-odf-strict-schema-v1.1)
@ odfvalidator ---
[INFO] Downloading: http://docs.oasis-open.org/office/v1.1/OS/OpenDocument-strict-schema-v1.1.rng
to F:\hudson\hudson-slave\workspace\ODFToolkit-windows\trunk\validator\target\classes\schema\odf1.1\OpenDocument-strict-schema-v1.1.rng
Jul 26, 2013 9:04:54 AM org.apache.maven.cli.event.ExecutionEventLogger mojoStarted
INFO: 
Jul 26, 2013 9:04:54 AM org.apache.maven.cli.event.ExecutionEventLogger mojoStarted
INFO: --- wagon-maven-plugin:1.0-beta-3:download-single (download-odf-manifest-schema-v1.0)
@ odfvalidator ---
[INFO] Downloading: http://oasis-open.org/committees/download.php/12570/OpenDocument-manifest-schema-v1.0-os.rng
to F:\hudson\hudson-slave\workspace\ODFToolkit-windows\trunk\validator\target\classes\schema\odf1.0\OpenDocument-manifest-schema-v1.0-os.rng
Jul 26, 2013 9:05:55 AM hudson.maven.ExecutedMojo <init>
WARNING: Failed to getClass for org.apache.maven.plugin.source.SourceJarMojo
Jul 26, 2013 9:05:55 AM org.apache.maven.cli.event.ExecutionEventLogger logReactorSummary
INFO: ------------------------------------------------------------------------
Jul 26, 2013 9:05:55 AM org.apache.maven.cli.event.ExecutionEventLogger logReactorSummary
INFO: Reactor Summary:
Jul 26, 2013 9:05:55 AM org.apache.maven.cli.event.ExecutionEventLogger logReactorSummary
INFO: 
Jul 26, 2013 9:05:55 AM org.apache.maven.cli.event.ExecutionEventLogger logReactorSummary
INFO: Apache ODF Toolkit ................................ SUCCESS [13.551s]
Jul 26, 2013 9:05:55 AM org.apache.maven.cli.event.ExecutionEventLogger logReactorSummary
INFO: ODF Custom Javadoc Taglets ........................ SUCCESS [3:23.990s]
Jul 26, 2013 9:05:55 AM org.apache.maven.cli.event.ExecutionEventLogger logReactorSummary
INFO: XML Schema to Template Mapping Tool: Parent POM ... SUCCESS [1.712s]
Jul 26, 2013 9:05:55 AM org.apache.maven.cli.event.ExecutionEventLogger logReactorSummary
INFO: XML Schema to Template Mapping Tool: Library ...... SUCCESS [50.436s]
Jul 26, 2013 9:05:55 AM org.apache.maven.cli.event.ExecutionEventLogger logReactorSummary
INFO: XML Schema to Template Mapping Tool: Maven2 Plugin  SUCCESS [4.510s]
Jul 26, 2013 9:05:55 AM org.apache.maven.cli.event.ExecutionEventLogger logReactorSummary
INFO: ODFDOM ............................................ SUCCESS [5:22.361s]
Jul 26, 2013 9:05:55 AM org.apache.maven.cli.event.ExecutionEventLogger logReactorSummary
INFO: ODF XSLT-Runner ................................... SUCCESS [4.373s]
Jul 26, 2013 9:05:55 AM org.apache.maven.cli.event.ExecutionEventLogger logReactorSummary
INFO: ODF XSLT-Runner Ant Task .......................... SUCCESS [1.872s]
Jul 26, 2013 9:05:55 AM org.apache.maven.cli.event.ExecutionEventLogger logReactorSummary
INFO: ODF Validator ..................................... FAILURE [1:50.782s]
Jul 26, 2013 9:05:55 AM org.apache.maven.cli.event.ExecutionEventLogger logReactorSummary
INFO: Simple Java API for ODF (Simple ODF) .............. SKIPPED
Jul 26, 2013 9:05:55 AM org.apache.maven.cli.event.ExecutionEventLogger logResult
INFO: ------------------------------------------------------------------------
Jul 26, 2013 9:05:55 AM org.apache.maven.cli.event.ExecutionEventLogger logResult
INFO: BUILD FAILURE
Jul 26, 2013 9:05:55 AM org.apache.maven.cli.event.ExecutionEventLogger logStats
INFO: ------------------------------------------------------------------------
Jul 26, 2013 9:05:55 AM org.apache.maven.cli.event.ExecutionEventLogger logStats
INFO: Total time: 11:56.774s
Jul 26, 2013 9:05:55 AM org.apache.maven.cli.event.ExecutionEventLogger logStats
INFO: Finished at: Fri Jul 26 09:05:55 BST 2013
Jul 26, 2013 9:05:56 AM org.apache.maven.cli.event.ExecutionEventLogger logStats
INFO: Final Memory: 77M/221M
Jul 26, 2013 9:05:56 AM org.apache.maven.cli.event.ExecutionEventLogger sessionEnded
INFO: ------------------------------------------------------------------------
[JENKINS] Archiving F:\hudson\hudson-slave\workspace\ODFToolkit-windows\trunk\simple\pom.xml
to /home/hudson/hudson/jobs/ODFToolkit-windows/modules/org.apache.odftoolkit$simple-odf/builds/2013-07-26_07-53-55/archive/org.apache.odftoolkit/simple-odf/0.8.1-incubating-SNAPSHOT/simple-odf-0.8.1-incubating-SNAPSHOT.pom
[JENKINS] Archiving F:\hudson\hudson-slave\workspace\ODFToolkit-windows\trunk\xslt-runner-task\pom.xml
to /home/hudson/hudson/jobs/ODFToolkit-windows/modules/org.apache.odftoolkit$xslt-runner-task/builds/2013-07-26_07-53-55/archive/org.apache.odftoolkit/xslt-runner-task/1.2.3-incubating-SNAPSHOT/xslt-runner-task-1.2.3-incubating-SNAPSHOT.pom
[JENKINS] Archiving F:\hudson\hudson-slave\workspace\ODFToolkit-windows\trunk\xslt-runner-task\target\xslt-runner-task-1.2.3-incubating-SNAPSHOT.jar
to /home/hudson/hudson/jobs/ODFToolkit-windows/modules/org.apache.odftoolkit$xslt-runner-task/builds/2013-07-26_07-53-55/archive/org.apache.odftoolkit/xslt-runner-task/1.2.3-incubating-SNAPSHOT/xslt-runner-task-1.2.3-incubating-SNAPSHOT.jar
[JENKINS] Archiving F:\hudson\hudson-slave\workspace\ODFToolkit-windows\trunk\generator\schema2template-maven-plugin\pom.xml
to /home/hudson/hudson/jobs/ODFToolkit-windows/modules/org.apache.odftoolkit$schema2template-maven-plugin/builds/2013-07-26_07-53-55/archive/org.apache.odftoolkit/schema2template-maven-plugin/0.8.10-incubating-SNAPSHOT/schema2template-maven-plugin-0.8.10-incubating-SNAPSHOT.pom
[JENKINS] Archiving F:\hudson\hudson-slave\workspace\ODFToolkit-windows\trunk\generator\schema2template-maven-plugin\target\schema2template-maven-plugin-0.8.10-incubating-SNAPSHOT.jar
to /home/hudson/hudson/jobs/ODFToolkit-windows/modules/org.apache.odftoolkit$schema2template-maven-plugin/builds/2013-07-26_07-53-55/archive/org.apache.odftoolkit/schema2template-maven-plugin/0.8.10-incubating-SNAPSHOT/schema2template-maven-plugin-0.8.10-incubating-SNAPSHOT.jar
[JENKINS] Archiving F:\hudson\hudson-slave\workspace\ODFToolkit-windows\trunk\generator\schema2template-maven-plugin\target\schema2template-maven-plugin-0.8.10-incubating-SNAPSHOT-sources.jar
to /home/hudson/hudson/jobs/ODFToolkit-windows/modules/org.apache.odftoolkit$schema2template-maven-plugin/builds/2013-07-26_07-53-55/archive/org.apache.odftoolkit/schema2template-maven-plugin/0.8.10-incubating-SNAPSHOT/schema2template-maven-plugin-0.8.10-incubating-SNAPSHOT-sources.jar
[JENKINS] Archiving F:\hudson\hudson-slave\workspace\ODFToolkit-windows\trunk\generator\schema2template-maven-plugin\target\schema2template-maven-plugin-0.8.10-incubating-SNAPSHOT-javadoc.jar
to /home/hudson/hudson/jobs/ODFToolkit-windows/modules/org.apache.odftoolkit$schema2template-maven-plugin/builds/2013-07-26_07-53-55/archive/org.apache.odftoolkit/schema2template-maven-plugin/0.8.10-incubating-SNAPSHOT/schema2template-maven-plugin-0.8.10-incubating-SNAPSHOT-javadoc.jar
[JENKINS] Archiving F:\hudson\hudson-slave\workspace\ODFToolkit-windows\trunk\generator\schema2template\pom.xml
to /home/hudson/hudson/jobs/ODFToolkit-windows/modules/org.apache.odftoolkit$schema2template/builds/2013-07-26_07-53-55/archive/org.apache.odftoolkit/schema2template/0.8.10-incubating-SNAPSHOT/schema2template-0.8.10-incubating-SNAPSHOT.pom
[JENKINS] Archiving F:\hudson\hudson-slave\workspace\ODFToolkit-windows\trunk\generator\schema2template\target\schema2template-0.8.10-incubating-SNAPSHOT.jar
to /home/hudson/hudson/jobs/ODFToolkit-windows/modules/org.apache.odftoolkit$schema2template/builds/2013-07-26_07-53-55/archive/org.apache.odftoolkit/schema2template/0.8.10-incubating-SNAPSHOT/schema2template-0.8.10-incubating-SNAPSHOT.jar
[JENKINS] Archiving F:\hudson\hudson-slave\workspace\ODFToolkit-windows\trunk\generator\schema2template\target\schema2template-0.8.10-incubating-SNAPSHOT-sources.jar
to /home/hudson/hudson/jobs/ODFToolkit-windows/modules/org.apache.odftoolkit$schema2template/builds/2013-07-26_07-53-55/archive/org.apache.odftoolkit/schema2template/0.8.10-incubating-SNAPSHOT/schema2template-0.8.10-incubating-SNAPSHOT-sources.jar
[JENKINS] Archiving F:\hudson\hudson-slave\workspace\ODFToolkit-windows\trunk\generator\schema2template\target\schema2template-0.8.10-incubating-SNAPSHOT-javadoc.jar
to /home/hudson/hudson/jobs/ODFToolkit-windows/modules/org.apache.odftoolkit$schema2template/builds/2013-07-26_07-53-55/archive/org.apache.odftoolkit/schema2template/0.8.10-incubating-SNAPSHOT/schema2template-0.8.10-incubating-SNAPSHOT-javadoc.jar
[JENKINS] Archiving F:\hudson\hudson-slave\workspace\ODFToolkit-windows\trunk\validator\pom.xml
to /home/hudson/hudson/jobs/ODFToolkit-windows/modules/org.apache.odftoolkit$odfvalidator/builds/2013-07-26_07-53-55/archive/org.apache.odftoolkit/odfvalidator/1.1.7-incubating-SNAPSHOT/odfvalidator-1.1.7-incubating-SNAPSHOT.pom
[JENKINS] Archiving F:\hudson\hudson-slave\workspace\ODFToolkit-windows\trunk\validator\target\odfvalidator-1.1.7-incubating-SNAPSHOT.war
to /home/hudson/hudson/jobs/ODFToolkit-windows/modules/org.apache.odftoolkit$odfvalidator/builds/2013-07-26_07-53-55/archive/org.apache.odftoolkit/odfvalidator/1.1.7-incubating-SNAPSHOT/odfvalidator-1.1.7-incubating-SNAPSHOT.war
[JENKINS] Archiving F:\hudson\hudson-slave\workspace\ODFToolkit-windows\trunk\xslt-runner\pom.xml
to /home/hudson/hudson/jobs/ODFToolkit-windows/modules/org.apache.odftoolkit$xslt-runner/builds/2013-07-26_07-53-55/archive/org.apache.odftoolkit/xslt-runner/1.2.3-incubating-SNAPSHOT/xslt-runner-1.2.3-incubating-SNAPSHOT.pom
[JENKINS] Archiving F:\hudson\hudson-slave\workspace\ODFToolkit-windows\trunk\xslt-runner\target\xslt-runner-1.2.3-incubating-SNAPSHOT.jar
to /home/hudson/hudson/jobs/ODFToolkit-windows/modules/org.apache.odftoolkit$xslt-runner/builds/2013-07-26_07-53-55/archive/org.apache.odftoolkit/xslt-runner/1.2.3-incubating-SNAPSHOT/xslt-runner-1.2.3-incubating-SNAPSHOT.jar
[JENKINS] Archiving F:\hudson\hudson-slave\workspace\ODFToolkit-windows\trunk\generator\pom.xml
to /home/hudson/hudson/jobs/ODFToolkit-windows/modules/org.apache.odftoolkit$schema2template-pom/builds/2013-07-26_07-53-55/archive/org.apache.odftoolkit/schema2template-pom/0.8.10-incubating-SNAPSHOT/schema2template-pom-0.8.10-incubating-SNAPSHOT.pom
[JENKINS] Archiving <https://builds.apache.org/job/ODFToolkit-windows/ws/trunk\pom.xml>
to /home/hudson/hudson/jobs/ODFToolkit-windows/modules/org.apache.odftoolkit$odftoolkit/builds/2013-07-26_07-53-55/archive/org.apache.odftoolkit/odftoolkit/0.6.1-incubating-SNAPSHOT/odftoolkit-0.6.1-incubating-SNAPSHOT.pom
[JENKINS] Archiving F:\hudson\hudson-slave\workspace\ODFToolkit-windows\trunk\odfdom\pom.xml
to /home/hudson/hudson/jobs/ODFToolkit-windows/modules/org.apache.odftoolkit$odfdom-java/builds/2013-07-26_07-53-55/archive/org.apache.odftoolkit/odfdom-java/0.8.10-incubating-SNAPSHOT/odfdom-java-0.8.10-incubating-SNAPSHOT.pom
[JENKINS] Archiving F:\hudson\hudson-slave\workspace\ODFToolkit-windows\trunk\odfdom\target\odfdom-java-0.8.10-incubating-SNAPSHOT.jar
to /home/hudson/hudson/jobs/ODFToolkit-windows/modules/org.apache.odftoolkit$odfdom-java/builds/2013-07-26_07-53-55/archive/org.apache.odftoolkit/odfdom-java/0.8.10-incubating-SNAPSHOT/odfdom-java-0.8.10-incubating-SNAPSHOT.jar
[JENKINS] Archiving F:\hudson\hudson-slave\workspace\ODFToolkit-windows\trunk\odfdom\target\odfdom-java-0.8.10-incubating-SNAPSHOT-javadoc.jar
to /home/hudson/hudson/jobs/ODFToolkit-windows/modules/org.apache.odftoolkit$odfdom-java/builds/2013-07-26_07-53-55/archive/org.apache.odftoolkit/odfdom-java/0.8.10-incubating-SNAPSHOT/odfdom-java-0.8.10-incubating-SNAPSHOT-javadoc.jar
[JENKINS] Archiving F:\hudson\hudson-slave\workspace\ODFToolkit-windows\trunk\odfdom\target\odfdom-java-0.8.10-incubating-SNAPSHOT-sources.jar
to /home/hudson/hudson/jobs/ODFToolkit-windows/modules/org.apache.odftoolkit$odfdom-java/builds/2013-07-26_07-53-55/archive/org.apache.odftoolkit/odfdom-java/0.8.10-incubating-SNAPSHOT/odfdom-java-0.8.10-incubating-SNAPSHOT-sources.jar
[JENKINS] Archiving F:\hudson\hudson-slave\workspace\ODFToolkit-windows\trunk\odfdom\target\odfdom-java-0.8.10-incubating-SNAPSHOT-jar-with-dependencies.jar
to /home/hudson/hudson/jobs/ODFToolkit-windows/modules/org.apache.odftoolkit$odfdom-java/builds/2013-07-26_07-53-55/archive/org.apache.odftoolkit/odfdom-java/0.8.10-incubating-SNAPSHOT/odfdom-java-0.8.10-incubating-SNAPSHOT-jar-with-dependencies.jar
[JENKINS] Archiving F:\hudson\hudson-slave\workspace\ODFToolkit-windows\trunk\taglets\pom.xml
to /home/hudson/hudson/jobs/ODFToolkit-windows/modules/org.apache.odftoolkit$taglets/builds/2013-07-26_07-53-55/archive/org.apache.odftoolkit/taglets/0.8.10-incubating-SNAPSHOT/taglets-0.8.10-incubating-SNAPSHOT.pom
[JENKINS] Archiving F:\hudson\hudson-slave\workspace\ODFToolkit-windows\trunk\taglets\target\taglets-0.8.10-incubating-SNAPSHOT.jar
to /home/hudson/hudson/jobs/ODFToolkit-windows/modules/org.apache.odftoolkit$taglets/builds/2013-07-26_07-53-55/archive/org.apache.odftoolkit/taglets/0.8.10-incubating-SNAPSHOT/taglets-0.8.10-incubating-SNAPSHOT.jar
[JENKINS] Archiving F:\hudson\hudson-slave\workspace\ODFToolkit-windows\trunk\taglets\target\taglets-0.8.10-incubating-SNAPSHOT-javadoc.jar
to /home/hudson/hudson/jobs/ODFToolkit-windows/modules/org.apache.odftoolkit$taglets/builds/2013-07-26_07-53-55/archive/org.apache.odftoolkit/taglets/0.8.10-incubating-SNAPSHOT/taglets-0.8.10-incubating-SNAPSHOT-javadoc.jar
[JENKINS] Archiving F:\hudson\hudson-slave\workspace\ODFToolkit-windows\trunk\taglets\target\taglets-0.8.10-incubating-SNAPSHOT-sources.jar
to /home/hudson/hudson/jobs/ODFToolkit-windows/modules/org.apache.odftoolkit$taglets/builds/2013-07-26_07-53-55/archive/org.apache.odftoolkit/taglets/0.8.10-incubating-SNAPSHOT/taglets-0.8.10-incubating-SNAPSHOT-sources.jar
[JENKINS] Archiving F:\hudson\hudson-slave\workspace\ODFToolkit-windows\trunk\taglets\target\taglets-0.8.10-incubating-SNAPSHOT-jar-with-dependencies.jar
to /home/hudson/hudson/jobs/ODFToolkit-windows/modules/org.apache.odftoolkit$taglets/builds/2013-07-26_07-53-55/archive/org.apache.odftoolkit/taglets/0.8.10-incubating-SNAPSHOT/taglets-0.8.10-incubating-SNAPSHOT-jar-with-dependencies.jar
Waiting for Jenkins to finish collecting data
mavenExecutionResult exceptions not empty
message : Failed to execute goal org.codehaus.mojo:wagon-maven-plugin:1.0-beta-3:download-single
(download-odf-manifest-schema-v1.0) on project odfvalidator: Error handling resource
cause : Error handling resource
Stack trace : 
org.apache.maven.lifecycle.LifecycleExecutionException: Failed to execute goal org.codehaus.mojo:wagon-maven-plugin:1.0-beta-3:download-single
(download-odf-manifest-schema-v1.0) on project odfvalidator: Error handling resource
	at org.apache.maven.lifecycle.internal.MojoExecutor.execute(MojoExecutor.java:217)
	at org.apache.maven.lifecycle.internal.MojoExecutor.execute(MojoExecutor.java:153)
	at org.apache.maven.lifecycle.internal.MojoExecutor.execute(MojoExecutor.java:145)
	at org.apache.maven.lifecycle.internal.MojoExecutor.executeForkedExecutions(MojoExecutor.java:365)
	at org.apache.maven.lifecycle.internal.MojoExecutor.execute(MojoExecutor.java:199)
	at org.apache.maven.lifecycle.internal.MojoExecutor.execute(MojoExecutor.java:153)
	at org.apache.maven.lifecycle.internal.MojoExecutor.execute(MojoExecutor.java:145)
	at org.apache.maven.lifecycle.internal.LifecycleModuleBuilder.buildProject(LifecycleModuleBuilder.java:84)
	at org.apache.maven.lifecycle.internal.LifecycleModuleBuilder.buildProject(LifecycleModuleBuilder.java:59)
	at org.apache.maven.lifecycle.internal.LifecycleStarter.singleThreadedBuild(LifecycleStarter.java:183)
	at org.apache.maven.lifecycle.internal.LifecycleStarter.execute(LifecycleStarter.java:161)
	at org.apache.maven.DefaultMaven.doExecute(DefaultMaven.java:319)
	at org.apache.maven.DefaultMaven.execute(DefaultMaven.java:156)
	at org.jvnet.hudson.maven3.launcher.Maven3Launcher.main(Maven3Launcher.java:117)
	at sun.reflect.NativeMethodAccessorImpl.invoke0(Native Method)
	at sun.reflect.NativeMethodAccessorImpl.invoke(NativeMethodAccessorImpl.java:39)
	at sun.reflect.DelegatingMethodAccessorImpl.invoke(DelegatingMethodAccessorImpl.java:25)
	at java.lang.reflect.Method.invoke(Method.java:597)
	at org.codehaus.plexus.classworlds.launcher.Launcher.launchStandard(Launcher.java:329)
	at org.codehaus.plexus.classworlds.launcher.Launcher.launch(Launcher.java:239)
	at org.jvnet.hudson.maven3.agent.Maven3Main.launch(Maven3Main.java:178)
	at sun.reflect.NativeMethodAccessorImpl.invoke0(Native Method)
	at sun.reflect.NativeMethodAccessorImpl.invoke(NativeMethodAccessorImpl.java:39)
	at sun.reflect.DelegatingMethodAccessorImpl.invoke(DelegatingMethodAccessorImpl.java:25)
	at java.lang.reflect.Method.invoke(Method.java:597)
	at hudson.maven.Maven3Builder.call(Maven3Builder.java:129)
	at hudson.maven.Maven3Builder.call(Maven3Builder.java:67)
	at hudson.remoting.UserRequest.perform(UserRequest.java:118)
	at hudson.remoting.UserRequest.perform(UserRequest.java:48)
	at hudson.remoting.Request$2.run(Request.java:326)
	at hudson.remoting.InterceptingExecutorService$1.call(InterceptingExecutorService.java:72)
	at java.util.concurrent.FutureTask$Sync.innerRun(FutureTask.java:303)
	at java.util.concurrent.FutureTask.run(FutureTask.java:138)
	at java.util.concurrent.ThreadPoolExecutor$Worker.runTask(ThreadPoolExecutor.java:886)
	at java.util.concurrent.ThreadPoolExecutor$Worker.run(ThreadPoolExecutor.java:908)
	at java.lang.Thread.run(Thread.java:662)
Caused by: org.apache.maven.plugin.MojoExecutionException: Error handling resource
	at org.codehaus.mojo.wagon.AbstractSingleWagonMojo.execute(AbstractSingleWagonMojo.java:67)
	at org.apache.maven.plugin.DefaultBuildPluginManager.executeMojo(DefaultBuildPluginManager.java:107)
	at org.apache.maven.lifecycle.internal.MojoExecutor.execute(MojoExecutor.java:209)
	... 35 more
Caused by: org.apache.maven.wagon.TransferFailedException: Read timed out
	at org.apache.maven.wagon.shared.http.AbstractHttpClientWagon.fillInputData(AbstractHttpClientWagon.java:567)
	at org.apache.maven.wagon.StreamWagon.getInputStream(StreamWagon.java:116)
	at org.apache.maven.wagon.StreamWagon.getIfNewer(StreamWagon.java:88)
	at org.apache.maven.wagon.StreamWagon.get(StreamWagon.java:61)
	at org.codehaus.mojo.wagon.DownloadSingleMojo.execute(DownloadSingleMojo.java:75)
	at org.codehaus.mojo.wagon.AbstractSingleWagonMojo.execute(AbstractSingleWagonMojo.java:63)
	... 37 more
Caused by: java.net.SocketTimeoutException: Read timed out
	at java.net.SocketInputStream.socketRead0(Native Method)
	at java.net.SocketInputStream.read(SocketInputStream.java:129)
	at com.sun.net.ssl.internal.ssl.InputRecord.readFully(InputRecord.java:293)
	at com.sun.net.ssl.internal.ssl.InputRecord.read(InputRecord.java:331)
	at com.sun.net.ssl.internal.ssl.SSLSocketImpl.readRecord(SSLSocketImpl.java:798)
	at com.sun.net.ssl.internal.ssl.SSLSocketImpl.readDataRecord(SSLSocketImpl.java:755)
	at com.sun.net.ssl.internal.ssl.AppInputStream.read(AppInputStream.java:75)
	at java.io.BufferedInputStream.fill(BufferedInputStream.java:218)
	at java.io.BufferedInputStream.read(BufferedInputStream.java:237)
	at org.apache.commons.httpclient.HttpParser.readRawLine(HttpParser.java:78)
	at org.apache.commons.httpclient.HttpParser.readLine(HttpParser.java:106)
	at org.apache.commons.httpclient.HttpConnection.readLine(HttpConnection.java:1116)
	at org.apache.commons.httpclient.MultiThreadedHttpConnectionManager$HttpConnectionAdapter.readLine(MultiThreadedHttpConnectionManager.java:1413)
	at org.apache.commons.httpclient.HttpMethodBase.readStatusLine(HttpMethodBase.java:1973)
	at org.apache.commons.httpclient.HttpMethodBase.readResponse(HttpMethodBase.java:1735)
	at org.apache.commons.httpclient.HttpMethodBase.execute(HttpMethodBase.java:1098)
	at org.apache.commons.httpclient.HttpMethodDirector.executeWithRetry(HttpMethodDirector.java:398)
	at org.apache.commons.httpclient.HttpMethodDirector.executeMethod(HttpMethodDirector.java:171)
	at org.apache.commons.httpclient.HttpClient.executeMethod(HttpClient.java:397)
	at org.apache.commons.httpclient.HttpClient.executeMethod(HttpClient.java:323)
	at org.apache.maven.wagon.shared.http.AbstractHttpClientWagon.execute(AbstractHttpClientWagon.java:446)
	at org.apache.maven.wagon.shared.http.AbstractHttpClientWagon.fillInputData(AbstractHttpClientWagon.java:561)
	... 42 more
Sending e-mails to: odf-dev@incubator.apache.org
channel stopped

Mime
View raw message