incubator-odf-dev mailing list archives

Site index · List index
Message view « Date » · « Thread »
Top « Date » · « Thread »
From Apache Jenkins Server <jenk...@builds.apache.org>
Subject Build failed in Jenkins: ODFToolkit » ODFDOM #87
Date Fri, 28 Jun 2013 13:15:19 GMT
See <https://builds.apache.org/job/ODFToolkit/org.apache.odftoolkit$odfdom-java/87/>

------------------------------------------
[...truncated 861 lines...]
Tests run: 10, Failures: 0, Errors: 0, Skipped: 0, Time elapsed: 5.434 sec
Running org.odftoolkit.odfdom.incubator.search.TextStyleNavigationTest
Jun 28, 2013 1:07:49 PM org.odftoolkit.odfdom.incubator.search.TextStyleNavigationTest testPasteAtFrontOf
INFO: [Roman16 Romanl16] started from 16 in paragraph:Arial14 Arial14 Roman16 Romanl16 Terminal18

Jun 28, 2013 1:07:49 PM org.odftoolkit.odfdom.incubator.search.TextStyleNavigationTest testPasteAtFrontOf
INFO: [delete] started from 31 in paragraph:FooterHeader   Roman16 Romanl16delete
Jun 28, 2013 1:07:49 PM org.odftoolkit.odfdom.incubator.search.TextStyleNavigationTest testPasteAtFrontOf
INFO: [delete] started from 31 in paragraph:FooterHeader   Roman16 Romanl16delete
Jun 28, 2013 1:07:49 PM org.odftoolkit.odfdom.incubator.search.TextStyleNavigationTest testPasteAtFrontOf
INFO: [delete] started from 23 in paragraph:Task2. Roman16 Romanl16delete next paragraph
Jun 28, 2013 1:07:49 PM org.odftoolkit.odfdom.incubator.search.TextStyleNavigationTest testPasteAtFrontOf
INFO: [delete] started from 23 in paragraph:Hello [Roman16 Romanl16delete], I will be delete

Jun 28, 2013 1:07:49 PM org.odftoolkit.odfdom.incubator.search.TextStyleNavigationTest testPasteAtFrontOf
INFO: [delete] started from 58 in paragraph:Hello [Roman16 Romanl16delete], I will be Roman16
Romanl16delete 
Jun 28, 2013 1:07:49 PM org.odftoolkit.odfdom.incubator.search.TextStyleNavigationTest testPasteAtFrontOf
INFO: [delete] started from 23 in paragraph:haha   Roman16 Romanl16delete
Jun 28, 2013 1:07:49 PM org.odftoolkit.odfdom.incubator.search.TextStyleNavigationTest testPasteAtFrontOf
INFO: [delete] started from 22 in paragraph:Hello Roman16 Romanl16delete this word delete
haha delete  oyeah
Jun 28, 2013 1:07:49 PM org.odftoolkit.odfdom.incubator.search.TextStyleNavigationTest testPasteAtFrontOf
INFO: [delete] started from 55 in paragraph:Hello Roman16 Romanl16delete this word Roman16
Romanl16delete haha delete  oyeah
Jun 28, 2013 1:07:49 PM org.odftoolkit.odfdom.incubator.search.TextStyleNavigationTest testPasteAtFrontOf
INFO: [delete] started from 83 in paragraph:Hello Roman16 Romanl16delete this word Roman16
Romanl16delete haha Roman16 Romanl16delete  oyeah
Jun 28, 2013 1:07:50 PM org.odftoolkit.odfdom.incubator.search.TextStyleNavigationTest testPasteAtEndOf
INFO: [Roman16 Romanl16] started from 16 in paragraph:Arial14 Arial14 Roman16 Romanl16 Terminal18

Jun 28, 2013 1:07:50 PM org.odftoolkit.odfdom.incubator.search.TextStyleNavigationTest testPasteAtEndOf
INFO: [delete] started from 15 in paragraph:FooterHeader   deleteRoman16 Romanl16
Jun 28, 2013 1:07:50 PM org.odftoolkit.odfdom.incubator.search.TextStyleNavigationTest testPasteAtEndOf
INFO: [delete] started from 15 in paragraph:FooterHeader   deleteRoman16 Romanl16
Jun 28, 2013 1:07:50 PM org.odftoolkit.odfdom.incubator.search.TextStyleNavigationTest testPasteAtEndOf
INFO: [delete] started from 7 in paragraph:Task2. deleteRoman16 Romanl16 next paragraph
Jun 28, 2013 1:07:50 PM org.odftoolkit.odfdom.incubator.search.TextStyleNavigationTest testPasteAtEndOf
INFO: [delete] started from 7 in paragraph:Hello [deleteRoman16 Romanl16], I will be delete

Jun 28, 2013 1:07:50 PM org.odftoolkit.odfdom.incubator.search.TextStyleNavigationTest testPasteAtEndOf
INFO: [delete] started from 42 in paragraph:Hello [deleteRoman16 Romanl16], I will be deleteRoman16
Romanl16 
Jun 28, 2013 1:07:50 PM org.odftoolkit.odfdom.incubator.search.TextStyleNavigationTest testPasteAtEndOf
INFO: [delete] started from 7 in paragraph:haha   deleteRoman16 Romanl16
Jun 28, 2013 1:07:50 PM org.odftoolkit.odfdom.incubator.search.TextStyleNavigationTest testPasteAtEndOf
INFO: [delete] started from 6 in paragraph:Hello deleteRoman16 Romanl16 this word delete haha
delete  oyeah
Jun 28, 2013 1:07:50 PM org.odftoolkit.odfdom.incubator.search.TextStyleNavigationTest testPasteAtEndOf
INFO: [delete] started from 39 in paragraph:Hello deleteRoman16 Romanl16 this word deleteRoman16
Romanl16 haha delete  oyeah
Jun 28, 2013 1:07:50 PM org.odftoolkit.odfdom.incubator.search.TextStyleNavigationTest testPasteAtEndOf
INFO: [delete] started from 67 in paragraph:Hello deleteRoman16 Romanl16 this word deleteRoman16
Romanl16 haha deleteRoman16 Romanl16  oyeah
Tests run: 4, Failures: 0, Errors: 0, Skipped: 0, Time elapsed: 7.122 sec
Running org.odftoolkit.odfdom.incubator.meta.MetaDocumentStatisticTest
Tests run: 16, Failures: 0, Errors: 0, Skipped: 0, Time elapsed: 6.621 sec
Running org.odftoolkit.odfdom.doc.text.OdfParagraphTest
Jun 28, 2013 1:08:19 PM org.odftoolkit.odfdom.doc.text.OdfParagraphTest testAddContent
INFO: addContent
Jun 28, 2013 1:08:22 PM org.odftoolkit.odfdom.doc.text.OdfParagraphTest testAddContentWhitespace
INFO: text:p addContentWhitespace
Jun 28, 2013 1:08:23 PM org.odftoolkit.odfdom.doc.text.OdfParagraphTest testAddStyledContent
INFO: addStyleContent
Jun 28, 2013 1:08:23 PM org.odftoolkit.odfdom.doc.text.OdfParagraphTest testAddStyledContentWhitespace
INFO: text:p addStyledContentWhitespace
Jun 28, 2013 1:08:23 PM org.odftoolkit.odfdom.doc.text.OdfParagraphTest testAddStyledSpan
INFO: addStyleSpan
Jun 28, 2013 1:08:23 PM org.odftoolkit.odfdom.doc.text.OdfParagraphTest testAddStyledSpanWhitespace
INFO: text:p addStyledSpanWhitespace
Tests run: 6, Failures: 0, Errors: 0, Skipped: 0, Time elapsed: 14.837 sec
Running org.odftoolkit.odfdom.doc.DocumentTest
Jun 28, 2013 1:08:33 PM org.odftoolkit.odfdom.doc.DocumentTest loadDocument
INFO: Loading an supported ODF Spreadsheet document as an ODF Document!
Jun 28, 2013 1:08:35 PM org.odftoolkit.odfdom.doc.DocumentTest loadDocument
INFO: Loading an empty document as an ODF Document!
Jun 28, 2013 1:08:35 PM org.odftoolkit.odfdom.doc.DocumentTest loadDocument
INFO: Loading an unsupported ODF Formula document as an ODF Document!
Jun 28, 2013 1:08:35 PM org.odftoolkit.odfdom.doc.DocumentTest loadDocument
INFO: Loading an unsupported image file as an ODF Document!
Jun 28, 2013 1:08:35 PM org.odftoolkit.odfdom.utils.ErrorHandlerStub registerProblem
INFO: EXPECTED VALIDATION MESSAGE:"The ODF package 'file:///zonestorage/hudson_solaris/home/hudson/hudson-slave/workspace/ODFToolkit/trunk/odfdom/target/test-classes/testInvalidPkg2.odt'
contains no 'mimetype' file!"
Jun 28, 2013 1:08:35 PM org.odftoolkit.odfdom.utils.ErrorHandlerStub registerProblem
INFO: EXPECTED VALIDATION MESSAGE:"The file 'not_in_manifest' shall be listed in the 'META-INF/manifest.xml'
file as it exists in the ODF package 'file:///zonestorage/hudson_solaris/home/hudson/hudson-slave/workspace/ODFToolkit/trunk/odfdom/target/test-classes/testInvalidPkg2.odt'!"
Jun 28, 2013 1:08:35 PM org.odftoolkit.odfdom.utils.ErrorHandlerStub registerProblem
INFO: EXPECTED VALIDATION MESSAGE:"The directory 'Configurations2/images/Bitmaps/' is not
a sub-document and should not be listed in the 'META-INF/manifest.xml' file of ODF package
'file:///zonestorage/hudson_solaris/home/hudson/hudson-slave/workspace/ODFToolkit/trunk/odfdom/target/test-classes/testInvalidPkg2.odt'!"
Jun 28, 2013 1:08:35 PM org.odftoolkit.odfdom.utils.ErrorHandlerStub registerProblem
INFO: EXPECTED VALIDATION MESSAGE:"The file 'content.xml' shall not be listed in the 'META-INF/manifest.xml'
file as it does not exist in the ODF package 'file:///zonestorage/hudson_solaris/home/hudson/hudson-slave/workspace/ODFToolkit/trunk/odfdom/target/test-classes/testInvalidPkg2.odt'!"
Jun 28, 2013 1:08:35 PM org.odftoolkit.odfdom.utils.ErrorHandlerStub registerProblem
INFO: EXPECTED VALIDATION MESSAGE:"The file 'Configurations2/accelerator/current.xml' shall
not be listed in the 'META-INF/manifest.xml' file as it does not exist in the ODF package
'file:///zonestorage/hudson_solaris/home/hudson/hudson-slave/workspace/ODFToolkit/trunk/odfdom/target/test-classes/testInvalidPkg2.odt'!"
Jun 28, 2013 1:08:35 PM org.odftoolkit.odfdom.utils.ErrorHandlerStub registerProblem
INFO: EXPECTED VALIDATION MESSAGE:"The directory 'Configurations2/statusbar/' is not a sub-document
and should not be listed in the 'META-INF/manifest.xml' file of ODF package 'file:///zonestorage/hudson_solaris/home/hudson/hudson-slave/workspace/ODFToolkit/trunk/odfdom/target/test-classes/testInvalidPkg2.odt'!"
Jun 28, 2013 1:08:35 PM org.odftoolkit.odfdom.utils.ErrorHandlerStub registerProblem
INFO: EXPECTED VALIDATION MESSAGE:"The directory 'Configurations2/accelerator/' is not a sub-document
and should not be listed in the 'META-INF/manifest.xml' file of ODF package 'file:///zonestorage/hudson_solaris/home/hudson/hudson-slave/workspace/ODFToolkit/trunk/odfdom/target/test-classes/testInvalidPkg2.odt'!"
Jun 28, 2013 1:08:35 PM org.odftoolkit.odfdom.utils.ErrorHandlerStub registerProblem
INFO: EXPECTED VALIDATION MESSAGE:"The directory 'Configurations2/images/' is not a sub-document
and should not be listed in the 'META-INF/manifest.xml' file of ODF package 'file:///zonestorage/hudson_solaris/home/hudson/hudson-slave/workspace/ODFToolkit/trunk/odfdom/target/test-classes/testInvalidPkg2.odt'!"
Jun 28, 2013 1:08:35 PM org.odftoolkit.odfdom.utils.ErrorHandlerStub registerProblem
INFO: EXPECTED VALIDATION MESSAGE:"The directory 'Configurations2/menubar/' is not a sub-document
and should not be listed in the 'META-INF/manifest.xml' file of ODF package 'file:///zonestorage/hudson_solaris/home/hudson/hudson-slave/workspace/ODFToolkit/trunk/odfdom/target/test-classes/testInvalidPkg2.odt'!"
Jun 28, 2013 1:08:35 PM org.odftoolkit.odfdom.utils.ErrorHandlerStub registerProblem
INFO: EXPECTED VALIDATION MESSAGE:"The directory 'Configurations2/floater/' is not a sub-document
and should not be listed in the 'META-INF/manifest.xml' file of ODF package 'file:///zonestorage/hudson_solaris/home/hudson/hudson-slave/workspace/ODFToolkit/trunk/odfdom/target/test-classes/testInvalidPkg2.odt'!"
Jun 28, 2013 1:08:35 PM org.odftoolkit.odfdom.utils.ErrorHandlerStub registerProblem
INFO: EXPECTED VALIDATION MESSAGE:"The directory 'Configurations2/progressbar/' is not a sub-document
and should not be listed in the 'META-INF/manifest.xml' file of ODF package 'file:///zonestorage/hudson_solaris/home/hudson/hudson-slave/workspace/ODFToolkit/trunk/odfdom/target/test-classes/testInvalidPkg2.odt'!"
Jun 28, 2013 1:08:35 PM org.odftoolkit.odfdom.utils.ErrorHandlerStub registerProblem
INFO: EXPECTED VALIDATION MESSAGE:"The directory 'Configurations2/toolbar/' is not a sub-document
and should not be listed in the 'META-INF/manifest.xml' file of ODF package 'file:///zonestorage/hudson_solaris/home/hudson/hudson-slave/workspace/ODFToolkit/trunk/odfdom/target/test-classes/testInvalidPkg2.odt'!"
Jun 28, 2013 1:08:35 PM org.odftoolkit.odfdom.utils.ErrorHandlerStub registerProblem
INFO: EXPECTED VALIDATION MESSAGE:"The directory 'Configurations2/popupmenu/' is not a sub-document
and should not be listed in the 'META-INF/manifest.xml' file of ODF package 'file:///zonestorage/hudson_solaris/home/hudson/hudson-slave/workspace/ODFToolkit/trunk/odfdom/target/test-classes/testInvalidPkg2.odt'!"
Jun 28, 2013 1:08:35 PM org.odftoolkit.odfdom.utils.ErrorHandlerStub registerProblem
INFO: EXPECTED VALIDATION MESSAGE:"The file 'styles.xml' shall not be listed in the 'META-INF/manifest.xml'
file as it does not exist in the ODF package 'file:///zonestorage/hudson_solaris/home/hudson/hudson-slave/workspace/ODFToolkit/trunk/odfdom/target/test-classes/testInvalidPkg2.odt'!"
Jun 28, 2013 1:08:35 PM org.odftoolkit.odfdom.utils.ErrorHandlerStub registerProblem
INFO: EXPECTED VALIDATION MESSAGE:"The directory 'Thumbnails/' is not a sub-document and should
not be listed in the 'META-INF/manifest.xml' file of ODF package 'file:///zonestorage/hudson_solaris/home/hudson/hudson-slave/workspace/ODFToolkit/trunk/odfdom/target/test-classes/testInvalidPkg2.odt'!"
Jun 28, 2013 1:08:35 PM org.odftoolkit.odfdom.utils.ErrorHandlerStub registerProblem
INFO: EXPECTED VALIDATION MESSAGE:"At least 'content.xml' or 'styles.xml' have to be contained
in the ODF XML Schema package 'file:///zonestorage/hudson_solaris/home/hudson/hudson-slave/workspace/ODFToolkit/trunk/odfdom/target/test-classes/testInvalidPkg2.odt'!"
Jun 28, 2013 1:08:35 PM org.odftoolkit.odfdom.utils.ErrorHandlerStub registerProblem
INFO: EXPECTED VALIDATION MESSAGE:"The 'mimetype' file have to be contained in the ODF XML
Schema package 'file:///zonestorage/hudson_solaris/home/hudson/hudson-slave/workspace/ODFToolkit/trunk/odfdom/target/test-classes/testInvalidPkg2.odt'!"
Jun 28, 2013 1:08:35 PM org.odftoolkit.odfdom.utils.ErrorHandlerStub registerProblem
INFO: EXPECTED VALIDATION MESSAGE:"The root document shall be listed in the 'META-INF/manifest.xml'
file using a '/' as path within the ODF package 'file:///zonestorage/hudson_solaris/home/hudson/hudson-slave/workspace/ODFToolkit/trunk/odfdom/target/test-classes/performance/Presentation1_INVALID.odp'!"
Jun 28, 2013 1:08:35 PM org.odftoolkit.odfdom.utils.ErrorHandlerStub registerProblem
INFO: EXPECTED VALIDATION MESSAGE:"The directory 'Object 7/Pictures/' is not a sub-document
and should not be listed in the 'META-INF/manifest.xml' file of ODF package 'file:///zonestorage/hudson_solaris/home/hudson/hudson-slave/workspace/ODFToolkit/trunk/odfdom/target/test-classes/performance/Presentation1_INVALID.odp'!"
Jun 28, 2013 1:08:35 PM org.odftoolkit.odfdom.utils.ErrorHandlerStub registerProblem
INFO: EXPECTED VALIDATION MESSAGE:"The directory 'Object 9/Thumbnails/' is not a sub-document
and should not be listed in the 'META-INF/manifest.xml' file of ODF package 'file:///zonestorage/hudson_solaris/home/hudson/hudson-slave/workspace/ODFToolkit/trunk/odfdom/target/test-classes/performance/Presentation1_INVALID.odp'!"
Jun 28, 2013 1:08:35 PM org.odftoolkit.odfdom.utils.ErrorHandlerStub registerProblem
INFO: EXPECTED VALIDATION MESSAGE:"The directory 'Thumbnails/' is not a sub-document and should
not be listed in the 'META-INF/manifest.xml' file of ODF package 'file:///zonestorage/hudson_solaris/home/hudson/hudson-slave/workspace/ODFToolkit/trunk/odfdom/target/test-classes/performance/Presentation1_INVALID.odp'!"
Jun 28, 2013 1:08:35 PM org.odftoolkit.odfdom.utils.ErrorHandlerStub registerProblem
INFO: EXPECTED VALIDATION MESSAGE:"The directory 'Object 4/Thumbnails/' is not a sub-document
and should not be listed in the 'META-INF/manifest.xml' file of ODF package 'file:///zonestorage/hudson_solaris/home/hudson/hudson-slave/workspace/ODFToolkit/trunk/odfdom/target/test-classes/performance/Presentation1_INVALID.odp'!"
Jun 28, 2013 1:08:35 PM org.odftoolkit.odfdom.utils.ErrorHandlerStub registerProblem
INFO: EXPECTED VALIDATION MESSAGE:"The directory 'Pictures/' is not a sub-document and should
not be listed in the 'META-INF/manifest.xml' file of ODF package 'file:///zonestorage/hudson_solaris/home/hudson/hudson-slave/workspace/ODFToolkit/trunk/odfdom/target/test-classes/performance/Presentation1_INVALID.odp'!"
Jun 28, 2013 1:08:35 PM org.odftoolkit.odfdom.utils.ErrorHandlerStub registerProblem
INFO: EXPECTED VALIDATION MESSAGE:"The directory 'Object 5/Pictures/' is not a sub-document
and should not be listed in the 'META-INF/manifest.xml' file of ODF package 'file:///zonestorage/hudson_solaris/home/hudson/hudson-slave/workspace/ODFToolkit/trunk/odfdom/target/test-classes/performance/Presentation1_INVALID.odp'!"
Jun 28, 2013 1:08:35 PM org.odftoolkit.odfdom.utils.ErrorHandlerStub registerProblem
INFO: EXPECTED VALIDATION MESSAGE:"The directory 'Object 13/Thumbnails/' is not a sub-document
and should not be listed in the 'META-INF/manifest.xml' file of ODF package 'file:///zonestorage/hudson_solaris/home/hudson/hudson-slave/workspace/ODFToolkit/trunk/odfdom/target/test-classes/performance/Presentation1_INVALID.odp'!"
Jun 28, 2013 1:08:35 PM org.odftoolkit.odfdom.utils.ErrorHandlerStub registerProblem
INFO: EXPECTED VALIDATION MESSAGE:"The directory 'Object 1/Thumbnails/' is not a sub-document
and should not be listed in the 'META-INF/manifest.xml' file of ODF package 'file:///zonestorage/hudson_solaris/home/hudson/hudson-slave/workspace/ODFToolkit/trunk/odfdom/target/test-classes/performance/Presentation1_INVALID.odp'!"
Jun 28, 2013 1:08:35 PM org.odftoolkit.odfdom.utils.ErrorHandlerStub registerProblem
INFO: EXPECTED VALIDATION MESSAGE:"The directory 'ObjectReplacements/' is not a sub-document
and should not be listed in the 'META-INF/manifest.xml' file of ODF package 'file:///zonestorage/hudson_solaris/home/hudson/hudson-slave/workspace/ODFToolkit/trunk/odfdom/target/test-classes/performance/Presentation1_INVALID.odp'!"
Jun 28, 2013 1:08:35 PM org.odftoolkit.odfdom.utils.ErrorHandlerStub registerProblem
INFO: EXPECTED VALIDATION MESSAGE:"The file 'Object 13/content.xml' shall not be listed in
the 'META-INF/manifest.xml' file as it does not exist in the ODF package 'file:///zonestorage/hudson_solaris/home/hudson/hudson-slave/workspace/ODFToolkit/trunk/odfdom/target/test-classes/performance/Presentation1_INVALID.odp'!"
Jun 28, 2013 1:08:35 PM org.odftoolkit.odfdom.utils.ErrorHandlerStub registerProblem
INFO: EXPECTED VALIDATION MESSAGE:"The file 'Object 13/styles.xml' shall not be listed in
the 'META-INF/manifest.xml' file as it does not exist in the ODF package 'file:///zonestorage/hudson_solaris/home/hudson/hudson-slave/workspace/ODFToolkit/trunk/odfdom/target/test-classes/performance/Presentation1_INVALID.odp'!"
Jun 28, 2013 1:08:35 PM org.odftoolkit.odfdom.utils.ErrorHandlerStub registerProblem
INFO: EXPECTED VALIDATION MESSAGE:"The directory 'Object 3/Thumbnails/' is not a sub-document
and should not be listed in the 'META-INF/manifest.xml' file of ODF package 'file:///zonestorage/hudson_solaris/home/hudson/hudson-slave/workspace/ODFToolkit/trunk/odfdom/target/test-classes/performance/Presentation1_INVALID.odp'!"
Jun 28, 2013 1:08:35 PM org.odftoolkit.odfdom.utils.ErrorHandlerStub registerProblem
INFO: EXPECTED VALIDATION MESSAGE:"The directory 'Object 14/Thumbnails/' is not a sub-document
and should not be listed in the 'META-INF/manifest.xml' file of ODF package 'file:///zonestorage/hudson_solaris/home/hudson/hudson-slave/workspace/ODFToolkit/trunk/odfdom/target/test-classes/performance/Presentation1_INVALID.odp'!"
Jun 28, 2013 1:08:35 PM org.odftoolkit.odfdom.utils.ErrorHandlerStub registerProblem
INFO: EXPECTED VALIDATION MESSAGE:"The directory 'Object 10/Thumbnails/' is not a sub-document
and should not be listed in the 'META-INF/manifest.xml' file of ODF package 'file:///zonestorage/hudson_solaris/home/hudson/hudson-slave/workspace/ODFToolkit/trunk/odfdom/target/test-classes/performance/Presentation1_INVALID.odp'!"
Jun 28, 2013 1:08:35 PM org.odftoolkit.odfdom.utils.ErrorHandlerStub registerProblem
INFO: EXPECTED VALIDATION MESSAGE:"The directory 'Object 7/Thumbnails/' is not a sub-document
and should not be listed in the 'META-INF/manifest.xml' file of ODF package 'file:///zonestorage/hudson_solaris/home/hudson/hudson-slave/workspace/ODFToolkit/trunk/odfdom/target/test-classes/performance/Presentation1_INVALID.odp'!"
Jun 28, 2013 1:08:35 PM org.odftoolkit.odfdom.utils.ErrorHandlerStub registerProblem
INFO: EXPECTED VALIDATION MESSAGE:"The directory 'Object 5/Thumbnails/' is not a sub-document
and should not be listed in the 'META-INF/manifest.xml' file of ODF package 'file:///zonestorage/hudson_solaris/home/hudson/hudson-slave/workspace/ODFToolkit/trunk/odfdom/target/test-classes/performance/Presentation1_INVALID.odp'!"
Jun 28, 2013 1:08:35 PM org.odftoolkit.odfdom.utils.ErrorHandlerStub registerProblem
INFO: EXPECTED VALIDATION MESSAGE:"The directory 'Object 8/Thumbnails/' is not a sub-document
and should not be listed in the 'META-INF/manifest.xml' file of ODF package 'file:///zonestorage/hudson_solaris/home/hudson/hudson-slave/workspace/ODFToolkit/trunk/odfdom/target/test-classes/performance/Presentation1_INVALID.odp'!"
Jun 28, 2013 1:08:35 PM org.odftoolkit.odfdom.utils.ErrorHandlerStub registerProblem
INFO: EXPECTED VALIDATION MESSAGE:"The directory 'Configurations2/menubar/' is not a sub-document
and should not be listed in the 'META-INF/manifest.xml' file of ODF package 'file:///zonestorage/hudson_solaris/home/hudson/hudson-slave/workspace/ODFToolkit/trunk/odfdom/target/test-classes/performance/Presentation1_INVALID.odp'!"
Jun 28, 2013 1:08:35 PM org.odftoolkit.odfdom.utils.ErrorHandlerStub registerProblem
INFO: EXPECTED VALIDATION MESSAGE:"The directory 'Configurations2/toolbar/' is not a sub-document
and should not be listed in the 'META-INF/manifest.xml' file of ODF package 'file:///zonestorage/hudson_solaris/home/hudson/hudson-slave/workspace/ODFToolkit/trunk/odfdom/target/test-classes/performance/Presentation1_INVALID.odp'!"
Jun 28, 2013 1:08:35 PM org.odftoolkit.odfdom.utils.ErrorHandlerStub registerProblem
INFO: EXPECTED VALIDATION MESSAGE:"The directory 'Configurations2/statusbar/' is not a sub-document
and should not be listed in the 'META-INF/manifest.xml' file of ODF package 'file:///zonestorage/hudson_solaris/home/hudson/hudson-slave/workspace/ODFToolkit/trunk/odfdom/target/test-classes/performance/Presentation1_INVALID.odp'!"
Jun 28, 2013 1:08:35 PM org.odftoolkit.odfdom.utils.ErrorHandlerStub registerProblem
INFO: EXPECTED VALIDATION MESSAGE:"The directory 'Configurations2/progressbar/' is not a sub-document
and should not be listed in the 'META-INF/manifest.xml' file of ODF package 'file:///zonestorage/hudson_solaris/home/hudson/hudson-slave/workspace/ODFToolkit/trunk/odfdom/target/test-classes/performance/Presentation1_INVALID.odp'!"
Jun 28, 2013 1:08:35 PM org.odftoolkit.odfdom.utils.ErrorHandlerStub registerProblem
INFO: EXPECTED VALIDATION MESSAGE:"The directory 'Configurations2/popupmenu/' is not a sub-document
and should not be listed in the 'META-INF/manifest.xml' file of ODF package 'file:///zonestorage/hudson_solaris/home/hudson/hudson-slave/workspace/ODFToolkit/trunk/odfdom/target/test-classes/performance/Presentation1_INVALID.odp'!"
Jun 28, 2013 1:08:35 PM org.odftoolkit.odfdom.utils.ErrorHandlerStub registerProblem
INFO: EXPECTED VALIDATION MESSAGE:"The directory 'Configurations2/floater/' is not a sub-document
and should not be listed in the 'META-INF/manifest.xml' file of ODF package 'file:///zonestorage/hudson_solaris/home/hudson/hudson-slave/workspace/ODFToolkit/trunk/odfdom/target/test-classes/performance/Presentation1_INVALID.odp'!"
Jun 28, 2013 1:08:36 PM org.odftoolkit.odfdom.utils.ErrorHandlerStub registerProblem
INFO: EXPECTED VALIDATION MESSAGE:"At least 'content.xml' or 'styles.xml' have to be contained
in the ODF XML Schema package '/Object 13/'!"
Jun 28, 2013 1:08:36 PM org.odftoolkit.odfdom.utils.ErrorHandlerStub registerProblem
INFO: EXPECTED VALIDATION MESSAGE:"The file 'mimetype' shall not be compressed in the ODF
package 'file:///zonestorage/hudson_solaris/home/hudson/hudson-slave/workspace/ODFToolkit/trunk/odfdom/target/test-classes/testInvalidPkg1.odt'!"
Jun 28, 2013 1:08:36 PM org.odftoolkit.odfdom.utils.ErrorHandlerStub registerProblem
INFO: EXPECTED VALIDATION MESSAGE:"There shall be no extra field for the 'mimetype' file of
ODF package 'file:///zonestorage/hudson_solaris/home/hudson/hudson-slave/workspace/ODFToolkit/trunk/odfdom/target/test-classes/testInvalidPkg1.odt'!"
Jun 28, 2013 1:08:36 PM org.odftoolkit.odfdom.utils.ErrorHandlerStub registerProblem
INFO: EXPECTED VALIDATION MESSAGE:"The file 'mimetype' is not the first file in the ODF package
'file:///zonestorage/hudson_solaris/home/hudson/hudson-slave/workspace/ODFToolkit/trunk/odfdom/target/test-classes/testInvalidPkg1.odt'!"
Jun 28, 2013 1:08:36 PM org.odftoolkit.odfdom.utils.ErrorHandlerStub registerProblem
INFO: EXPECTED VALIDATION MESSAGE:"The ODF package 'file:///zonestorage/hudson_solaris/home/hudson/hudson-slave/workspace/ODFToolkit/trunk/odfdom/target/test-classes/testInvalidPkg1.odt'
contains a 'mimetype' file containing '?PNGIHDR?zA??_IDATx???! ?@?+??q?`b{f\??|?P?A??P?A??P?A??P?A??P?A??P?A??P?A??P?A??P?A??P?A??P?A??P?A??P?A??P?A??P?A??P?A??P?A??P?A??P?A??P?A??P?A??P?A??P?A??P?A??P?A??P?A??P?A??P?A??P?A??P?A??P?A??P?A??P?A??P?A??P?A??P?A??P?A??P?A??P?A??P?A??P?A??P?A??P?A??P?A??P?A??P?A??P?A??P?A??P?A??P?A??P?A??P?A??P?A??P?A??P?A??P?A??P?A??P?A??P?A??P?A??P?A??P?A??P?A??P?f?Z<>IEND?B`?',
which differs from the mediatype of the root document 'application/vnd.oasis.opendocument.text'!"
Jun 28, 2013 1:08:36 PM org.odftoolkit.odfdom.utils.ErrorHandlerStub registerProblem
INFO: EXPECTED VALIDATION MESSAGE:"The directory 'Thumbnails/' is not a sub-document and should
not be listed in the 'META-INF/manifest.xml' file of ODF package 'file:///zonestorage/hudson_solaris/home/hudson/hudson-slave/workspace/ODFToolkit/trunk/odfdom/target/test-classes/testInvalidPkg1.odt'!"
Jun 28, 2013 1:08:36 PM org.odftoolkit.odfdom.utils.ErrorHandlerStub registerProblem
INFO: EXPECTED VALIDATION MESSAGE:"The directory 'Configurations2/images/Bitmaps/' is not
a sub-document and should not be listed in the 'META-INF/manifest.xml' file of ODF package
'file:///zonestorage/hudson_solaris/home/hudson/hudson-slave/workspace/ODFToolkit/trunk/odfdom/target/test-classes/testInvalidPkg1.odt'!"
Jun 28, 2013 1:08:36 PM org.odftoolkit.odfdom.utils.ErrorHandlerStub registerProblem
INFO: EXPECTED VALIDATION MESSAGE:"The file 'Configurations2/accelerator/current.xml' shall
not be listed in the 'META-INF/manifest.xml' file as it does not exist in the ODF package
'file:///zonestorage/hudson_solaris/home/hudson/hudson-slave/workspace/ODFToolkit/trunk/odfdom/target/test-classes/testInvalidPkg1.odt'!"
Jun 28, 2013 1:08:36 PM org.odftoolkit.odfdom.utils.ErrorHandlerStub registerProblem
INFO: EXPECTED VALIDATION MESSAGE:"The directory 'Configurations2/statusbar/' is not a sub-document
and should not be listed in the 'META-INF/manifest.xml' file of ODF package 'file:///zonestorage/hudson_solaris/home/hudson/hudson-slave/workspace/ODFToolkit/trunk/odfdom/target/test-classes/testInvalidPkg1.odt'!"
Jun 28, 2013 1:08:36 PM org.odftoolkit.odfdom.utils.ErrorHandlerStub registerProblem
INFO: EXPECTED VALIDATION MESSAGE:"The directory 'Configurations2/accelerator/' is not a sub-document
and should not be listed in the 'META-INF/manifest.xml' file of ODF package 'file:///zonestorage/hudson_solaris/home/hudson/hudson-slave/workspace/ODFToolkit/trunk/odfdom/target/test-classes/testInvalidPkg1.odt'!"
Jun 28, 2013 1:08:36 PM org.odftoolkit.odfdom.utils.ErrorHandlerStub registerProblem
INFO: EXPECTED VALIDATION MESSAGE:"The directory 'Configurations2/images/' is not a sub-document
and should not be listed in the 'META-INF/manifest.xml' file of ODF package 'file:///zonestorage/hudson_solaris/home/hudson/hudson-slave/workspace/ODFToolkit/trunk/odfdom/target/test-classes/testInvalidPkg1.odt'!"
Jun 28, 2013 1:08:36 PM org.odftoolkit.odfdom.utils.ErrorHandlerStub registerProblem
INFO: EXPECTED VALIDATION MESSAGE:"The directory 'Configurations2/menubar/' is not a sub-document
and should not be listed in the 'META-INF/manifest.xml' file of ODF package 'file:///zonestorage/hudson_solaris/home/hudson/hudson-slave/workspace/ODFToolkit/trunk/odfdom/target/test-classes/testInvalidPkg1.odt'!"
Jun 28, 2013 1:08:36 PM org.odftoolkit.odfdom.utils.ErrorHandlerStub registerProblem
INFO: EXPECTED VALIDATION MESSAGE:"The directory 'Configurations2/floater/' is not a sub-document
and should not be listed in the 'META-INF/manifest.xml' file of ODF package 'file:///zonestorage/hudson_solaris/home/hudson/hudson-slave/workspace/ODFToolkit/trunk/odfdom/target/test-classes/testInvalidPkg1.odt'!"
Jun 28, 2013 1:08:36 PM org.odftoolkit.odfdom.utils.ErrorHandlerStub registerProblem
INFO: EXPECTED VALIDATION MESSAGE:"The directory 'Configurations2/progressbar/' is not a sub-document
and should not be listed in the 'META-INF/manifest.xml' file of ODF package 'file:///zonestorage/hudson_solaris/home/hudson/hudson-slave/workspace/ODFToolkit/trunk/odfdom/target/test-classes/testInvalidPkg1.odt'!"
Jun 28, 2013 1:08:36 PM org.odftoolkit.odfdom.utils.ErrorHandlerStub registerProblem
INFO: EXPECTED VALIDATION MESSAGE:"The directory 'Configurations2/toolbar/' is not a sub-document
and should not be listed in the 'META-INF/manifest.xml' file of ODF package 'file:///zonestorage/hudson_solaris/home/hudson/hudson-slave/workspace/ODFToolkit/trunk/odfdom/target/test-classes/testInvalidPkg1.odt'!"
Jun 28, 2013 1:08:36 PM org.odftoolkit.odfdom.utils.ErrorHandlerStub registerProblem
INFO: EXPECTED VALIDATION MESSAGE:"The directory 'Configurations2/popupmenu/' is not a sub-document
and should not be listed in the 'META-INF/manifest.xml' file of ODF package 'file:///zonestorage/hudson_solaris/home/hudson/hudson-slave/workspace/ODFToolkit/trunk/odfdom/target/test-classes/testInvalidPkg1.odt'!"
Jun 28, 2013 1:08:36 PM org.odftoolkit.odfdom.utils.ErrorHandlerStub registerProblem
INFO: EXPECTED VALIDATION MESSAGE:"The ODF mimetype '?PNGIHDR?zA??_IDATx???! ?@?+??q?`b{f\??|?P?A??P?A??P?A??P?A??P?A??P?A??P?A??P?A??P?A??P?A??P?A??P?A??P?A??P?A??P?A??P?A??P?A??P?A??P?A??P?A??P?A??P?A??P?A??P?A??P?A??P?A??P?A??P?A??P?A??P?A??P?A??P?A??P?A??P?A??P?A??P?A??P?A??P?A??P?A??P?A??P?A??P?A??P?A??P?A??P?A??P?A??P?A??P?A??P?A??P?A??P?A??P?A??P?A??P?A??P?A??P?A??P?A??P?A??P?A??P?A??P?A??P?A??P?A??P?f?Z<>IEND?B`?'
is invalid for the ODF XML Schema document!"
Tests run: 10, Failures: 0, Errors: 0, Skipped: 1, Time elapsed: 12.191 sec
Running org.odftoolkit.odfdom.doc.text.OdfHeadingTest
Jun 28, 2013 1:09:01 PM org.odftoolkit.odfdom.doc.text.OdfHeadingTest testAddContent
INFO: addContent
Jun 28, 2013 1:09:02 PM org.odftoolkit.odfdom.doc.text.OdfHeadingTest testAddContentWhitespace
INFO: text:h addContentWhitespace
Jun 28, 2013 1:09:02 PM org.odftoolkit.odfdom.doc.text.OdfHeadingTest testAddStyledContent
INFO: addStyleContent
Jun 28, 2013 1:09:02 PM org.odftoolkit.odfdom.doc.text.OdfHeadingTest testAddStyledContentWhitespace
INFO: text:h addStyledContentWhitespace
Jun 28, 2013 1:09:02 PM org.odftoolkit.odfdom.doc.text.OdfHeadingTest testAddStyledSpan
INFO: addStyleSpan
Jun 28, 2013 1:09:03 PM org.odftoolkit.odfdom.doc.text.OdfHeadingTest testAddStyledSpanWhitespace
INFO: text:h addStyledSpanWhitespace
Tests run: 6, Failures: 0, Errors: 0, Skipped: 0, Time elapsed: 14.683 sec
Running org.odftoolkit.odfdom.doc.table.TableCellTest
Tests run: 31, Failures: 0, Errors: 0, Skipped: 0, Time elapsed: 27.698 sec
Running org.odftoolkit.odfdom.pkg.GRDDLTest
Jun 28, 2013 1:09:49 PM org.odftoolkit.odfdom.pkg.GRDDLTest testGRDDL
INFO: RDF Model:
<ModelCom   {file:///zonestorage/hudson_solaris/home/hudson/hudson-slave/workspace/ODFToolkit/trunk/odfdom/target/test-classes/test_rdfmeta.odt/
@urn:oasis:names:tc:opendocument:xmlns:office:1.0version "1.2"; file:///zonestorage/hudson_solaris/home/hudson/hudson-slave/workspace/ODFToolkit/trunk/odfdom/target/test-classes/test_rdfmeta.odt/
@pkg:mimeType "vnd.oasis.opendocument.text"; file:///zonestorage/hudson_solaris/home/hudson/hudson-slave/workspace/ODFToolkit/trunk/odfdom/target/test-classes/test_rdfmeta.odt/
@rdf:type pkg:Document; http://dbpedia.org/page/J._R._R._Tolkien @rdfs:comment "
of the writer
, Oxford, from 1925 to 1945 and Merton Professor of English Language and Literature there
from 1945 to 1959.
"; http://dbpedia.org/page/J._R._R._Tolkien @vcard:fn "
		John Ronald Reuel Tolkien
	"} | >
Tests run: 2, Failures: 0, Errors: 0, Skipped: 0, Time elapsed: 7.354 sec

Results :

Tests run: 303, Failures: 0, Errors: 0, Skipped: 7

[JENKINS] Recording test results
[INFO] [jar:jar {execution: default-jar}]
[INFO] Building jar: <https://builds.apache.org/job/ODFToolkit/org.apache.odftoolkit$odfdom-java/ws/target/odfdom-java-0.8.10-incubating-SNAPSHOT.jar>
[INFO] [javadoc:jar {execution: attach-javadocs}]
[ERROR] Error fetching link: http://simple.odftoolkit.org/javadoc/package-list. Ignored it.
[ERROR] Error fetching link: /export/home/hudson/hudson-slave/workspace/ODFToolkit/trunk/xslt-runner/target/apidocs/package-list.
Ignored it.
[ERROR] Error fetching link: /export/home/hudson/hudson-slave/workspace/ODFToolkit/trunk/xslt-runner-task/target/apidocs/package-list.
Ignored it.
[ERROR] Error fetching link: /export/home/hudson/hudson-slave/workspace/ODFToolkit/trunk/validator/target/apidocs/package-list.
Ignored it.
[ERROR] Error fetching link: /export/home/hudson/hudson-slave/workspace/ODFToolkit/trunk/simple/target/apidocs/package-list.
Ignored it.
[JENKINS] Archiving <https://builds.apache.org/job/ODFToolkit/org.apache.odftoolkit$odfdom-java/ws/pom.xml>
to /home/hudson/hudson/jobs/ODFToolkit/modules/org.apache.odftoolkit$odfdom-java/builds/2013-06-28_12-25-14/archive/org.apache.odftoolkit/odfdom-java/0.8.10-incubating-SNAPSHOT/odfdom-java-0.8.10-incubating-SNAPSHOT.pom
[JENKINS] Archiving <https://builds.apache.org/job/ODFToolkit/org.apache.odftoolkit$odfdom-java/ws/target/odfdom-java-0.8.10-incubating-SNAPSHOT.jar>
to /home/hudson/hudson/jobs/ODFToolkit/modules/org.apache.odftoolkit$odfdom-java/builds/2013-06-28_12-25-14/archive/org.apache.odftoolkit/odfdom-java/0.8.10-incubating-SNAPSHOT/odfdom-java-0.8.10-incubating-SNAPSHOT.jar
[INFO] ------------------------------------------------------------------------
[ERROR] BUILD ERROR
[INFO] ------------------------------------------------------------------------
[INFO] MavenReportException: Error while creating archive:
Error occurred during initialization of VM
Could not reserve enough space for object heap

Error occurred during initialization of VM, try to reduce the Java heap size for the MAVEN_OPTS
environnement variable using -Xms:<size> and -Xmx:<size>.
Or, try to reduce the Java heap size for the Javadoc goal using -Dminmemory=<size> and
-Dmaxmemory=<size>.

Command line was: /zonestorage/hudson_solaris/home/hudson/hudson-slave/tools/jdk6-u26-auto-install/jre/../bin/javadoc
-J-Xmx1024m -J-Xms1024m @options @packages

Refer to the generated Javadoc files in '<https://builds.apache.org/job/ODFToolkit/org.apache.odftoolkit$odfdom-java/ws/target/apidocs'>
dir.


[INFO] ------------------------------------------------------------------------
[INFO] For more information, run Maven with the -e switch
[INFO] ------------------------------------------------------------------------
[INFO] Total time: 44 minutes 29 seconds
[INFO] Finished at: Fri Jun 28 13:15:20 GMT+00:00 2013
[INFO] Final Memory: 97M/523M
[INFO] ------------------------------------------------------------------------

Mime
View raw message