incubator-odf-dev mailing list archives

Site index · List index
Message view « Date » · « Thread »
Top « Date » · « Thread »
From Apache Jenkins Server <jenk...@builds.apache.org>
Subject Build failed in Jenkins: ODFToolkit » ODF Custom Javadoc Taglets #88
Date Fri, 28 Jun 2013 13:27:44 GMT
See <https://builds.apache.org/job/ODFToolkit/org.apache.odftoolkit$taglets/88/changes>

Changes:

[fhopf] [maven-release-plugin] prepare for next development iteration

[fhopf] [maven-release-plugin] prepare release odftoolkit-0.6.1-incubating-RC1

------------------------------------------
[INFO] ------------------------------------------------------------------------
[INFO] Building ODF Custom Javadoc Taglets
[INFO]    task-segment: [clean, install]
[INFO] ------------------------------------------------------------------------
[INFO] [clean:clean {execution: default-clean}]
[TASKS] Scanning folder '<https://builds.apache.org/job/ODFToolkit/org.apache.odftoolkit$taglets/ws/'>
for files matching the pattern '**/*.java' - excludes: 
[TASKS] Found 3 files to scan for tasks
Found 0 open tasks.
[TASKS] Computing warning deltas based on reference build #87
[INFO] [remote-resources:process {execution: default}]
[INFO] [resources:resources {execution: default-resources}]
[INFO] Using 'UTF-8' encoding to copy filtered resources.
[INFO] skip non existing resourceDirectory <https://builds.apache.org/job/ODFToolkit/org.apache.odftoolkit$taglets/ws/src/main/resources>
[INFO] Copying 3 resources
[INFO] [compiler:compile {execution: default-compile}]
[INFO] Compiling 3 source files to <https://builds.apache.org/job/ODFToolkit/org.apache.odftoolkit$taglets/ws/target/classes>
[INFO] [resources:testResources {execution: default-testResources}]
[INFO] Using 'UTF-8' encoding to copy filtered resources.
[INFO] skip non existing resourceDirectory <https://builds.apache.org/job/ODFToolkit/org.apache.odftoolkit$taglets/ws/src/test/resources>
[INFO] Copying 3 resources
[INFO] [compiler:testCompile {execution: default-testCompile}]
[INFO] No sources to compile
[INFO] [surefire:test {execution: default-test}]
[JENKINS] Recording test results
[INFO] [jar:jar {execution: default-jar}]
[INFO] Building jar: <https://builds.apache.org/job/ODFToolkit/org.apache.odftoolkit$taglets/ws/target/taglets-0.8.10-incubating-SNAPSHOT.jar>
[INFO] [javadoc:jar {execution: attach-javadocs}]
[INFO] The goal 'org.apache.maven.plugins:maven-javadoc-plugin:2.7:javadoc' has not be previously
called for the project: 'org.apache.odftoolkit:schema2template:jar:0.8.10-incubating-SNAPSHOT'.
Trying to invoke it...
[ERROR] MavenInvocationException: Error when invoking Maven, consult the invoker log file:
<https://builds.apache.org/job/ODFToolkit/org.apache.odftoolkit$taglets/ws/target/invoker/maven-javadoc-plugin1691630832.txt>
[JENKINS] Archiving <https://builds.apache.org/job/ODFToolkit/org.apache.odftoolkit$taglets/ws/pom.xml>
to /home/hudson/hudson/jobs/ODFToolkit/modules/org.apache.odftoolkit$taglets/builds/2013-06-28_13-17-05/archive/org.apache.odftoolkit/taglets/0.8.10-incubating-SNAPSHOT/taglets-0.8.10-incubating-SNAPSHOT.pom
[JENKINS] Archiving <https://builds.apache.org/job/ODFToolkit/org.apache.odftoolkit$taglets/ws/target/taglets-0.8.10-incubating-SNAPSHOT.jar>
to /home/hudson/hudson/jobs/ODFToolkit/modules/org.apache.odftoolkit$taglets/builds/2013-06-28_13-17-05/archive/org.apache.odftoolkit/taglets/0.8.10-incubating-SNAPSHOT/taglets-0.8.10-incubating-SNAPSHOT.jar
[INFO] ------------------------------------------------------------------------
[ERROR] BUILD ERROR
[INFO] ------------------------------------------------------------------------
[INFO] MavenReportException: Error while creating archive:Error when invoking Maven, consult
the invoker log file: <https://builds.apache.org/job/ODFToolkit/org.apache.odftoolkit$taglets/ws/target/invoker/maven-javadoc-plugin1691630832.txt>

[INFO] ------------------------------------------------------------------------
[INFO] For more information, run Maven with the -e switch
[INFO] ------------------------------------------------------------------------
[INFO] Total time: 5 minutes 29 seconds
[INFO] Finished at: Fri Jun 28 13:27:46 GMT+00:00 2013
[INFO] Final Memory: 64M/414M
[INFO] ------------------------------------------------------------------------

Mime
View raw message