incubator-odf-dev mailing list archives

Site index · List index
Message view « Date » · « Thread »
Top « Date » · « Thread »
From Apache Jenkins Server <jenk...@builds.apache.org>
Subject Build failed in Jenkins: ODFToolkit » ODF Custom Javadoc Taglets #80
Date Fri, 26 Apr 2013 12:13:24 GMT
See <https://builds.apache.org/job/ODFToolkit/org.apache.odftoolkit$taglets/80/>

------------------------------------------
[INFO] ------------------------------------------------------------------------
[INFO] Building ODF Custom Javadoc Taglets
[INFO]    task-segment: [clean, install]
[INFO] ------------------------------------------------------------------------
[INFO] [clean:clean {execution: default-clean}]
[TASKS] Scanning folder '<https://builds.apache.org/job/ODFToolkit/org.apache.odftoolkit$taglets/ws/'>
for files matching the pattern '**/*.java' - excludes: 
[TASKS] Found 3 files to scan for tasks
Found 0 open tasks.
[TASKS] Computing warning deltas based on reference build #79
[INFO] [remote-resources:process {execution: default}]
[debug] execute contextualize
[INFO] [resources:resources {execution: default-resources}]
[INFO] Using 'UTF-8' encoding to copy filtered resources.
[INFO] skip non existing resourceDirectory <https://builds.apache.org/job/ODFToolkit/org.apache.odftoolkit$taglets/ws/src/main/resources>
[INFO] Copying 3 resources
[INFO] [compiler:compile {execution: default-compile}]
[INFO] Compiling 3 source files to <https://builds.apache.org/job/ODFToolkit/org.apache.odftoolkit$taglets/ws/target/classes>
[debug] execute contextualize
[INFO] [resources:testResources {execution: default-testResources}]
[INFO] Using 'UTF-8' encoding to copy filtered resources.
[INFO] skip non existing resourceDirectory <https://builds.apache.org/job/ODFToolkit/org.apache.odftoolkit$taglets/ws/src/test/resources>
[INFO] Copying 3 resources
[INFO] [compiler:testCompile {execution: default-testCompile}]
[INFO] No sources to compile
[INFO] [surefire:test {execution: default-test}]
[INFO] Surefire report directory: <https://builds.apache.org/job/ODFToolkit/org.apache.odftoolkit$taglets/ws/target/surefire-reports>

-------------------------------------------------------
 T E S T S
-------------------------------------------------------

Results :

Tests run: 0, Failures: 0, Errors: 0, Skipped: 0

[JENKINS] Recording test results
[INFO] [jar:jar {execution: default-jar}]
[INFO] Building jar: <https://builds.apache.org/job/ODFToolkit/org.apache.odftoolkit$taglets/ws/target/taglets-0.8.9-incubating.jar>
[INFO] [javadoc:jar {execution: attach-javadocs}]
[INFO] The goal 'org.apache.maven.plugins:maven-javadoc-plugin:2.7:javadoc' has not be previously
called for the project: 'org.apache.odftoolkit:schema2template:jar:0.8.9-incubating'. Trying
to invoke it...
[ERROR] MavenInvocationException: Error when invoking Maven, consult the invoker log file:
<https://builds.apache.org/job/ODFToolkit/org.apache.odftoolkit$taglets/ws/target/invoker/maven-javadoc-plugin1205119743.txt>
[INFO] The goal 'org.apache.maven.plugins:maven-javadoc-plugin:2.7:javadoc' has not be previously
called for the project: 'org.apache.odftoolkit:schema2template-maven-plugin:maven-plugin:0.8.9-incubating'.
Trying to invoke it...
[ERROR] MavenInvocationException: Error when invoking Maven, consult the invoker log file:
<https://builds.apache.org/job/ODFToolkit/org.apache.odftoolkit$taglets/ws/target/invoker/maven-javadoc-plugin836627878.txt>
[JENKINS] Archiving <https://builds.apache.org/job/ODFToolkit/org.apache.odftoolkit$taglets/ws/pom.xml>
to /home/hudson/hudson/jobs/ODFToolkit/modules/org.apache.odftoolkit$taglets/builds/2013-04-26_12-02-55/archive/org.apache.odftoolkit/taglets/0.8.9-incubating/taglets-0.8.9-incubating.pom
[JENKINS] Archiving <https://builds.apache.org/job/ODFToolkit/org.apache.odftoolkit$taglets/ws/target/taglets-0.8.9-incubating.jar>
to /home/hudson/hudson/jobs/ODFToolkit/modules/org.apache.odftoolkit$taglets/builds/2013-04-26_12-02-55/archive/org.apache.odftoolkit/taglets/0.8.9-incubating/taglets-0.8.9-incubating.jar
[INFO] ------------------------------------------------------------------------
[ERROR] BUILD ERROR
[INFO] ------------------------------------------------------------------------
[INFO] MavenReportException: Error while creating archive:Error when invoking Maven, consult
the invoker log file: <https://builds.apache.org/job/ODFToolkit/org.apache.odftoolkit$taglets/ws/target/invoker/maven-javadoc-plugin836627878.txt>

[INFO] ------------------------------------------------------------------------
[INFO] For more information, run Maven with the -e switch
[INFO] ------------------------------------------------------------------------
[INFO] Total time: 5 minutes 31 seconds
[INFO] Finished at: Fri Apr 26 12:13:20 GMT+00:00 2013
[INFO] Final Memory: 62M/413M
[INFO] ------------------------------------------------------------------------

Mime
View raw message