incubator-odf-dev mailing list archives

Site index · List index
Message view « Date » · « Thread »
Top « Date » · « Thread »
From Apache Jenkins Server <jenk...@builds.apache.org>
Subject Build failed in Jenkins: ODFToolkit-windows #59
Date Sun, 28 Apr 2013 11:16:54 GMT
See <https://builds.apache.org/job/ODFToolkit-windows/59/changes>

Changes:

[fhopf] releases can be build without touching the pom

------------------------------------------
[...truncated 20734 lines...]
[INFO] --- maven-install-plugin:2.3.1:install (default-install) @ xslt-runner-task ---
[INFO] Installing F:\hudson\hudson-slave\workspace\ODFToolkit-windows\trunk\xslt-runner-task\pom.xml
to f:\hudson\hudson-slave\maven-repositories\1\org\apache\odftoolkit\xslt-runner-task\1.2.2-incubating\xslt-runner-task-1.2.2-incubating.pom
[INFO]                                                                         
[INFO] ------------------------------------------------------------------------
[INFO] Building ODF Validator 1.1.6-incubating
[INFO] ------------------------------------------------------------------------
[INFO] Deleting F:\hudson\hudson-slave\workspace\ODFToolkit-windows\trunk\validator\target
[INFO] 
[INFO] --- maven-clean-plugin:2.4.1:clean (default-clean) @ odfvalidator ---
[TASKS] Scanning folder 'F:\hudson\hudson-slave\workspace\ODFToolkit-windows\trunk\validator'
for files matching the pattern '**/*.java' - excludes: 
[TASKS] Found 44 files to scan for tasks
Found 0 open tasks.
[TASKS] Computing warning deltas based on reference build #58
[INFO] [INFO] Downloading: http://docs.oasis-open.org/office/v1.2/os/OpenDocument-v1.2-os-schemas.zip
to F:\hudson\hudson-slave\workspace\ODFToolkit-windows\trunk\validator\target\schemas\OpenDocument-v1.2-os-schemas.zip

[INFO] --- wagon-maven-plugin:1.0-beta-3:download-single (download-odf-schema-v1.2) @ odfvalidator
---
[INFO] [INFO] Downloading: http://docs.oasis-open.org/office/v1.1/OS/OpenDocument-manifest-schema-v1.1.rng
to F:\hudson\hudson-slave\workspace\ODFToolkit-windows\trunk\validator\target\classes\schema\odf1.1\OpenDocument-manifest-schema-v1.1.rng

[INFO] --- wagon-maven-plugin:1.0-beta-3:download-single (download-odf-manifest-schema-v1.1)
@ odfvalidator ---
[INFO] Downloading: http://docs.oasis-open.org/office/v1.1/OS/OpenDocument-schema-v1.1.rng
to F:\hudson\hudson-slave\workspace\ODFToolkit-windows\trunk\validator\target\classes\schema\odf1.1\OpenDocument-schema-v1.1.rng
[INFO] 
[INFO] --- wagon-maven-plugin:1.0-beta-3:download-single (download-odf-schema-v1.1) @ odfvalidator
---
[INFO] [INFO] Downloading: http://docs.oasis-open.org/office/v1.1/OS/OpenDocument-strict-schema-v1.1.rng
to F:\hudson\hudson-slave\workspace\ODFToolkit-windows\trunk\validator\target\classes\schema\odf1.1\OpenDocument-strict-schema-v1.1.rng

[INFO] --- wagon-maven-plugin:1.0-beta-3:download-single (download-odf-strict-schema-v1.1)
@ odfvalidator ---
[INFO] [INFO] Downloading: http://oasis-open.org/committees/download.php/12570/OpenDocument-manifest-schema-v1.0-os.rng
to F:\hudson\hudson-slave\workspace\ODFToolkit-windows\trunk\validator\target\classes\schema\odf1.0\OpenDocument-manifest-schema-v1.0-os.rng

[INFO] --- wagon-maven-plugin:1.0-beta-3:download-single (download-odf-manifest-schema-v1.0)
@ odfvalidator ---
[INFO] Downloading: http://www.oasis-open.org/committees/download.php/12571/OpenDocument-schema-v1.0-os.rng
to F:\hudson\hudson-slave\workspace\ODFToolkit-windows\trunk\validator\target\classes\schema\odf1.0\OpenDocument-schema-v1.0-os.rng
[INFO] 
[INFO] --- wagon-maven-plugin:1.0-beta-3:download-single (download-odf-schema-v1.0) @ odfvalidator
---
[INFO] [INFO] Downloading: http://www.oasis-open.org/committees/download.php/12569/OpenDocument-strict-schema-v1.0-os.rng
to F:\hudson\hudson-slave\workspace\ODFToolkit-windows\trunk\validator\target\classes\schema\odf1.0\OpenDocument-strict-schema-v1.0-os.rng

[INFO] --- wagon-maven-plugin:1.0-beta-3:download-single (download-odf-strict-schema-v1.0)
@ odfvalidator ---
[INFO] [INFO] Downloading: http://www.w3.org/Math/RelaxNG/mathml3-relaxng.zip to F:\hudson\hudson-slave\workspace\ODFToolkit-windows\trunk\validator\target\schemas\mathml3-relaxng.zip

[INFO] --- wagon-maven-plugin:1.0-beta-3:download-single (download-mathml-schema-v3.0) @ odfvalidator
---
[INFO] 
[INFO] --- wagon-maven-plugin:1.0-beta-3:download-single (download-mathml-schema-v2.0) @ odfvalidator
---[INFO] Downloading: http://www.w3.org/Math/XMLSchema/mathml2.tgz to F:\hudson\hudson-slave\workspace\ODFToolkit-windows\trunk\validator\target\schemas\mathml2.tgz

[INFO] [INFO] Downloading: http://www.w3.org/pub/WWW/TR/REC-MathML/mmlents.zip to F:\hudson\hudson-slave\workspace\ODFToolkit-windows\trunk\validator\target\schemas\mmlents.zip

[INFO] --- wagon-maven-plugin:1.0-beta-3:download-single (download-mathml-schema-v1.01) @
odfvalidator ---
[INFO] 
[INFO] --- maven-antrun-plugin:1.2:run (unzip schema packages) @ odfvalidator ---
[INFO] Executing tasks
     [echo] unzip odf 1.2 schemas
    [unzip] Expanding: F:\hudson\hudson-slave\workspace\ODFToolkit-windows\trunk\validator\target\schemas\OpenDocument-v1.2-os-schemas.zip
into F:\hudson\hudson-slave\workspace\ODFToolkit-windows\trunk\validator\target\classes\schema\odf1.2
     [echo] unzip mathml 3.0 schemas
    [unzip] Expanding: F:\hudson\hudson-slave\workspace\ODFToolkit-windows\trunk\validator\target\schemas\mathml3-relaxng.zip
into F:\hudson\hudson-slave\workspace\ODFToolkit-windows\trunk\validator\target\schemas
     [echo] untar mathml 2.0 schemas
    [untar] Expanding: F:\hudson\hudson-slave\workspace\ODFToolkit-windows\trunk\validator\target\schemas\mathml2.tgz
into F:\hudson\hudson-slave\workspace\ODFToolkit-windows\trunk\validator\target\schemas
     [echo] unzip mathml 1.01 schemas
    [unzip] Expanding: F:\hudson\hudson-slave\workspace\ODFToolkit-windows\trunk\validator\target\schemas\mmlents.zip
into F:\hudson\hudson-slave\workspace\ODFToolkit-windows\trunk\validator\target\schemas
[INFO] Executed tasks
[INFO] 
[INFO] --- maven-remote-resources-plugin:1.2.1:process (default) @ odfvalidator ---
[debug] execute contextualize
[INFO] Using 'UTF-8' encoding to copy filtered resources.
[INFO] 
[INFO] --- maven-resources-plugin:2.5:resources (default-resources) @ odfvalidator ---
[INFO] Copying 4 resources
[INFO] Copying 3 resources
[INFO] 
[INFO] --- maven-compiler-plugin:2.3.2:compile (default-compile) @ odfvalidator ---
[INFO] Compiling 41 source files to F:\hudson\hudson-slave\workspace\ODFToolkit-windows\trunk\validator\target\classes
[INFO] [debug] execute contextualize
[INFO] Using 'UTF-8' encoding to copy filtered resources.

[INFO] --- maven-resources-plugin:2.5:testResources (default-testResources) @ odfvalidator
---
[INFO] Copying 8 resources
[INFO] Copying 3 resources
[INFO] 
[INFO] --- maven-compiler-plugin:2.3.2:testCompile (default-testCompile) @ odfvalidator ---
[INFO] Compiling 3 source files to F:\hudson\hudson-slave\workspace\ODFToolkit-windows\trunk\validator\target\test-classes
[INFO] 
[INFO] --- maven-surefire-plugin:2.6:test (default-test) @ odfvalidator ---
[INFO] Surefire report directory: F:\hudson\hudson-slave\workspace\ODFToolkit-windows\trunk\validator\target\surefire-reports

-------------------------------------------------------
 T E S T S
-------------------------------------------------------
Running org.odftoolkit.odfvalidator.ValidTest
Tests run: 3, Failures: 0, Errors: 0, Skipped: 2, Time elapsed: 1.419 sec
Running org.odftoolkit.odfvalidator.InvalidPackageTest
Tests run: 5, Failures: 0, Errors: 0, Skipped: 0, Time elapsed: 1.238 sec

Results :

Tests run: 8, Failures: 0, Errors: 0, Skipped: 2

[JENKINS] Recording test results
[INFO] 
[INFO] --- maven-war-plugin:2.1.1:war (default-war) @ odfvalidator ---
[INFO] Packaging webapp
[INFO] Assembling webapp [odfvalidator] in [F:\hudson\hudson-slave\workspace\ODFToolkit-windows\trunk\validator\target\odfvalidator-1.1.6-incubating]
[INFO] Processing war project
[INFO] Copying webapp resources [F:\hudson\hudson-slave\workspace\ODFToolkit-windows\trunk\validator\src\main\webapp]
[INFO] Webapp assembled in [565 msecs]
[INFO] Building war: F:\hudson\hudson-slave\workspace\ODFToolkit-windows\trunk\validator\target\odfvalidator-1.1.6-incubating.war
[WARNING] Warning: selected war files include a WEB-INF/web.xml which will be ignored 
(webxml attribute is missing from war task, or ignoreWebxml attribute is specified as 'true')
[INFO] 
[INFO] --- maven-site-plugin:3.0:attach-descriptor (attach-descriptor) @ odfvalidator ---
[INFO] [INFO] Downloading: http://docs.oasis-open.org/office/v1.2/os/OpenDocument-v1.2-os-schemas.zip
to F:\hudson\hudson-slave\workspace\ODFToolkit-windows\trunk\validator\target\schemas\OpenDocument-v1.2-os-schemas.zip

[INFO] --- wagon-maven-plugin:1.0-beta-3:download-single (download-odf-schema-v1.2) @ odfvalidator
---
[INFO] [INFO] Downloading: http://docs.oasis-open.org/office/v1.1/OS/OpenDocument-manifest-schema-v1.1.rng
to F:\hudson\hudson-slave\workspace\ODFToolkit-windows\trunk\validator\target\classes\schema\odf1.1\OpenDocument-manifest-schema-v1.1.rng

[INFO] --- wagon-maven-plugin:1.0-beta-3:download-single (download-odf-manifest-schema-v1.1)
@ odfvalidator ---
[INFO] [INFO] Downloading: http://docs.oasis-open.org/office/v1.1/OS/OpenDocument-schema-v1.1.rng
to F:\hudson\hudson-slave\workspace\ODFToolkit-windows\trunk\validator\target\classes\schema\odf1.1\OpenDocument-schema-v1.1.rng

[INFO] --- wagon-maven-plugin:1.0-beta-3:download-single (download-odf-schema-v1.1) @ odfvalidator
---
[INFO] [INFO] Downloading: http://docs.oasis-open.org/office/v1.1/OS/OpenDocument-strict-schema-v1.1.rng
to F:\hudson\hudson-slave\workspace\ODFToolkit-windows\trunk\validator\target\classes\schema\odf1.1\OpenDocument-strict-schema-v1.1.rng

[INFO] --- wagon-maven-plugin:1.0-beta-3:download-single (download-odf-strict-schema-v1.1)
@ odfvalidator ---
[INFO] [INFO] Downloading: http://oasis-open.org/committees/download.php/12570/OpenDocument-manifest-schema-v1.0-os.rng
to F:\hudson\hudson-slave\workspace\ODFToolkit-windows\trunk\validator\target\classes\schema\odf1.0\OpenDocument-manifest-schema-v1.0-os.rng

[INFO] --- wagon-maven-plugin:1.0-beta-3:download-single (download-odf-manifest-schema-v1.0)
@ odfvalidator ---
[INFO] [INFO] Downloading: http://www.oasis-open.org/committees/download.php/12571/OpenDocument-schema-v1.0-os.rng
to F:\hudson\hudson-slave\workspace\ODFToolkit-windows\trunk\validator\target\classes\schema\odf1.0\OpenDocument-schema-v1.0-os.rng

[INFO] --- wagon-maven-plugin:1.0-beta-3:download-single (download-odf-schema-v1.0) @ odfvalidator
---
Apr 28, 2013 12:16:34 PM org.apache.commons.httpclient.HttpMethodDirector executeWithRetry
INFO: I/O exception (org.apache.commons.httpclient.NoHttpResponseException) caught when processing
request: The server www.oasis-open.org failed to respond
Apr 28, 2013 12:16:34 PM org.apache.commons.httpclient.HttpMethodDirector executeWithRetry
INFO: Retrying request
Apr 28, 2013 12:16:35 PM hudson.maven.ExecutedMojo <init>
WARNING: Failed to getClass for org.apache.maven.plugin.source.SourceJarMojo
[INFO] ------------------------------------------------------------------------
[INFO] Reactor Summary:
[INFO] 
[INFO] Apache ODF Toolkit ................................ SUCCESS [7.518s]
[INFO] ODF Custom Javadoc Taglets ........................ SUCCESS [4:43.977s]
[INFO] XML Schema to Template Mapping Tool: Parent POM ... SUCCESS [0.875s]
[INFO] XML Schema to Template Mapping Tool: Library ...... SUCCESS [56.367s]
[INFO] XML Schema to Template Mapping Tool: Maven2 Plugin  SUCCESS [4.640s]
[INFO] ODFDOM ............................................ SUCCESS [6:02.105s]
[INFO] ODF XSLT-Runner ................................... SUCCESS [3.505s]
[INFO] ODF XSLT-Runner Ant Task .......................... SUCCESS [1.678s]
[INFO] ODF Validator ..................................... FAILURE [53.989s]
[INFO] Simple Java API for ODF (Simple ODF) .............. SKIPPED
[INFO] ------------------------------------------------------------------------
[INFO] BUILD FAILURE
[INFO] ------------------------------------------------------------------------
[INFO] Total time: 12:57.829s
[INFO] Finished at: Sun Apr 28 12:16:35 BST 2013
[INFO] Final Memory: 73M/296M
[INFO] ------------------------------------------------------------------------
[JENKINS] Archiving F:\hudson\hudson-slave\workspace\ODFToolkit-windows\trunk\simple\pom.xml
to /home/hudson/hudson/jobs/ODFToolkit-windows/modules/org.apache.odftoolkit$simple-odf/builds/2013-04-28_11-03-35/archive/org.apache.odftoolkit/simple-odf/0.8-incubating/simple-odf-0.8-incubating.pom
[JENKINS] Archiving F:\hudson\hudson-slave\workspace\ODFToolkit-windows\trunk\xslt-runner-task\pom.xml
to /home/hudson/hudson/jobs/ODFToolkit-windows/modules/org.apache.odftoolkit$xslt-runner-task/builds/2013-04-28_11-03-35/archive/org.apache.odftoolkit/xslt-runner-task/1.2.2-incubating/xslt-runner-task-1.2.2-incubating.pom
[JENKINS] Archiving F:\hudson\hudson-slave\workspace\ODFToolkit-windows\trunk\xslt-runner-task\target\xslt-runner-task-1.2.2-incubating.jar
to /home/hudson/hudson/jobs/ODFToolkit-windows/modules/org.apache.odftoolkit$xslt-runner-task/builds/2013-04-28_11-03-35/archive/org.apache.odftoolkit/xslt-runner-task/1.2.2-incubating/xslt-runner-task-1.2.2-incubating.jar
[JENKINS] Archiving F:\hudson\hudson-slave\workspace\ODFToolkit-windows\trunk\generator\schema2template-maven-plugin\pom.xml
to /home/hudson/hudson/jobs/ODFToolkit-windows/modules/org.apache.odftoolkit$schema2template-maven-plugin/builds/2013-04-28_11-03-35/archive/org.apache.odftoolkit/schema2template-maven-plugin/0.8.9-incubating/schema2template-maven-plugin-0.8.9-incubating.pom
[JENKINS] Archiving F:\hudson\hudson-slave\workspace\ODFToolkit-windows\trunk\generator\schema2template-maven-plugin\target\schema2template-maven-plugin-0.8.9-incubating.jar
to /home/hudson/hudson/jobs/ODFToolkit-windows/modules/org.apache.odftoolkit$schema2template-maven-plugin/builds/2013-04-28_11-03-35/archive/org.apache.odftoolkit/schema2template-maven-plugin/0.8.9-incubating/schema2template-maven-plugin-0.8.9-incubating.jar
[JENKINS] Archiving F:\hudson\hudson-slave\workspace\ODFToolkit-windows\trunk\generator\schema2template-maven-plugin\target\schema2template-maven-plugin-0.8.9-incubating-sources.jar
to /home/hudson/hudson/jobs/ODFToolkit-windows/modules/org.apache.odftoolkit$schema2template-maven-plugin/builds/2013-04-28_11-03-35/archive/org.apache.odftoolkit/schema2template-maven-plugin/0.8.9-incubating/schema2template-maven-plugin-0.8.9-incubating-sources.jar
[JENKINS] Archiving F:\hudson\hudson-slave\workspace\ODFToolkit-windows\trunk\generator\schema2template-maven-plugin\target\schema2template-maven-plugin-0.8.9-incubating-javadoc.jar
to /home/hudson/hudson/jobs/ODFToolkit-windows/modules/org.apache.odftoolkit$schema2template-maven-plugin/builds/2013-04-28_11-03-35/archive/org.apache.odftoolkit/schema2template-maven-plugin/0.8.9-incubating/schema2template-maven-plugin-0.8.9-incubating-javadoc.jar
[JENKINS] Archiving F:\hudson\hudson-slave\workspace\ODFToolkit-windows\trunk\generator\schema2template\pom.xml
to /home/hudson/hudson/jobs/ODFToolkit-windows/modules/org.apache.odftoolkit$schema2template/builds/2013-04-28_11-03-35/archive/org.apache.odftoolkit/schema2template/0.8.9-incubating/schema2template-0.8.9-incubating.pom
[JENKINS] Archiving F:\hudson\hudson-slave\workspace\ODFToolkit-windows\trunk\generator\schema2template\target\schema2template-0.8.9-incubating.jar
to /home/hudson/hudson/jobs/ODFToolkit-windows/modules/org.apache.odftoolkit$schema2template/builds/2013-04-28_11-03-35/archive/org.apache.odftoolkit/schema2template/0.8.9-incubating/schema2template-0.8.9-incubating.jar
[JENKINS] Archiving F:\hudson\hudson-slave\workspace\ODFToolkit-windows\trunk\generator\schema2template\target\schema2template-0.8.9-incubating-sources.jar
to /home/hudson/hudson/jobs/ODFToolkit-windows/modules/org.apache.odftoolkit$schema2template/builds/2013-04-28_11-03-35/archive/org.apache.odftoolkit/schema2template/0.8.9-incubating/schema2template-0.8.9-incubating-sources.jar
[JENKINS] Archiving F:\hudson\hudson-slave\workspace\ODFToolkit-windows\trunk\generator\schema2template\target\schema2template-0.8.9-incubating-javadoc.jar
to /home/hudson/hudson/jobs/ODFToolkit-windows/modules/org.apache.odftoolkit$schema2template/builds/2013-04-28_11-03-35/archive/org.apache.odftoolkit/schema2template/0.8.9-incubating/schema2template-0.8.9-incubating-javadoc.jar
[JENKINS] Archiving F:\hudson\hudson-slave\workspace\ODFToolkit-windows\trunk\validator\pom.xml
to /home/hudson/hudson/jobs/ODFToolkit-windows/modules/org.apache.odftoolkit$odfvalidator/builds/2013-04-28_11-03-35/archive/org.apache.odftoolkit/odfvalidator/1.1.6-incubating/odfvalidator-1.1.6-incubating.pom
[JENKINS] Archiving F:\hudson\hudson-slave\workspace\ODFToolkit-windows\trunk\validator\target\odfvalidator-1.1.6-incubating.war
to /home/hudson/hudson/jobs/ODFToolkit-windows/modules/org.apache.odftoolkit$odfvalidator/builds/2013-04-28_11-03-35/archive/org.apache.odftoolkit/odfvalidator/1.1.6-incubating/odfvalidator-1.1.6-incubating.war
[JENKINS] Archiving F:\hudson\hudson-slave\workspace\ODFToolkit-windows\trunk\xslt-runner\pom.xml
to /home/hudson/hudson/jobs/ODFToolkit-windows/modules/org.apache.odftoolkit$xslt-runner/builds/2013-04-28_11-03-35/archive/org.apache.odftoolkit/xslt-runner/1.2.2-incubating/xslt-runner-1.2.2-incubating.pom
[JENKINS] Archiving F:\hudson\hudson-slave\workspace\ODFToolkit-windows\trunk\xslt-runner\target\xslt-runner-1.2.2-incubating.jar
to /home/hudson/hudson/jobs/ODFToolkit-windows/modules/org.apache.odftoolkit$xslt-runner/builds/2013-04-28_11-03-35/archive/org.apache.odftoolkit/xslt-runner/1.2.2-incubating/xslt-runner-1.2.2-incubating.jar
[JENKINS] Archiving F:\hudson\hudson-slave\workspace\ODFToolkit-windows\trunk\generator\pom.xml
to /home/hudson/hudson/jobs/ODFToolkit-windows/modules/org.apache.odftoolkit$schema2template-pom/builds/2013-04-28_11-03-35/archive/org.apache.odftoolkit/schema2template-pom/0.8.9-incubating/schema2template-pom-0.8.9-incubating.pom
[JENKINS] Archiving <https://builds.apache.org/job/ODFToolkit-windows/ws/trunk\pom.xml>
to /home/hudson/hudson/jobs/ODFToolkit-windows/modules/org.apache.odftoolkit$odftoolkit/builds/2013-04-28_11-03-35/archive/org.apache.odftoolkit/odftoolkit/0.6-incubating/odftoolkit-0.6-incubating.pom
[JENKINS] Archiving F:\hudson\hudson-slave\workspace\ODFToolkit-windows\trunk\odfdom\pom.xml
to /home/hudson/hudson/jobs/ODFToolkit-windows/modules/org.apache.odftoolkit$odfdom-java/builds/2013-04-28_11-03-35/archive/org.apache.odftoolkit/odfdom-java/0.8.9-incubating/odfdom-java-0.8.9-incubating.pom
[JENKINS] Archiving F:\hudson\hudson-slave\workspace\ODFToolkit-windows\trunk\odfdom\target\odfdom-java-0.8.9-incubating.jar
to /home/hudson/hudson/jobs/ODFToolkit-windows/modules/org.apache.odftoolkit$odfdom-java/builds/2013-04-28_11-03-35/archive/org.apache.odftoolkit/odfdom-java/0.8.9-incubating/odfdom-java-0.8.9-incubating.jar
[JENKINS] Archiving F:\hudson\hudson-slave\workspace\ODFToolkit-windows\trunk\odfdom\target\odfdom-java-0.8.9-incubating-javadoc.jar
to /home/hudson/hudson/jobs/ODFToolkit-windows/modules/org.apache.odftoolkit$odfdom-java/builds/2013-04-28_11-03-35/archive/org.apache.odftoolkit/odfdom-java/0.8.9-incubating/odfdom-java-0.8.9-incubating-javadoc.jar
[JENKINS] Archiving F:\hudson\hudson-slave\workspace\ODFToolkit-windows\trunk\odfdom\target\odfdom-java-0.8.9-incubating-sources.jar
to /home/hudson/hudson/jobs/ODFToolkit-windows/modules/org.apache.odftoolkit$odfdom-java/builds/2013-04-28_11-03-35/archive/org.apache.odftoolkit/odfdom-java/0.8.9-incubating/odfdom-java-0.8.9-incubating-sources.jar
[JENKINS] Archiving F:\hudson\hudson-slave\workspace\ODFToolkit-windows\trunk\odfdom\target\odfdom-java-0.8.9-incubating-jar-with-dependencies.jar
to /home/hudson/hudson/jobs/ODFToolkit-windows/modules/org.apache.odftoolkit$odfdom-java/builds/2013-04-28_11-03-35/archive/org.apache.odftoolkit/odfdom-java/0.8.9-incubating/odfdom-java-0.8.9-incubating-jar-with-dependencies.jar
[JENKINS] Archiving F:\hudson\hudson-slave\workspace\ODFToolkit-windows\trunk\taglets\pom.xml
to /home/hudson/hudson/jobs/ODFToolkit-windows/modules/org.apache.odftoolkit$taglets/builds/2013-04-28_11-03-35/archive/org.apache.odftoolkit/taglets/0.8.9-incubating/taglets-0.8.9-incubating.pom
[JENKINS] Archiving F:\hudson\hudson-slave\workspace\ODFToolkit-windows\trunk\taglets\target\taglets-0.8.9-incubating.jar
to /home/hudson/hudson/jobs/ODFToolkit-windows/modules/org.apache.odftoolkit$taglets/builds/2013-04-28_11-03-35/archive/org.apache.odftoolkit/taglets/0.8.9-incubating/taglets-0.8.9-incubating.jar
[JENKINS] Archiving F:\hudson\hudson-slave\workspace\ODFToolkit-windows\trunk\taglets\target\taglets-0.8.9-incubating-javadoc.jar
to /home/hudson/hudson/jobs/ODFToolkit-windows/modules/org.apache.odftoolkit$taglets/builds/2013-04-28_11-03-35/archive/org.apache.odftoolkit/taglets/0.8.9-incubating/taglets-0.8.9-incubating-javadoc.jar
[JENKINS] Archiving F:\hudson\hudson-slave\workspace\ODFToolkit-windows\trunk\taglets\target\taglets-0.8.9-incubating-sources.jar
to /home/hudson/hudson/jobs/ODFToolkit-windows/modules/org.apache.odftoolkit$taglets/builds/2013-04-28_11-03-35/archive/org.apache.odftoolkit/taglets/0.8.9-incubating/taglets-0.8.9-incubating-sources.jar
[JENKINS] Archiving F:\hudson\hudson-slave\workspace\ODFToolkit-windows\trunk\taglets\target\taglets-0.8.9-incubating-jar-with-dependencies.jar
to /home/hudson/hudson/jobs/ODFToolkit-windows/modules/org.apache.odftoolkit$taglets/builds/2013-04-28_11-03-35/archive/org.apache.odftoolkit/taglets/0.8.9-incubating/taglets-0.8.9-incubating-jar-with-dependencies.jar
Waiting for Jenkins to finish collecting data
mavenExecutionResult exceptions not empty
message : Failed to execute goal org.codehaus.mojo:wagon-maven-plugin:1.0-beta-3:download-single
(download-odf-schema-v1.0) on project odfvalidator: Error handling resource
cause : Error handling resource
Stack trace : 
org.apache.maven.lifecycle.LifecycleExecutionException: Failed to execute goal org.codehaus.mojo:wagon-maven-plugin:1.0-beta-3:download-single
(download-odf-schema-v1.0) on project odfvalidator: Error handling resource
	at org.apache.maven.lifecycle.internal.MojoExecutor.execute(MojoExecutor.java:217)
	at org.apache.maven.lifecycle.internal.MojoExecutor.execute(MojoExecutor.java:153)
	at org.apache.maven.lifecycle.internal.MojoExecutor.execute(MojoExecutor.java:145)
	at org.apache.maven.lifecycle.internal.MojoExecutor.executeForkedExecutions(MojoExecutor.java:365)
	at org.apache.maven.lifecycle.internal.MojoExecutor.execute(MojoExecutor.java:199)
	at org.apache.maven.lifecycle.internal.MojoExecutor.execute(MojoExecutor.java:153)
	at org.apache.maven.lifecycle.internal.MojoExecutor.execute(MojoExecutor.java:145)
	at org.apache.maven.lifecycle.internal.LifecycleModuleBuilder.buildProject(LifecycleModuleBuilder.java:84)
	at org.apache.maven.lifecycle.internal.LifecycleModuleBuilder.buildProject(LifecycleModuleBuilder.java:59)
	at org.apache.maven.lifecycle.internal.LifecycleStarter.singleThreadedBuild(LifecycleStarter.java:183)
	at org.apache.maven.lifecycle.internal.LifecycleStarter.execute(LifecycleStarter.java:161)
	at org.apache.maven.DefaultMaven.doExecute(DefaultMaven.java:319)
	at org.apache.maven.DefaultMaven.execute(DefaultMaven.java:156)
	at org.jvnet.hudson.maven3.launcher.Maven3Launcher.main(Maven3Launcher.java:79)
	at sun.reflect.NativeMethodAccessorImpl.invoke0(Native Method)
	at sun.reflect.NativeMethodAccessorImpl.invoke(NativeMethodAccessorImpl.java:39)
	at sun.reflect.DelegatingMethodAccessorImpl.invoke(DelegatingMethodAccessorImpl.java:25)
	at java.lang.reflect.Method.invoke(Method.java:597)
	at org.codehaus.plexus.classworlds.launcher.Launcher.launchStandard(Launcher.java:329)
	at org.codehaus.plexus.classworlds.launcher.Launcher.launch(Launcher.java:239)
	at org.jvnet.hudson.maven3.agent.Maven3Main.launch(Maven3Main.java:158)
	at hudson.maven.Maven3Builder.call(Maven3Builder.java:100)
	at hudson.maven.Maven3Builder.call(Maven3Builder.java:66)
	at hudson.remoting.UserRequest.perform(UserRequest.java:118)
	at hudson.remoting.UserRequest.perform(UserRequest.java:48)
	at hudson.remoting.Request$2.run(Request.java:326)
	at hudson.remoting.InterceptingExecutorService$1.call(InterceptingExecutorService.java:72)
	at java.util.concurrent.FutureTask$Sync.innerRun(FutureTask.java:303)
	at java.util.concurrent.FutureTask.run(FutureTask.java:138)
	at java.util.concurrent.ThreadPoolExecutor$Worker.runTask(ThreadPoolExecutor.java:886)
	at java.util.concurrent.ThreadPoolExecutor$Worker.run(ThreadPoolExecutor.java:908)
	at java.lang.Thread.run(Thread.java:662)
Caused by: org.apache.maven.plugin.MojoExecutionException: Error handling resource
	at org.codehaus.mojo.wagon.AbstractSingleWagonMojo.execute(AbstractSingleWagonMojo.java:67)
	at org.apache.maven.plugin.DefaultBuildPluginManager.executeMojo(DefaultBuildPluginManager.java:107)
	at org.apache.maven.lifecycle.internal.MojoExecutor.execute(MojoExecutor.java:209)
	... 31 more
Caused by: org.apache.maven.wagon.TransferFailedException: Connection reset
	at org.apache.maven.wagon.shared.http.AbstractHttpClientWagon.fillInputData(AbstractHttpClientWagon.java:567)
	at org.apache.maven.wagon.StreamWagon.getInputStream(StreamWagon.java:116)
	at org.apache.maven.wagon.StreamWagon.getIfNewer(StreamWagon.java:88)
	at org.apache.maven.wagon.StreamWagon.get(StreamWagon.java:61)
	at org.codehaus.mojo.wagon.DownloadSingleMojo.execute(DownloadSingleMojo.java:75)
	at org.codehaus.mojo.wagon.AbstractSingleWagonMojo.execute(AbstractSingleWagonMojo.java:63)
	... 33 more
Caused by: java.net.SocketException: Connection reset
	at java.net.SocketInputStream.read(SocketInputStream.java:168)
	at com.sun.net.ssl.internal.ssl.InputRecord.readFully(InputRecord.java:293)
	at com.sun.net.ssl.internal.ssl.InputRecord.read(InputRecord.java:331)
	at com.sun.net.ssl.internal.ssl.SSLSocketImpl.readRecord(SSLSocketImpl.java:798)
	at com.sun.net.ssl.internal.ssl.SSLSocketImpl.performInitialHandshake(SSLSocketImpl.java:1138)
	at com.sun.net.ssl.internal.ssl.SSLSocketImpl.writeRecord(SSLSocketImpl.java:632)
	at com.sun.net.ssl.internal.ssl.AppOutputStream.write(AppOutputStream.java:59)
	at java.io.BufferedOutputStream.flushBuffer(BufferedOutputStream.java:65)
	at java.io.BufferedOutputStream.flush(BufferedOutputStream.java:123)
	at org.apache.commons.httpclient.HttpConnection.flushRequestOutputStream(HttpConnection.java:828)
	at org.apache.commons.httpclient.MultiThreadedHttpConnectionManager$HttpConnectionAdapter.flushRequestOutputStream(MultiThreadedHttpConnectionManager.java:1565)
	at org.apache.commons.httpclient.HttpMethodBase.writeRequest(HttpMethodBase.java:2116)
	at org.apache.commons.httpclient.HttpMethodBase.execute(HttpMethodBase.java:1096)
	at org.apache.commons.httpclient.HttpMethodDirector.executeWithRetry(HttpMethodDirector.java:398)
	at org.apache.commons.httpclient.HttpMethodDirector.executeMethod(HttpMethodDirector.java:171)
	at org.apache.commons.httpclient.HttpClient.executeMethod(HttpClient.java:397)
	at org.apache.commons.httpclient.HttpClient.executeMethod(HttpClient.java:323)
	at org.apache.maven.wagon.shared.http.AbstractHttpClientWagon.execute(AbstractHttpClientWagon.java:446)
	at org.apache.maven.wagon.shared.http.AbstractHttpClientWagon.fillInputData(AbstractHttpClientWagon.java:561)
	... 38 more
Sending e-mails to: odf-dev@incubator.apache.org
channel stopped

Mime
View raw message