incubator-odf-dev mailing list archives

Site index · List index
Message view « Date » · « Thread »
Top « Date » · « Thread »
From Apache Jenkins Server <jenk...@builds.apache.org>
Subject Build failed in Jenkins: ODFToolkit #61
Date Fri, 07 Dec 2012 15:17:26 GMT
See <https://builds.apache.org/job/ODFToolkit/61/changes>

Changes:

[svanteschubert] #ODFTOOLKIT-50# Add ODF 1.2 RDF metadata support to ODF Toolkit - developer:Tao
Lin, Svante Schubert, Dali Liu

------------------------------------------
[...truncated 3650 lines...]
[INFO] Copying 3 resources

[INFO] 
[INFO] --- maven-resources-plugin:2.5:testResources (default-testResources) @ schema2template-maven-plugin
---
mojoSucceeded org.apache.maven.plugins:maven-resources-plugin:2.5(default-testResources)
[INFO] No sources to compile
mojoStarted org.apache.maven.plugins:maven-compiler-plugin:2.0.2(default-testCompile)
[INFO] 
[INFO] --- maven-compiler-plugin:2.0.2:testCompile (default-testCompile) @ schema2template-maven-plugin
---
mojoSucceeded org.apache.maven.plugins:maven-compiler-plugin:2.0.2(default-testCompile)
[INFO] Surefire report directory: <https://builds.apache.org/job/ODFToolkit/ws/trunk/generator/schema2template-maven-plugin/target/surefire-reports>
mojoStarted org.apache.maven.plugins:maven-surefire-plugin:2.9(default-test)
-------------------------------------------------------
 T E S T S
-------------------------------------------------------

[INFO] 
[INFO] --- maven-surefire-plugin:2.9:test (default-test) @ schema2template-maven-plugin ---

Results :

Tests run: 0, Failures: 0, Errors: 0, Skipped: 0

mojoSucceeded org.apache.maven.plugins:maven-surefire-plugin:2.9(default-test)
[JENKINS] Recording test results
mojoStarted org.apache.maven.plugins:maven-jar-plugin:2.3.1(default-jar)
[INFO] 
[INFO] --- maven-jar-plugin:2.3.1:jar (default-jar) @ schema2template-maven-plugin ---
[INFO] Building jar: <https://builds.apache.org/job/ODFToolkit/ws/trunk/generator/schema2template-maven-plugin/target/schema2template-maven-plugin-0.8.9-incubating-SNAPSHOT.jar>
mojoSucceeded org.apache.maven.plugins:maven-jar-plugin:2.3.1(default-jar)
mojoStarted org.apache.maven.plugins:maven-plugin-plugin:2.6(default-addPluginArtifactMetadata)
[INFO] 
[INFO] --- maven-plugin-plugin:2.6:addPluginArtifactMetadata (default-addPluginArtifactMetadata)
@ schema2template-maven-plugin ---
mojoSucceeded org.apache.maven.plugins:maven-plugin-plugin:2.6(default-addPluginArtifactMetadata)
mojoStarted org.apache.maven.plugins:maven-site-plugin:3.0(attach-descriptor)
[INFO] 
[INFO] --- maven-site-plugin:3.0:attach-descriptor (attach-descriptor) @ schema2template-maven-plugin
---
mojoSucceeded org.apache.maven.plugins:maven-site-plugin:3.0(attach-descriptor)
Dec 7, 2012 3:15:50 PM hudson.maven.ExecutedMojo <init>
WARNING: Failed to getClass for org.apache.maven.plugin.source.SourceJarMojo
mojoStarted org.apache.maven.plugins:maven-source-plugin:2.1.2(attach-sources)
[INFO] 
[INFO] --- maven-source-plugin:2.1.2:jar (attach-sources) @ schema2template-maven-plugin ---
[INFO] META-INF already added, skipping
[INFO] META-INF/NOTICE already added, skipping
[INFO] META-INF/DEPENDENCIES already added, skipping
[INFO] META-INF/LICENSE already added, skipping
[INFO] Building jar: <https://builds.apache.org/job/ODFToolkit/ws/trunk/generator/schema2template-maven-plugin/target/schema2template-maven-plugin-0.8.9-incubating-SNAPSHOT-sources.jar>
[INFO] META-INF already added, skipping
[INFO] META-INF/NOTICE already added, skipping
[INFO] META-INF/DEPENDENCIES already added, skipping
[INFO] META-INF/LICENSE already added, skipping
mojoSucceeded org.apache.maven.plugins:maven-source-plugin:2.1.2(attach-sources)
mojoStarted org.apache.maven.plugins:maven-javadoc-plugin:2.7(attach-javadocs)
[INFO] 
[INFO] --- maven-javadoc-plugin:2.7:jar (attach-javadocs) @ schema2template-maven-plugin ---
[ERROR] Error fetching link: <https://builds.apache.org/job/ODFToolkit/ws/trunk/odfdom/target/apidocs/package-list.>
Ignored it.
[ERROR] Error fetching link: <https://builds.apache.org/job/ODFToolkit/ws/trunk/xslt-runner/target/apidocs/package-list.>
Ignored it.
[ERROR] Error fetching link: <https://builds.apache.org/job/ODFToolkit/ws/trunk/xslt-runner-task/target/apidocs/package-list.>
Ignored it.
[ERROR] Error fetching link: <https://builds.apache.org/job/ODFToolkit/ws/trunk/validator/target/apidocs/package-list.>
Ignored it.
[ERROR] Error fetching link: <https://builds.apache.org/job/ODFToolkit/ws/trunk/simple/target/apidocs/package-list.>
Ignored it.
[INFO] 
Loading source files for package org.odftoolkit.odfdom.schema2template_maven_plugin...
Constructing Javadoc information...
Standard Doclet version 1.5.0_22
Building tree for all the packages and classes...
Generating <https://builds.apache.org/job/ODFToolkit/ws/trunk/generator/schema2template-maven-plugin/target/apidocs/org/odftoolkit/odfdom/schema2template_maven_plugin//CodegenMojo.html...>
Generating <https://builds.apache.org/job/ODFToolkit/ws/trunk/generator/schema2template-maven-plugin/target/apidocs/org/odftoolkit/odfdom/schema2template_maven_plugin//package-frame.html...>
Generating <https://builds.apache.org/job/ODFToolkit/ws/trunk/generator/schema2template-maven-plugin/target/apidocs/org/odftoolkit/odfdom/schema2template_maven_plugin//package-summary.html...>
Generating <https://builds.apache.org/job/ODFToolkit/ws/trunk/generator/schema2template-maven-plugin/target/apidocs/org/odftoolkit/odfdom/schema2template_maven_plugin//package-tree.html...>
Generating <https://builds.apache.org/job/ODFToolkit/ws/trunk/generator/schema2template-maven-plugin/target/apidocs/constant-values.html...>
Generating <https://builds.apache.org/job/ODFToolkit/ws/trunk/generator/schema2template-maven-plugin/target/apidocs/org/odftoolkit/odfdom/schema2template_maven_plugin/class-use//CodegenMojo.html...>
Generating <https://builds.apache.org/job/ODFToolkit/ws/trunk/generator/schema2template-maven-plugin/target/apidocs/org/odftoolkit/odfdom/schema2template_maven_plugin//package-use.html...>
Building index for all the packages and classes...
Generating <https://builds.apache.org/job/ODFToolkit/ws/trunk/generator/schema2template-maven-plugin/target/apidocs/overview-tree.html...>
Generating <https://builds.apache.org/job/ODFToolkit/ws/trunk/generator/schema2template-maven-plugin/target/apidocs/index-files/index-1.html...>
Generating <https://builds.apache.org/job/ODFToolkit/ws/trunk/generator/schema2template-maven-plugin/target/apidocs/index-files/index-2.html...>
Generating <https://builds.apache.org/job/ODFToolkit/ws/trunk/generator/schema2template-maven-plugin/target/apidocs/index-files/index-3.html...>
Generating <https://builds.apache.org/job/ODFToolkit/ws/trunk/generator/schema2template-maven-plugin/target/apidocs/deprecated-list.html...>
Building index for all classes...
Generating <https://builds.apache.org/job/ODFToolkit/ws/trunk/generator/schema2template-maven-plugin/target/apidocs/allclasses-frame.html...>
Generating <https://builds.apache.org/job/ODFToolkit/ws/trunk/generator/schema2template-maven-plugin/target/apidocs/allclasses-noframe.html...>
Generating <https://builds.apache.org/job/ODFToolkit/ws/trunk/generator/schema2template-maven-plugin/target/apidocs/index.html...>
Generating <https://builds.apache.org/job/ODFToolkit/ws/trunk/generator/schema2template-maven-plugin/target/apidocs/help-doc.html...>
Generating <https://builds.apache.org/job/ODFToolkit/ws/trunk/generator/schema2template-maven-plugin/target/apidocs/stylesheet.css...>
4 warnings
[WARNING] Javadoc Warnings
[WARNING] <https://builds.apache.org/job/ODFToolkit/ws/trunk/generator/schema2template-maven-plugin/src/main/java/org/odftoolkit/odfdom/schema2template_maven_plugin/CodegenMojo.java>:39:
warning - @goal is an unknown tag.
[WARNING] <https://builds.apache.org/job/ODFToolkit/ws/trunk/generator/schema2template-maven-plugin/src/main/java/org/odftoolkit/odfdom/schema2template_maven_plugin/CodegenMojo.java>:39:
warning - @phase is an unknown tag.
[WARNING] <https://builds.apache.org/job/ODFToolkit/ws/trunk/generator/schema2template-maven-plugin/src/main/java/org/odftoolkit/odfdom/schema2template_maven_plugin/CodegenMojo.java>:39:
warning - @description is an unknown tag.
[WARNING] <https://builds.apache.org/job/ODFToolkit/ws/trunk/generator/schema2template-maven-plugin/src/main/java/org/odftoolkit/odfdom/schema2template_maven_plugin/CodegenMojo.java>:39:
warning - @requiresDependencyResolution is an unknown tag.
[INFO] Building jar: <https://builds.apache.org/job/ODFToolkit/ws/trunk/generator/schema2template-maven-plugin/target/schema2template-maven-plugin-0.8.9-incubating-SNAPSHOT-javadoc.jar>
mojoSucceeded org.apache.maven.plugins:maven-javadoc-plugin:2.7(attach-javadocs)
[INFO] Exclude: CHANGES.txt
mojoStarted org.apache.rat:apache-rat-plugin:0.7(default)[INFO] Exclude: .gitignore

[INFO] 
[INFO] --- apache-rat-plugin:0.7:check (default) @ schema2template-maven-plugin ---
mojoSucceeded org.apache.rat:apache-rat-plugin:0.7(default)
[PMD] No report found for mojo check
mojoStarted org.apache.maven.plugins:maven-install-plugin:2.3.1(default-install)[INFO] Installing
<https://builds.apache.org/job/ODFToolkit/ws/trunk/generator/schema2template-maven-plugin/target/schema2template-maven-plugin-0.8.9-incubating-SNAPSHOT.jar>
to /home/jenkins/jenkins-slave/maven-repositories/1/org/apache/odftoolkit/schema2template-maven-plugin/0.8.9-incubating-SNAPSHOT/schema2template-maven-plugin-0.8.9-incubating-SNAPSHOT.jar

[INFO] 
[INFO] --- maven-install-plugin:2.3.1:install (default-install) @ schema2template-maven-plugin
---
[INFO] Installing <https://builds.apache.org/job/ODFToolkit/ws/trunk/generator/schema2template-maven-plugin/pom.xml>
to /home/jenkins/jenkins-slave/maven-repositories/1/org/apache/odftoolkit/schema2template-maven-plugin/0.8.9-incubating-SNAPSHOT/schema2template-maven-plugin-0.8.9-incubating-SNAPSHOT.pom
[INFO] Installing <https://builds.apache.org/job/ODFToolkit/ws/trunk/generator/schema2template-maven-plugin/target/schema2template-maven-plugin-0.8.9-incubating-SNAPSHOT-sources.jar>
to /home/jenkins/jenkins-slave/maven-repositories/1/org/apache/odftoolkit/schema2template-maven-plugin/0.8.9-incubating-SNAPSHOT/schema2template-maven-plugin-0.8.9-incubating-SNAPSHOT-sources.jar
[INFO] Installing <https://builds.apache.org/job/ODFToolkit/ws/trunk/generator/schema2template-maven-plugin/target/schema2template-maven-plugin-0.8.9-incubating-SNAPSHOT-javadoc.jar>
to /home/jenkins/jenkins-slave/maven-repositories/1/org/apache/odftoolkit/schema2template-maven-plugin/0.8.9-incubating-SNAPSHOT/schema2template-maven-plugin-0.8.9-incubating-SNAPSHOT-javadoc.jar
mojoSucceeded org.apache.maven.plugins:maven-install-plugin:2.3.1(default-install)
projectSucceeded org.apache.odftoolkit:schema2template-maven-plugin:0.8.9-incubating-SNAPSHOT
projectStarted org.apache.odftoolkit:odfdom-java:0.8.9-incubating-SNAPSHOT
[INFO]                                                                         
[INFO] ------------------------------------------------------------------------
[INFO] Building ODFDOM 0.8.9-incubating-SNAPSHOT
[INFO] ------------------------------------------------------------------------
[INFO] Deleting <https://builds.apache.org/job/ODFToolkit/ws/trunk/odfdom/target>
mojoStarted org.apache.maven.plugins:maven-clean-plugin:2.4.1(default-clean)
[INFO] 
[INFO] --- maven-clean-plugin:2.4.1:clean (default-clean) @ odfdom-java ---
mojoSucceeded org.apache.maven.plugins:maven-clean-plugin:2.4.1(default-clean)
[TASKS] Scanning folder '<https://builds.apache.org/job/ODFToolkit/ws/trunk/odfdom'>
for files matching the pattern '**/*.java' - excludes: 
[TASKS] Found 2175 files to scan for tasks
Found 502 open tasks.
[TASKS] Computing warning deltas based on reference build #60
mojoStarted org.apache.maven.plugins:maven-remote-resources-plugin:1.2.1(default)
[INFO] 
[INFO] --- maven-remote-resources-plugin:1.2.1:process (default) @ odfdom-java ---
mojoSucceeded org.apache.maven.plugins:maven-remote-resources-plugin:1.2.1(default)
mojoStarted org.apache.maven.plugins:maven-resources-plugin:2.5(default-resources)[debug]
execute contextualize
[INFO] Using 'UTF-8' encoding to copy filtered resources.
[INFO] Copying 7 resources
[INFO] Copying 3 resources

[INFO] 
[INFO] --- maven-resources-plugin:2.5:resources (default-resources) @ odfdom-java ---
mojoSucceeded org.apache.maven.plugins:maven-resources-plugin:2.5(default-resources)
mojoStarted org.apache.maven.plugins:maven-compiler-plugin:2.3.2(default-compile)
[INFO] 
[INFO] --- maven-compiler-plugin:2.3.2:compile (default-compile) @ odfdom-java ---
[INFO] Compiling 2104 source files to <https://builds.apache.org/job/ODFToolkit/ws/trunk/odfdom/target/classes>
[INFO] -------------------------------------------------------------
[ERROR] COMPILATION ERROR : 
[INFO] -------------------------------------------------------------
[ERROR] <https://builds.apache.org/job/ODFToolkit/ws/trunk/odfdom/src/main/java/org/odftoolkit/odfdom/pkg/OdfFileDom.java>:[61,-1]
cannot access com.hp.hpl.jena.rdf.model.Model
bad class file: /home/jenkins/jenkins-slave/maven-repositories/1/org/apache/jena/jena-core/2.7.4/jena-core-2.7.4.jar(com/hp/hpl/jena/rdf/model/Model.class)
class file has wrong version 50.0, should be 49.0
[INFO] 1 error
[INFO] -------------------------------------------------------------
mojoFailed org.apache.maven.plugins:maven-compiler-plugin:2.3.2(default-compile)
projectFailed org.apache.odftoolkit:odfdom-java:0.8.9-incubating-SNAPSHOT
sessionEnded
[INFO] ------------------------------------------------------------------------
[INFO] Reactor Summary:
[INFO] 
[INFO] Apache ODF Toolkit ................................ SUCCESS [35.660s]
[INFO] ODF Custom Javadoc Taglets ........................ SUCCESS [2:03.564s]
[INFO] XML Schema to Template Mapping Tool: Parent POM ... SUCCESS [2.931s]
[INFO] XML Schema to Template Mapping Tool: Library ...... SUCCESS [1:34.145s]
[INFO] XML Schema to Template Mapping Tool: Maven2 Plugin  SUCCESS [8.996s]
[INFO] ODFDOM ............................................ FAILURE [1:17.101s]
[INFO] ODF XSLT-Runner ................................... SKIPPED
[INFO] ODF XSLT-Runner Ant Task .......................... SKIPPED
[INFO] ODF Validator ..................................... SKIPPED
[INFO] Simple Java API for ODF (Simple ODF) .............. SKIPPED
[INFO] ------------------------------------------------------------------------
[INFO] BUILD FAILURE
[INFO] ------------------------------------------------------------------------
[INFO] Total time: 5:46.841s
[INFO] Finished at: Fri Dec 07 15:17:12 UTC 2012
[INFO] Final Memory: 40M/319M
[INFO] ------------------------------------------------------------------------
Projects to build: [MavenProject: org.apache.odftoolkit:odftoolkit:0.6-incubating-SNAPSHOT
@ <https://builds.apache.org/job/ODFToolkit/ws/trunk/pom.xml,> MavenProject: org.apache.odftoolkit:taglets:0.8.9-incubating-SNAPSHOT
@ <https://builds.apache.org/job/ODFToolkit/ws/trunk/taglets/pom.xml,> MavenProject:
org.apache.odftoolkit:schema2template-pom:0.8.9-incubating-SNAPSHOT @ <https://builds.apache.org/job/ODFToolkit/ws/trunk/generator/pom.xml,>
MavenProject: org.apache.odftoolkit:schema2template:0.8.9-incubating-SNAPSHOT @ <https://builds.apache.org/job/ODFToolkit/ws/trunk/generator/schema2template/pom.xml,>
MavenProject: org.apache.odftoolkit:schema2template-maven-plugin:0.8.9-incubating-SNAPSHOT
@ <https://builds.apache.org/job/ODFToolkit/ws/trunk/generator/schema2template-maven-plugin/pom.xml,>
MavenProject: org.apache.odftoolkit:odfdom-java:0.8.9-incubating-SNAPSHOT @ <https://builds.apache.org/job/ODFToolkit/ws/trunk/odfdom/pom.xml,>
MavenProject: org.apache.odftoolkit:xslt-runner:1.2.2-incubating-SNAPSHOT @ <https://builds.apache.org/job/ODFToolkit/ws/trunk/xslt-runner/pom.xml,>
MavenProject: org.apache.odftoolkit:xslt-runner-task:1.2.2-incubating-SNAPSHOT @ <https://builds.apache.org/job/ODFToolkit/ws/trunk/xslt-runner-task/pom.xml,>
MavenProject: org.apache.odftoolkit:odfvalidator:1.1.6-incubating-SNAPSHOT @ <https://builds.apache.org/job/ODFToolkit/ws/trunk/validator/pom.xml,>
MavenProject: org.apache.odftoolkit:simple-odf:0.8-incubating-SNAPSHOT @ <https://builds.apache.org/job/ODFToolkit/ws/trunk/simple/pom.xml]>
[JENKINS] Archiving <https://builds.apache.org/job/ODFToolkit/ws/trunk/xslt-runner-task/pom.xml>
to /home/hudson/hudson/jobs/ODFToolkit/modules/org.apache.odftoolkit$xslt-runner-task/builds/2012-12-07_15-11-01/archive/org.apache.odftoolkit/xslt-runner-task/1.2.2-incubating-SNAPSHOT/xslt-runner-task-1.2.2-incubating-SNAPSHOT.pom
[JENKINS] Archiving <https://builds.apache.org/job/ODFToolkit/ws/trunk/generator/schema2template/pom.xml>
to /home/hudson/hudson/jobs/ODFToolkit/modules/org.apache.odftoolkit$schema2template/builds/2012-12-07_15-11-01/archive/org.apache.odftoolkit/schema2template/0.8.9-incubating-SNAPSHOT/schema2template-0.8.9-incubating-SNAPSHOT.pom
[JENKINS] Archiving <https://builds.apache.org/job/ODFToolkit/ws/trunk/generator/schema2template/target/schema2template-0.8.9-incubating-SNAPSHOT.jar>
to /home/hudson/hudson/jobs/ODFToolkit/modules/org.apache.odftoolkit$schema2template/builds/2012-12-07_15-11-01/archive/org.apache.odftoolkit/schema2template/0.8.9-incubating-SNAPSHOT/schema2template-0.8.9-incubating-SNAPSHOT.jar
[JENKINS] Archiving <https://builds.apache.org/job/ODFToolkit/ws/trunk/generator/schema2template/target/schema2template-0.8.9-incubating-SNAPSHOT-sources.jar>
to /home/hudson/hudson/jobs/ODFToolkit/modules/org.apache.odftoolkit$schema2template/builds/2012-12-07_15-11-01/archive/org.apache.odftoolkit/schema2template/0.8.9-incubating-SNAPSHOT/schema2template-0.8.9-incubating-SNAPSHOT-sources.jar
[JENKINS] Archiving <https://builds.apache.org/job/ODFToolkit/ws/trunk/generator/schema2template/target/schema2template-0.8.9-incubating-SNAPSHOT-javadoc.jar>
to /home/hudson/hudson/jobs/ODFToolkit/modules/org.apache.odftoolkit$schema2template/builds/2012-12-07_15-11-01/archive/org.apache.odftoolkit/schema2template/0.8.9-incubating-SNAPSHOT/schema2template-0.8.9-incubating-SNAPSHOT-javadoc.jar
[JENKINS] Archiving <https://builds.apache.org/job/ODFToolkit/ws/trunk/simple/pom.xml>
to /home/hudson/hudson/jobs/ODFToolkit/modules/org.apache.odftoolkit$simple-odf/builds/2012-12-07_15-11-01/archive/org.apache.odftoolkit/simple-odf/0.8-incubating-SNAPSHOT/simple-odf-0.8-incubating-SNAPSHOT.pom
[JENKINS] Archiving <https://builds.apache.org/job/ODFToolkit/ws/trunk/generator/schema2template-maven-plugin/pom.xml>
to /home/hudson/hudson/jobs/ODFToolkit/modules/org.apache.odftoolkit$schema2template-maven-plugin/builds/2012-12-07_15-11-01/archive/org.apache.odftoolkit/schema2template-maven-plugin/0.8.9-incubating-SNAPSHOT/schema2template-maven-plugin-0.8.9-incubating-SNAPSHOT.pom
[JENKINS] Archiving <https://builds.apache.org/job/ODFToolkit/ws/trunk/generator/schema2template-maven-plugin/target/schema2template-maven-plugin-0.8.9-incubating-SNAPSHOT.jar>
to /home/hudson/hudson/jobs/ODFToolkit/modules/org.apache.odftoolkit$schema2template-maven-plugin/builds/2012-12-07_15-11-01/archive/org.apache.odftoolkit/schema2template-maven-plugin/0.8.9-incubating-SNAPSHOT/schema2template-maven-plugin-0.8.9-incubating-SNAPSHOT.jar
[JENKINS] Archiving <https://builds.apache.org/job/ODFToolkit/ws/trunk/generator/schema2template-maven-plugin/target/schema2template-maven-plugin-0.8.9-incubating-SNAPSHOT-sources.jar>
to /home/hudson/hudson/jobs/ODFToolkit/modules/org.apache.odftoolkit$schema2template-maven-plugin/builds/2012-12-07_15-11-01/archive/org.apache.odftoolkit/schema2template-maven-plugin/0.8.9-incubating-SNAPSHOT/schema2template-maven-plugin-0.8.9-incubating-SNAPSHOT-sources.jar
[JENKINS] Archiving <https://builds.apache.org/job/ODFToolkit/ws/trunk/generator/schema2template-maven-plugin/target/schema2template-maven-plugin-0.8.9-incubating-SNAPSHOT-javadoc.jar>
to /home/hudson/hudson/jobs/ODFToolkit/modules/org.apache.odftoolkit$schema2template-maven-plugin/builds/2012-12-07_15-11-01/archive/org.apache.odftoolkit/schema2template-maven-plugin/0.8.9-incubating-SNAPSHOT/schema2template-maven-plugin-0.8.9-incubating-SNAPSHOT-javadoc.jar
[JENKINS] Archiving <https://builds.apache.org/job/ODFToolkit/ws/trunk/pom.xml> to /home/hudson/hudson/jobs/ODFToolkit/modules/org.apache.odftoolkit$odftoolkit/builds/2012-12-07_15-11-01/archive/org.apache.odftoolkit/odftoolkit/0.6-incubating-SNAPSHOT/odftoolkit-0.6-incubating-SNAPSHOT.pom
[JENKINS] Archiving <https://builds.apache.org/job/ODFToolkit/ws/trunk/xslt-runner/pom.xml>
to /home/hudson/hudson/jobs/ODFToolkit/modules/org.apache.odftoolkit$xslt-runner/builds/2012-12-07_15-11-01/archive/org.apache.odftoolkit/xslt-runner/1.2.2-incubating-SNAPSHOT/xslt-runner-1.2.2-incubating-SNAPSHOT.pom
[JENKINS] Archiving <https://builds.apache.org/job/ODFToolkit/ws/trunk/odfdom/pom.xml>
to /home/hudson/hudson/jobs/ODFToolkit/modules/org.apache.odftoolkit$odfdom-java/builds/2012-12-07_15-11-01/archive/org.apache.odftoolkit/odfdom-java/0.8.9-incubating-SNAPSHOT/odfdom-java-0.8.9-incubating-SNAPSHOT.pom
[JENKINS] Archiving <https://builds.apache.org/job/ODFToolkit/ws/trunk/taglets/pom.xml>
to /home/hudson/hudson/jobs/ODFToolkit/modules/org.apache.odftoolkit$taglets/builds/2012-12-07_15-11-01/archive/org.apache.odftoolkit/taglets/0.8.9-incubating-SNAPSHOT/taglets-0.8.9-incubating-SNAPSHOT.pom
[JENKINS] Archiving <https://builds.apache.org/job/ODFToolkit/ws/trunk/taglets/target/taglets-0.8.9-incubating-SNAPSHOT.jar>
to /home/hudson/hudson/jobs/ODFToolkit/modules/org.apache.odftoolkit$taglets/builds/2012-12-07_15-11-01/archive/org.apache.odftoolkit/taglets/0.8.9-incubating-SNAPSHOT/taglets-0.8.9-incubating-SNAPSHOT.jar
[JENKINS] Archiving <https://builds.apache.org/job/ODFToolkit/ws/trunk/taglets/target/taglets-0.8.9-incubating-SNAPSHOT-javadoc.jar>
to /home/hudson/hudson/jobs/ODFToolkit/modules/org.apache.odftoolkit$taglets/builds/2012-12-07_15-11-01/archive/org.apache.odftoolkit/taglets/0.8.9-incubating-SNAPSHOT/taglets-0.8.9-incubating-SNAPSHOT-javadoc.jar
[JENKINS] Archiving <https://builds.apache.org/job/ODFToolkit/ws/trunk/taglets/target/taglets-0.8.9-incubating-SNAPSHOT-sources.jar>
to /home/hudson/hudson/jobs/ODFToolkit/modules/org.apache.odftoolkit$taglets/builds/2012-12-07_15-11-01/archive/org.apache.odftoolkit/taglets/0.8.9-incubating-SNAPSHOT/taglets-0.8.9-incubating-SNAPSHOT-sources.jar
[JENKINS] Archiving <https://builds.apache.org/job/ODFToolkit/ws/trunk/taglets/target/taglets-0.8.9-incubating-SNAPSHOT-jar-with-dependencies.jar>
to /home/hudson/hudson/jobs/ODFToolkit/modules/org.apache.odftoolkit$taglets/builds/2012-12-07_15-11-01/archive/org.apache.odftoolkit/taglets/0.8.9-incubating-SNAPSHOT/taglets-0.8.9-incubating-SNAPSHOT-jar-with-dependencies.jar
[JENKINS] Archiving <https://builds.apache.org/job/ODFToolkit/ws/trunk/validator/pom.xml>
to /home/hudson/hudson/jobs/ODFToolkit/modules/org.apache.odftoolkit$odfvalidator/builds/2012-12-07_15-11-01/archive/org.apache.odftoolkit/odfvalidator/1.1.6-incubating-SNAPSHOT/odfvalidator-1.1.6-incubating-SNAPSHOT.pom
[JENKINS] Archiving <https://builds.apache.org/job/ODFToolkit/ws/trunk/generator/pom.xml>
to /home/hudson/hudson/jobs/ODFToolkit/modules/org.apache.odftoolkit$schema2template-pom/builds/2012-12-07_15-11-01/archive/org.apache.odftoolkit/schema2template-pom/0.8.9-incubating-SNAPSHOT/schema2template-pom-0.8.9-incubating-SNAPSHOT.pom
Waiting for Jenkins to finish collecting data
mavenExecutionResult exceptions not empty
message : Failed to execute goal org.apache.maven.plugins:maven-compiler-plugin:2.3.2:compile
(default-compile) on project odfdom-java: Compilation failure
<https://builds.apache.org/job/ODFToolkit/ws/trunk/odfdom/src/main/java/org/odftoolkit/odfdom/pkg/OdfFileDom.java>:[61,-1]
cannot access com.hp.hpl.jena.rdf.model.Model
bad class file: /home/jenkins/jenkins-slave/maven-repositories/1/org/apache/jena/jena-core/2.7.4/jena-core-2.7.4.jar(com/hp/hpl/jena/rdf/model/Model.class)
class file has wrong version 50.0, should be 49.0

cause : Compilation failure
<https://builds.apache.org/job/ODFToolkit/ws/trunk/odfdom/src/main/java/org/odftoolkit/odfdom/pkg/OdfFileDom.java>:[61,-1]
cannot access com.hp.hpl.jena.rdf.model.Model
bad class file: /home/jenkins/jenkins-slave/maven-repositories/1/org/apache/jena/jena-core/2.7.4/jena-core-2.7.4.jar(com/hp/hpl/jena/rdf/model/Model.class)
class file has wrong version 50.0, should be 49.0

Stack trace : 
org.apache.maven.lifecycle.LifecycleExecutionException: Failed to execute goal org.apache.maven.plugins:maven-compiler-plugin:2.3.2:compile
(default-compile) on project odfdom-java: Compilation failure
<https://builds.apache.org/job/ODFToolkit/ws/trunk/odfdom/src/main/java/org/odftoolkit/odfdom/pkg/OdfFileDom.java>:[61,-1]
cannot access com.hp.hpl.jena.rdf.model.Model
bad class file: /home/jenkins/jenkins-slave/maven-repositories/1/org/apache/jena/jena-core/2.7.4/jena-core-2.7.4.jar(com/hp/hpl/jena/rdf/model/Model.class)
class file has wrong version 50.0, should be 49.0

	at org.apache.maven.lifecycle.internal.MojoExecutor.execute(MojoExecutor.java:213)
	at org.apache.maven.lifecycle.internal.MojoExecutor.execute(MojoExecutor.java:153)
	at org.apache.maven.lifecycle.internal.MojoExecutor.execute(MojoExecutor.java:145)
	at org.apache.maven.lifecycle.internal.LifecycleModuleBuilder.buildProject(LifecycleModuleBuilder.java:84)
	at org.apache.maven.lifecycle.internal.LifecycleModuleBuilder.buildProject(LifecycleModuleBuilder.java:59)
	at org.apache.maven.lifecycle.internal.LifecycleStarter.singleThreadedBuild(LifecycleStarter.java:183)
	at org.apache.maven.lifecycle.internal.LifecycleStarter.execute(LifecycleStarter.java:161)
	at org.apache.maven.DefaultMaven.doExecute(DefaultMaven.java:319)
	at org.apache.maven.DefaultMaven.execute(DefaultMaven.java:156)
	at org.jvnet.hudson.maven3.launcher.Maven3Launcher.main(Maven3Launcher.java:79)
	at sun.reflect.NativeMethodAccessorImpl.invoke0(Native Method)
	at sun.reflect.NativeMethodAccessorImpl.invoke(NativeMethodAccessorImpl.java:39)
	at sun.reflect.DelegatingMethodAccessorImpl.invoke(DelegatingMethodAccessorImpl.java:25)
	at java.lang.reflect.Method.invoke(Method.java:592)
	at org.codehaus.plexus.classworlds.launcher.Launcher.launchStandard(Launcher.java:329)
	at org.codehaus.plexus.classworlds.launcher.Launcher.launch(Launcher.java:239)
	at org.jvnet.hudson.maven3.agent.Maven3Main.launch(Maven3Main.java:158)
	at hudson.maven.Maven3Builder.call(Maven3Builder.java:98)
	at hudson.maven.Maven3Builder.call(Maven3Builder.java:64)
	at hudson.remoting.UserRequest.perform(UserRequest.java:118)
	at hudson.remoting.UserRequest.perform(UserRequest.java:48)
	at hudson.remoting.Request$2.run(Request.java:326)
	at hudson.remoting.InterceptingExecutorService$1.call(InterceptingExecutorService.java:72)
	at java.util.concurrent.FutureTask$Sync.innerRun(FutureTask.java:269)
	at java.util.concurrent.FutureTask.run(FutureTask.java:123)
	at java.util.concurrent.ThreadPoolExecutor$Worker.runTask(ThreadPoolExecutor.java:651)
	at java.util.concurrent.ThreadPoolExecutor$Worker.run(ThreadPoolExecutor.java:676)
	at java.lang.Thread.run(Thread.java:595)
Caused by: org.apache.maven.plugin.CompilationFailureException: Compilation failure
<https://builds.apache.org/job/ODFToolkit/ws/trunk/odfdom/src/main/java/org/odftoolkit/odfdom/pkg/OdfFileDom.java>:[61,-1]
cannot access com.hp.hpl.jena.rdf.model.Model
bad class file: /home/jenkins/jenkins-slave/maven-repositories/1/org/apache/jena/jena-core/2.7.4/jena-core-2.7.4.jar(com/hp/hpl/jena/rdf/model/Model.class)
class file has wrong version 50.0, should be 49.0

	at org.apache.maven.plugin.AbstractCompilerMojo.execute(AbstractCompilerMojo.java:656)
	at org.apache.maven.plugin.CompilerMojo.execute(CompilerMojo.java:128)
	at org.apache.maven.plugin.DefaultBuildPluginManager.executeMojo(DefaultBuildPluginManager.java:101)
	at org.apache.maven.lifecycle.internal.MojoExecutor.execute(MojoExecutor.java:209)
	... 27 more
Sending e-mails to: odf-dev@incubator.apache.org
channel stopped

Mime
View raw message