incubator-odf-dev mailing list archives

Site index · List index
Message view « Date » · « Thread »
Top « Date » · « Thread »
From Rob Weir <robw...@apache.org>
Subject Re: Build failed in Jenkins: ODFToolkit #15
Date Thu, 16 Feb 2012 17:02:45 GMT
Build failing on my machine as well:

[INFO] ------------------------------------------------------------------------
[INFO] BUILD FAILURE
[INFO] ------------------------------------------------------------------------
[INFO] Total time: 12:14.657s
[INFO] Finished at: Thu Feb 16 11:53:29 EST 2012
[INFO] Final Memory: 21M/46M
[INFO] ------------------------------------------------------------------------
[ERROR] Failed to execute goal org.apache.maven.plugins:maven-compiler-plugin:2.
0.2:compile (default-compile) on project schema2template-maven-plugin: Compilati
on failure
[ERROR] C:\Apache\odf\trunk\generator\schema2template-maven-plugin\src\main\java
\org\odftoolkit\odfdom\schema2template_maven_plugin\CodegenMojo.java:[145,23] ca
nnot find symbol
[ERROR] symbol  : constructor OdfHelper(java.lang.String,java.lang.String,java.l
ang.String,java.lang.String,java.lang.String,java.lang.String,java.lang.String,j
ava.lang.String)
[ERROR] location: class schema2template.example.odf.OdfHelper

Mime
View raw message