incubator-odf-dev mailing list archives

Site index · List index
Message view « Date » · « Thread »
Top « Date » · « Thread »
From Apache Jenkins Server <jenk...@builds.apache.org>
Subject Build failed in Jenkins: ODFToolkit #8
Date Fri, 23 Dec 2011 05:14:53 GMT
See <https://builds.apache.org/job/ODFToolkit/8/changes>

Changes:

[devinhan] fixed the "mvn clean" issue

------------------------------------------
[...truncated 6906 lines...]
[INFO] 
[INFO] --- maven-compiler-plugin:2.3.2:testCompile (default-testCompile) @ xslt-runner ---
[TASKS] Skipping maven reporter: there is already a result available.[INFO] Surefire report
directory: <https://builds.apache.org/job/ODFToolkit/ws/trunk/xslt-runner/target/surefire-reports>

-------------------------------------------------------
 T E S T S
-------------------------------------------------------

[INFO] 
[INFO] --- maven-surefire-plugin:2.9:test (default-test) @ xslt-runner ---

Results :

Tests run: 0, Failures: 0, Errors: 0, Skipped: 0

[TASKS] Skipping maven reporter: there is already a result available.
[JENKINS] Recording test results
[INFO] 
[INFO] --- maven-jar-plugin:2.3.1:jar (default-jar) @ xslt-runner ---
[INFO] Building jar: <https://builds.apache.org/job/ODFToolkit/ws/trunk/xslt-runner/target/xslt-runner-1.2.1-incubating.jar>
[TASKS] Skipping maven reporter: there is already a result available.
[INFO] 
[INFO] --- maven-site-plugin:3.0:attach-descriptor (attach-descriptor) @ xslt-runner ---
[TASKS] Skipping maven reporter: there is already a result available.[INFO] Exclude: manifest.mf
[INFO] Exclude: misc/odf-attribute-xref.ods
[INFO] Exclude: nbproject/**

[INFO] 
[INFO] --- apache-rat-plugin:0.7:check (default) @ xslt-runner ---
[PMD] Using set difference to compute new warnings
[PMD] Not changing build status, since no threshold has been exceeded
[TASKS] Skipping maven reporter: there is already a result available.[INFO] Installing <https://builds.apache.org/job/ODFToolkit/ws/trunk/xslt-runner/target/xslt-runner-1.2.1-incubating.jar>
to /home/hudson/.m2/repository/org/apache/odftoolkit/xslt-runner/1.2.1-incubating/xslt-runner-1.2.1-incubating.jar
[INFO] Installing <https://builds.apache.org/job/ODFToolkit/ws/trunk/xslt-runner/pom.xml>
to /home/hudson/.m2/repository/org/apache/odftoolkit/xslt-runner/1.2.1-incubating/xslt-runner-1.2.1-incubating.pom

[INFO] 
[INFO] --- maven-install-plugin:2.3.1:install (default-install) @ xslt-runner ---
[TASKS] Skipping maven reporter: there is already a result available.
[JENKINS] Archiving <https://builds.apache.org/job/ODFToolkit/ws/trunk/xslt-runner/pom.xml>
to /home/hudson/hudson/jobs/ODFToolkit/modules/org.apache.odftoolkit$xslt-runner/builds/2011-12-23_05-04-44/archive/org.apache.odftoolkit/xslt-runner/1.2.1-incubating/xslt-runner-1.2.1-incubating.pom
[JENKINS] Archiving <https://builds.apache.org/job/ODFToolkit/ws/trunk/xslt-runner/target/xslt-runner-1.2.1-incubating.jar>
to /home/hudson/hudson/jobs/ODFToolkit/modules/org.apache.odftoolkit$xslt-runner/builds/2011-12-23_05-04-44/archive/org.apache.odftoolkit/xslt-runner/1.2.1-incubating/xslt-runner-1.2.1-incubating.jar
[INFO] [INFO] Deleting <https://builds.apache.org/job/ODFToolkit/ws/trunk/xslt-runner-task/target>
                                                                        
[INFO] ------------------------------------------------------------------------
[INFO] Building ODF XSLT-Runner Ant Task 1.2.1-incubating
[INFO] ------------------------------------------------------------------------
[INFO] 
[INFO] --- maven-clean-plugin:2.4.1:clean (default-clean) @ xslt-runner-task ---
[TASKS] Scanning folder '<https://builds.apache.org/job/ODFToolkit/ws/trunk/xslt-runner-task/src/main/java'>
for tasks ... 
[TASKS] Found 0.
[TASKS] Skipping non-existent folder '<https://builds.apache.org/job/ODFToolkit/ws/trunk/xslt-runner-task/src/test/java'...>
[TASKS] Skipping non-existent folder '<https://builds.apache.org/job/ODFToolkit/ws/trunk/xslt-runner-task/src/main/resources'...>
[TASKS] Skipping non-existent folder '<https://builds.apache.org/job/ODFToolkit/ws/trunk/xslt-runner-task/src/test/resources'...>
[TASKS] Using set difference to compute new warnings
[TASKS] Not changing build status, since no threshold has been exceeded
[INFO] 
[INFO] --- maven-remote-resources-plugin:1.2.1:process (default) @ xslt-runner-task ---
[TASKS] Skipping maven reporter: there is already a result available.[debug] execute contextualize
[INFO] Using 'UTF-8' encoding to copy filtered resources.
[INFO] skip non existing resourceDirectory <https://builds.apache.org/job/ODFToolkit/ws/trunk/xslt-runner-task/src/main/resources>
[INFO] Copying 3 resources

[INFO] 
[INFO] --- maven-resources-plugin:2.5:resources (default-resources) @ xslt-runner-task ---
[TASKS] Skipping maven reporter: there is already a result available.[INFO] Compiling 2 source
files to <https://builds.apache.org/job/ODFToolkit/ws/trunk/xslt-runner-task/target/classes>

[INFO] 
[INFO] --- maven-compiler-plugin:2.3.2:compile (default-compile) @ xslt-runner-task ---
[TASKS] Skipping maven reporter: there is already a result available.
[debug] execute contextualize
[INFO] [INFO] Using 'UTF-8' encoding to copy filtered resources.
[INFO] skip non existing resourceDirectory <https://builds.apache.org/job/ODFToolkit/ws/trunk/xslt-runner-task/src/test/resources>
[INFO] Copying 3 resources

[INFO] --- maven-resources-plugin:2.5:testResources (default-testResources) @ xslt-runner-task
---
[TASKS] Skipping maven reporter: there is already a result available.[INFO] No sources to
compile

[INFO] 
[INFO] --- maven-compiler-plugin:2.3.2:testCompile (default-testCompile) @ xslt-runner-task
---
[TASKS] Skipping maven reporter: there is already a result available.[INFO] Surefire report
directory: <https://builds.apache.org/job/ODFToolkit/ws/trunk/xslt-runner-task/target/surefire-reports>

-------------------------------------------------------
 T E S T S
-------------------------------------------------------

[INFO] 
[INFO] --- maven-surefire-plugin:2.9:test (default-test) @ xslt-runner-task ---

Results :

Tests run: 0, Failures: 0, Errors: 0, Skipped: 0

[TASKS] Skipping maven reporter: there is already a result available.
[JENKINS] Recording test results
[INFO] 
[INFO] --- maven-jar-plugin:2.3.1:jar (default-jar) @ xslt-runner-task ---
[INFO] Building jar: <https://builds.apache.org/job/ODFToolkit/ws/trunk/xslt-runner-task/target/xslt-runner-task-1.2.1-incubating.jar>
[TASKS] Skipping maven reporter: there is already a result available.
[INFO] 
[INFO] --- maven-site-plugin:3.0:attach-descriptor (attach-descriptor) @ xslt-runner-task
---
[TASKS] Skipping maven reporter: there is already a result available.[INFO] Exclude: nbproject/**

[INFO] 
[INFO] --- apache-rat-plugin:0.7:check (default) @ xslt-runner-task ---
[PMD] Using set difference to compute new warnings
[PMD] Not changing build status, since no threshold has been exceeded
[TASKS] Skipping maven reporter: there is already a result available.[INFO] Installing <https://builds.apache.org/job/ODFToolkit/ws/trunk/xslt-runner-task/target/xslt-runner-task-1.2.1-incubating.jar>
to /home/hudson/.m2/repository/org/apache/odftoolkit/xslt-runner-task/1.2.1-incubating/xslt-runner-task-1.2.1-incubating.jar

[INFO] 
[INFO] --- maven-install-plugin:2.3.1:install (default-install) @ xslt-runner-task ---
[INFO] Installing <https://builds.apache.org/job/ODFToolkit/ws/trunk/xslt-runner-task/pom.xml>
to /home/hudson/.m2/repository/org/apache/odftoolkit/xslt-runner-task/1.2.1-incubating/xslt-runner-task-1.2.1-incubating.pom
[TASKS] Skipping maven reporter: there is already a result available.
[JENKINS] Archiving <https://builds.apache.org/job/ODFToolkit/ws/trunk/xslt-runner-task/pom.xml>
to /home/hudson/hudson/jobs/ODFToolkit/modules/org.apache.odftoolkit$xslt-runner-task/builds/2011-12-23_05-04-44/archive/org.apache.odftoolkit/xslt-runner-task/1.2.1-incubating/xslt-runner-task-1.2.1-incubating.pom
[JENKINS] Archiving <https://builds.apache.org/job/ODFToolkit/ws/trunk/xslt-runner-task/target/xslt-runner-task-1.2.1-incubating.jar>
to /home/hudson/hudson/jobs/ODFToolkit/modules/org.apache.odftoolkit$xslt-runner-task/builds/2011-12-23_05-04-44/archive/org.apache.odftoolkit/xslt-runner-task/1.2.1-incubating/xslt-runner-task-1.2.1-incubating.jar
[INFO]                                                                         Downloading:
http://repo1.maven.org/maven2/org/apache/odftoolkit/odfdom-java/0.8.8-incubating-rc2/odfdom-java-0.8.8-incubating-rc2.pom

[INFO] ------------------------------------------------------------------------
[INFO] Building ODF Validator 1.1.5-incubating
[INFO] ------------------------------------------------------------------------
[WARNING] The POM for org.apache.odftoolkit:odfdom-java:jar:0.8.8-incubating-rc2 is missing,
no dependency information available
[WARNING] The POM for org.iso_relax.verifier.jaxp.validation:isorelax-jaxp-bridge:jar:1.0
is invalid, transitive dependencies (if any) will not be available, enable debug logging for
more details
Downloading: http://repo1.maven.org/maven2/org/apache/odftoolkit/odfdom-java/0.8.8-incubating-rc2/odfdom-java-0.8.8-incubating-rc2.jar
[JENKINS] Archiving <https://builds.apache.org/job/ODFToolkit/ws/trunk/validator/pom.xml>
to /home/hudson/hudson/jobs/ODFToolkit/modules/org.apache.odftoolkit$odfvalidator/builds/2011-12-23_05-04-44/archive/org.apache.odftoolkit/odfvalidator/1.1.5-incubating/odfvalidator-1.1.5-incubating.pom
[INFO] ------------------------------------------------------------------------
[INFO] Reactor Summary:
[INFO] 
[INFO] Apache ODF Toolkit ................................ SUCCESS [24.344s]
[INFO] ODF Custom Javadoc Taglets ........................ SUCCESS [41.173s]
[INFO] XML Schema to Template Mapping Tool: Parent POM ... SUCCESS [2.870s]
[INFO] XML Schema to Template Mapping Tool: Library ...... SUCCESS [56.932s]
[INFO] XML Schema to Template Mapping Tool: Maven2 Plugin  SUCCESS [7.708s]
[INFO] ODFDOM ............................................ SUCCESS [4:20.277s]
[INFO] ODF XSLT-Runner ................................... SUCCESS [4.505s]
[INFO] ODF XSLT-Runner Ant Task .......................... SUCCESS [4.315s]
[INFO] ODF Validator ..................................... FAILURE [0.488s]
[INFO] Simple Java API for ODF (Simple ODF) .............. SKIPPED
[INFO] ------------------------------------------------------------------------
[INFO] BUILD FAILURE
[INFO] ------------------------------------------------------------------------
[INFO] Total time: 9:48.482s
[INFO] Finished at: Fri Dec 23 05:14:50 UTC 2011
[INFO] Final Memory: 42M/310M
[INFO] ------------------------------------------------------------------------
mavenExecutionResult exceptions not empty
message : Failed to execute goal on project odfvalidator: Could not resolve dependencies for
project org.apache.odftoolkit:odfvalidator:war:1.1.5-incubating: Could not find artifact org.apache.odftoolkit:odfdom-java:jar:0.8.8-incubating-rc2
in central (http://repo1.maven.org/maven2)
cause : Could not resolve dependencies for project org.apache.odftoolkit:odfvalidator:war:1.1.5-incubating:
Could not find artifact org.apache.odftoolkit:odfdom-java:jar:0.8.8-incubating-rc2 in central
(http://repo1.maven.org/maven2)
Stack trace : 
org.apache.maven.lifecycle.LifecycleExecutionException: Failed to execute goal on project
odfvalidator: Could not resolve dependencies for project org.apache.odftoolkit:odfvalidator:war:1.1.5-incubating:
Could not find artifact org.apache.odftoolkit:odfdom-java:jar:0.8.8-incubating-rc2 in central
(http://repo1.maven.org/maven2)
	at org.apache.maven.lifecycle.internal.LifecycleDependencyResolver.getDependencies(LifecycleDependencyResolver.java:196)
	at org.apache.maven.lifecycle.internal.LifecycleDependencyResolver.resolveProjectDependencies(LifecycleDependencyResolver.java:108)
	at org.apache.maven.lifecycle.internal.MojoExecutor.ensureDependenciesAreResolved(MojoExecutor.java:258)
	at org.apache.maven.lifecycle.internal.MojoExecutor.execute(MojoExecutor.java:201)
	at org.apache.maven.lifecycle.internal.MojoExecutor.execute(MojoExecutor.java:153)
	at org.apache.maven.lifecycle.internal.MojoExecutor.execute(MojoExecutor.java:145)
	at org.apache.maven.lifecycle.internal.LifecycleModuleBuilder.buildProject(LifecycleModuleBuilder.java:84)
	at org.apache.maven.lifecycle.internal.LifecycleModuleBuilder.buildProject(LifecycleModuleBuilder.java:59)
	at org.apache.maven.lifecycle.internal.LifecycleStarter.singleThreadedBuild(LifecycleStarter.java:183)
	at org.apache.maven.lifecycle.internal.LifecycleStarter.execute(LifecycleStarter.java:161)
	at org.apache.maven.DefaultMaven.doExecute(DefaultMaven.java:319)
	at org.apache.maven.DefaultMaven.execute(DefaultMaven.java:156)
	at org.jvnet.hudson.maven3.launcher.Maven3Launcher.main(Maven3Launcher.java:79)
	at sun.reflect.NativeMethodAccessorImpl.invoke0(Native Method)
	at sun.reflect.NativeMethodAccessorImpl.invoke(NativeMethodAccessorImpl.java:39)
	at sun.reflect.DelegatingMethodAccessorImpl.invoke(DelegatingMethodAccessorImpl.java:25)
	at java.lang.reflect.Method.invoke(Method.java:592)
	at org.codehaus.plexus.classworlds.launcher.Launcher.launchStandard(Launcher.java:329)
	at org.codehaus.plexus.classworlds.launcher.Launcher.launch(Launcher.java:239)
	at org.jvnet.hudson.maven3.agent.Maven3Main.launch(Maven3Main.java:158)
	at hudson.maven.Maven3Builder.call(Maven3Builder.java:122)
	at hudson.maven.Maven3Builder.call(Maven3Builder.java:74)
	at hudson.remoting.UserRequest.perform(UserRequest.java:118)
	at hudson.remoting.UserRequest.perform(UserRequest.java:48)
	at hudson.remoting.Request$2.run(Request.java:287)
	at java.util.concurrent.Executors$RunnableAdapter.call(Executors.java:417)
	at java.util.concurrent.FutureTask$Sync.innerRun(FutureTask.java:269)
	at java.util.concurrent.FutureTask.run(FutureTask.java:123)
	at java.util.concurrent.ThreadPoolExecutor$Worker.runTask(ThreadPoolExecutor.java:651)
	at java.util.concurrent.ThreadPoolExecutor$Worker.run(ThreadPoolExecutor.java:676)
	at java.lang.Thread.run(Thread.java:595)
Caused by: org.apache.maven.project.DependencyResolutionException: Could not resolve dependencies
for project org.apache.odftoolkit:odfvalidator:war:1.1.5-incubating: Could not find artifact
org.apache.odftoolkit:odfdom-java:jar:0.8.8-incubating-rc2 in central (http://repo1.maven.org/maven2)
	at org.apache.maven.project.DefaultProjectDependenciesResolver.resolve(DefaultProjectDependenciesResolver.java:170)
	at org.apache.maven.lifecycle.internal.LifecycleDependencyResolver.getDependencies(LifecycleDependencyResolver.java:171)
	... 30 more
Caused by: org.sonatype.aether.resolution.DependencyResolutionException: Could not find artifact
org.apache.odftoolkit:odfdom-java:jar:0.8.8-incubating-rc2 in central (http://repo1.maven.org/maven2)
	at org.sonatype.aether.impl.internal.DefaultRepositorySystem.resolveDependencies(DefaultRepositorySystem.java:412)
	at org.apache.maven.project.DefaultProjectDependenciesResolver.resolve(DefaultProjectDependenciesResolver.java:164)
	... 31 more
Caused by: org.sonatype.aether.resolution.ArtifactResolutionException: Could not find artifact
org.apache.odftoolkit:odfdom-java:jar:0.8.8-incubating-rc2 in central (http://repo1.maven.org/maven2)
	at org.sonatype.aether.impl.internal.DefaultArtifactResolver.resolve(DefaultArtifactResolver.java:541)
	at org.sonatype.aether.impl.internal.DefaultArtifactResolver.resolveArtifacts(DefaultArtifactResolver.java:220)
	at org.sonatype.aether.impl.internal.DefaultRepositorySystem.resolveDependencies(DefaultRepositorySystem.java:395)
	... 32 more
Caused by: org.sonatype.aether.transfer.ArtifactNotFoundException: Could not find artifact
org.apache.odftoolkit:odfdom-java:jar:0.8.8-incubating-rc2 in central (http://repo1.maven.org/maven2)
	at org.sonatype.aether.connector.wagon.WagonRepositoryConnector$4.wrap(WagonRepositoryConnector.java:945)
	at org.sonatype.aether.connector.wagon.WagonRepositoryConnector$4.wrap(WagonRepositoryConnector.java:940)
	at org.sonatype.aether.connector.wagon.WagonRepositoryConnector$GetTask.flush(WagonRepositoryConnector.java:695)
	at org.sonatype.aether.connector.wagon.WagonRepositoryConnector$GetTask.flush(WagonRepositoryConnector.java:689)
	at org.sonatype.aether.connector.wagon.WagonRepositoryConnector.get(WagonRepositoryConnector.java:445)
	at org.sonatype.aether.impl.internal.DefaultArtifactResolver.resolve(DefaultArtifactResolver.java:460)
	... 34 more
[PMD] Aggregating results of Apache ODF Toolkit
[PMD] Using set difference to compute new warnings
[PMD] Not changing build status, since no threshold has been exceeded
[PMD] Aggregating results of ODF Custom Javadoc Taglets
[PMD] Using set difference to compute new warnings
[PMD] Not changing build status, since no threshold has been exceeded
[PMD] Aggregating results of XML Schema to Template Mapping Tool: Parent POM
[PMD] Using set difference to compute new warnings
[PMD] Not changing build status, since no threshold has been exceeded
[PMD] Aggregating results of XML Schema to Template Mapping Tool: Library
[PMD] Using set difference to compute new warnings
[PMD] Not changing build status, since no threshold has been exceeded
[PMD] Aggregating results of XML Schema to Template Mapping Tool: Maven2 Plugin
[PMD] Using set difference to compute new warnings
[PMD] Not changing build status, since no threshold has been exceeded
[PMD] Aggregating results of ODFDOM
[PMD] Using set difference to compute new warnings
[PMD] Not changing build status, since no threshold has been exceeded
[PMD] Aggregating results of ODF XSLT-Runner
[PMD] Using set difference to compute new warnings
[PMD] Not changing build status, since no threshold has been exceeded
[PMD] Aggregating results of ODF XSLT-Runner Ant Task
[PMD] Using set difference to compute new warnings
[PMD] Not changing build status, since no threshold has been exceeded
[TASKS] Aggregating results of Apache ODF Toolkit
[TASKS] Using set difference to compute new warnings
[TASKS] Not changing build status, since no threshold has been exceeded
[TASKS] Aggregating results of ODF Custom Javadoc Taglets
[TASKS] Using set difference to compute new warnings
[TASKS] Not changing build status, since no threshold has been exceeded
[TASKS] Aggregating results of XML Schema to Template Mapping Tool: Parent POM
[TASKS] Using set difference to compute new warnings
[TASKS] Not changing build status, since no threshold has been exceeded
[TASKS] Aggregating results of XML Schema to Template Mapping Tool: Library
[TASKS] Using set difference to compute new warnings
[TASKS] Not changing build status, since no threshold has been exceeded
[TASKS] Aggregating results of XML Schema to Template Mapping Tool: Maven2 Plugin
[TASKS] Using set difference to compute new warnings
[TASKS] Not changing build status, since no threshold has been exceeded
[TASKS] Aggregating results of ODFDOM
[TASKS] Using set difference to compute new warnings
[TASKS] Not changing build status, since no threshold has been exceeded
[TASKS] Aggregating results of ODF XSLT-Runner
[TASKS] Using set difference to compute new warnings
[TASKS] Not changing build status, since no threshold has been exceeded
[TASKS] Aggregating results of ODF XSLT-Runner Ant Task
[TASKS] Using set difference to compute new warnings
[TASKS] Not changing build status, since no threshold has been exceeded
Sending e-mails to: odf-dev@incubator.apache.org
Sending e-mails to: odf-dev@incubator.apache.org
channel stopped


Mime
View raw message