incubator-npanday-users mailing list archives

Site index · List index
Message view « Date » · « Thread »
Top « Date » · « Thread »
From Eric Kolotyluk <eric.koloty...@gmail.com>
Subject When will 1.5 Be Released
Date Wed, 30 Jul 2014 18:14:09 GMT
I had my NPanday project working a few months ago back in March/April, 
but when I tried building my project recently it failed. It 1.5 likely 
to be released any time soon? I don't really have the energy to do 
another round of troubleshooting on the SNAPSHOT when I have not changed 
anything in months.

Cheers, Eric

D:\Users\Eric\Software\Project\Repositories\csharp-windows-elevate>mvn 
clean compile
[INFO] Scanning for projects...
[INFO] 
------------------------------------------------------------------------
[INFO] Reactor Build Order:
[INFO]
[INFO] csharp-windows-elevate
[INFO] elevate-exe
[INFO] elevate-mklink-exe
[INFO]
[INFO] 
------------------------------------------------------------------------
[INFO] Building csharp-windows-elevate 0.0.24-SNAPSHOT
[INFO] 
------------------------------------------------------------------------
[INFO]
[INFO] --- maven-clean-plugin:2.5:clean (default-clean) @ 
csharp-windows-elevate ---
[INFO]
[INFO] --- maven-enforcer-plugin:1.0:enforce (enforce-maven) @ 
csharp-windows-elevate ---
[INFO]
[INFO] 
------------------------------------------------------------------------
[INFO] Building elevate-exe 0.0.24-SNAPSHOT
[INFO] 
------------------------------------------------------------------------
[INFO]
[INFO] --- maven-clean-plugin:2.5:clean (default-clean) @ elevate ---
[INFO]
[INFO] --- maven-compile-plugin:1.5.0-incubating-SNAPSHOT:initialize 
(default-initialize) @ elevate ---
[INFO] NPANDAY-148-009: Took 12ms to resolve dependencies for 
net.kolotyluk.windows.elevate:elevate:dotnet-executable:0.0.24-SNAPSHOT 
with filter 
org.apache.maven.artifact.resolver.filter.AndArtifactFilter@62bfd79a
[INFO] 
------------------------------------------------------------------------
[INFO] Reactor Summary:
[INFO]
[INFO] csharp-windows-elevate ............................ SUCCESS [0.309s]
[INFO] elevate-exe ....................................... FAILURE [0.693s]
[INFO] elevate-mklink-exe ................................ SKIPPED
[INFO] 
------------------------------------------------------------------------
[INFO] BUILD FAILURE
[INFO] 
------------------------------------------------------------------------
[INFO] Total time: 2.772s
[INFO] Finished at: Wed Jul 30 10:53:29 PDT 2014
[INFO] Final Memory: 35M/1963M
[INFO] 
------------------------------------------------------------------------
[ERROR] Failed to execute goal 
org.apache.npanday.plugins:maven-compile-plugin:1.5.0-incubating-SNAPSHOT:initialize 
(default-initialize) on project elevate: Execution default-initialize of 
goal 
org.apache.npanday.plugins:maven-compile-plugin:1.5.0-incubating-SNAPSHOT:initialize 
f
ailed: An API incompatibility was encountered while executing 
org.apache.npanday.plugins:maven-compile-plugin:1.5.0-incubating-SNAPSHOT:initialize: 
java.lang.NoSuchMethodError: 
npanday.assembler.AssemblerContext.init(Lorg/apache/maven/project/MavenProject;)V
[ERROR] -----------------------------------------------------
[ERROR] realm = 
plugin>org.apache.npanday.plugins:maven-compile-plugin:1.5.0-incubating-SNAPSHOT
[ERROR] strategy = 
org.codehaus.plexus.classworlds.strategy.SelfFirstStrategy
[ERROR] urls[0] = 
file:/C:/Users/Eric/.m2/repository/org/apache/npanday/plugins/maven-compile-plugin/1.5.0-incubating-SNAPSHOT/maven-compile-plugin-1.5.0-incubating-SNAPSHOT.jar
[ERROR] urls[1] = 
file:/C:/Users/Eric/.m2/repository/org/apache/npanday/dotnet-registry/1.5.0-incubating-SNAPSHOT/dotnet-registry-1.5.0-incubating-SNAPSHOT.jar
[ERROR] urls[2] = 
file:/C:/Users/Eric/.m2/repository/org/codehaus/plexus/plexus-interpolation/1.11/plexus-interpolation-1.11.jar
[ERROR] urls[3] = 
file:/C:/Users/Eric/.m2/repository/net/sf/kxml/kxml2/2.1.8/kxml2-2.1.8.jar
[ERROR] urls[4] = 
file:/C:/Users/Eric/.m2/repository/xmlpull/xmlpull/1.1.3.4a/xmlpull-1.1.3.4a.jar
[ERROR] urls[5] = 
file:/C:/Users/Eric/.m2/repository/org/reflections/reflections/0.9.5/reflections-0.9.5.jar
[ERROR] urls[6] = 
file:/C:/Users/Eric/.m2/repository/javassist/javassist/3.12.1.GA/javassist-3.12.1.GA.jar
[ERROR] urls[7] = 
file:/C:/Users/Eric/.m2/repository/org/slf4j/slf4j-api/1.5.11/slf4j-api-1.5.11.jar
[ERROR] urls[8] = 
file:/C:/Users/Eric/.m2/repository/dom4j/dom4j/1.6.1/dom4j-1.6.1.jar
[ERROR] urls[9] = 
file:/C:/Users/Eric/.m2/repository/xml-apis/xml-apis/1.0.b2/xml-apis-1.0.b2.jar
[ERROR] urls[10] = 
file:/C:/Users/Eric/.m2/repository/org/codehaus/gmaven/gmaven-mojo/1.2/gmaven-mojo-1.2.jar
[ERROR] urls[11] = 
file:/C:/Users/Eric/.m2/repository/org/codehaus/gmaven/runtime/gmaven-runtime-api/1.2/gmaven-runtime-api-1.2.jar
[ERROR] urls[12] = 
file:/C:/Users/Eric/.m2/repository/org/codehaus/gmaven/feature/gmaven-feature-api/1.2/gmaven-feature-api-1.2.jar
[ERROR] urls[13] = 
file:/C:/Users/Eric/.m2/repository/org/codehaus/gmaven/runtime/gmaven-runtime-1.5/1.2/gmaven-runtime-1.5-1.2.jar
[ERROR] urls[14] = 
file:/C:/Users/Eric/.m2/repository/org/codehaus/gmaven/feature/gmaven-feature-support/1.2/gmaven-feature-support-1.2.jar
[ERROR] urls[15] = 
file:/C:/Users/Eric/.m2/repository/org/codehaus/gmaven/runtime/gmaven-runtime-support/1.2/gmaven-runtime-support-1.2.jar
[ERROR] urls[16] = 
file:/C:/Users/Eric/.m2/repository/org/sonatype/gshell/gshell-io/2.0/gshell-io-2.0.jar
[ERROR] urls[17] = 
file:/C:/Users/Eric/.m2/repository/org/sonatype/gossip/gossip/1.0/gossip-1.0.jar
[ERROR] urls[18] = 
file:/C:/Users/Eric/.m2/repository/com/thoughtworks/qdox/qdox/1.8/qdox-1.8.jar
[ERROR] urls[19] = 
file:/C:/Users/Eric/.m2/repository/org/apache/ant/ant/1.7.1/ant-1.7.1.jar
[ERROR] urls[20] = 
file:/C:/Users/Eric/.m2/repository/org/apache/ant/ant-launcher/1.7.1/ant-launcher-1.7.1.jar
[ERROR] urls[21] = 
file:/C:/Users/Eric/.m2/repository/org/codehaus/groovy/groovy-all/1.7.0/groovy-all-1.7.0.jar
[ERROR] urls[22] = 
file:/C:/Users/Eric/.m2/repository/jline/jline/0.9.94/jline-0.9.94.jar
[ERROR] urls[23] = 
file:/C:/Users/Eric/.m2/repository/org/codehaus/plexus/plexus-utils/1.5.15/plexus-utils-1.5.15.jar
[ERROR] urls[24] = 
file:/C:/Users/Eric/.m2/repository/org/apache/npanday/dotnet-assembler/1.5.0-incubating-SNAPSHOT/dotnet-assembler-1.5.0-incubating-SNAPSHOT.jar
[ERROR] urls[25] = 
file:/C:/Users/Eric/.m2/repository/org/apache/npanday/dotnet-model-assembly-plugins/1.5.0-incubating-SNAPSHOT/dotnet-model-assembly-plugins-1.5.0-incubating-SNAPSHOT.jar
[ERROR] urls[26] = 
file:/C:/Users/Eric/.m2/repository/org/apache/npanday/dotnet-core/1.5.0-incubating-SNAPSHOT/dotnet-core-1.5.0-incubating-SNAPSHOT.jar
[ERROR] urls[27] = 
file:/C:/Users/Eric/.m2/repository/org/codehaus/plexus/plexus-archiver/2.0/plexus-archiver-2.0.jar
[ERROR] urls[28] = 
file:/C:/Users/Eric/.m2/repository/org/codehaus/plexus/plexus-io/2.0/plexus-io-2.0.jar
[ERROR] urls[29] = 
file:/C:/Users/Eric/.m2/repository/org/apache/npanday/dotnet-executable/1.5.0-incubating-SNAPSHOT/dotnet-executable-1.5.0-incubating-SNAPSHOT.jar
[ERROR] urls[30] = 
file:/C:/Users/Eric/.m2/repository/org/apache/npanday/dotnet-model-executable-plugins/1.5.0-incubating-SNAPSHOT/dotnet-model-executable-plugins-1.5.0-incubating-SNAPSHOT.jar
[ERROR] urls[31] = 
file:/C:/Users/Eric/.m2/repository/org/apache/npanday/dotnet-model-compiler-plugins/1.5.0-incubating-SNAPSHOT/dotnet-model-compiler-plugins-1.5.0-incubating-SNAPSHOT.jar
[ERROR] urls[32] = 
file:/C:/Users/Eric/.m2/repository/org/apache/npanday/dotnet-vendor/1.5.0-incubating-SNAPSHOT/dotnet-vendor-1.5.0-incubating-SNAPSHOT.jar
[ERROR] urls[33] = 
file:/C:/Users/Eric/.m2/repository/org/apache/npanday/dotnet-model-settings/1.5.0-incubating-SNAPSHOT/dotnet-model-settings-1.5.0-incubating-SNAPSHOT.jar
[ERROR] urls[34] = 
file:/C:/Users/Eric/.m2/repository/org/apache/commons/commons-exec/1.1/commons-exec-1.1.jar
[ERROR] urls[35] = 
file:/C:/Users/Eric/.m2/repository/org/apache/npanday/dotnet-plugin/1.5.0-incubating-SNAPSHOT/dotnet-plugin-1.5.0-incubating-SNAPSHOT.jar
[ERROR] urls[36] = 
file:/C:/Users/Eric/.m2/repository/org/apache/npanday/dotnet-model-configuration-appenders/1.5.0-incubating-SNAPSHOT/dotnet-model-configuration-appenders-1.5.0-incubating-SNAPSHOT.jar
[ERROR] urls[37] = 
file:/C:/Users/Eric/.m2/repository/org/slf4j/slf4j-jdk14/1.5.11/slf4j-jdk14-1.5.11.jar
[ERROR] urls[38] = 
file:/C:/Users/Eric/.m2/repository/org/slf4j/jcl-over-slf4j/1.5.6/jcl-over-slf4j-1.5.6.jar
[ERROR] urls[39] = 
file:/C:/Users/Eric/.m2/repository/org/apache/maven/reporting/maven-reporting-api/2.2.1/maven-reporting-api-2.2.1.jar
[ERROR] urls[40] = 
file:/C:/Users/Eric/.m2/repository/org/apache/maven/doxia/doxia-sink-api/1.1/doxia-sink-api-1.1.jar
[ERROR] urls[41] = 
file:/C:/Users/Eric/.m2/repository/org/apache/maven/doxia/doxia-logging-api/1.1/doxia-logging-api-1.1.jar
[ERROR] urls[42] = 
file:/C:/Users/Eric/.m2/repository/junit/junit/3.8.1/junit-3.8.1.jar
[ERROR] urls[43] = 
file:/C:/Users/Eric/.m2/repository/commons-cli/commons-cli/1.2/commons-cli-1.2.jar
[ERROR] urls[44] = 
file:/C:/Users/Eric/.m2/repository/org/codehaus/plexus/plexus-interactivity-api/1.0-alpha-4/plexus-interactivity-api-1.0-alpha-4.jar
[ERROR] urls[45] = 
file:/C:/Users/Eric/.m2/repository/backport-util-concurrent/backport-util-concurrent/3.1/backport-util-concurrent-3.1.jar
[ERROR] urls[46] = 
file:/C:/Users/Eric/.m2/repository/org/sonatype/plexus/plexus-sec-dispatcher/1.3/plexus-sec-dispatcher-1.3.jar
[ERROR] urls[47] = 
file:/C:/Users/Eric/.m2/repository/org/sonatype/plexus/plexus-cipher/1.4/plexus-cipher-1.4.jar
[ERROR] urls[48] = 
file:/C:/Users/Eric/.m2/repository/com/google/guava/guava/10.0.1/guava-10.0.1.jar
[ERROR] urls[49] = 
file:/C:/Users/Eric/.m2/repository/com/google/code/findbugs/jsr305/1.3.9/jsr305-1.3.9.jar
[ERROR] Number of foreign imports: 1
[ERROR] import: Entry[import  from realm 
ClassRealm[project>net.kolotyluk.windows.elevate:elevate:0.0.24-SNAPSHOT, parent: 
ClassRealm[maven.api, parent: null]]]
[ERROR]
[ERROR] -----------------------------------------------------
[ERROR] -> [Help 1]
[ERROR]
[ERROR] To see the full stack trace of the errors, re-run Maven with the 
-e switch.
[ERROR] Re-run Maven using the -X switch to enable full debug logging.
[ERROR]
[ERROR] For more information about the errors and possible solutions, 
please read the following articles:
[ERROR] [Help 1] 
http://cwiki.apache.org/confluence/display/MAVEN/PluginContainerException
[ERROR]
[ERROR] After correcting the problems, you can resume the build with the 
command
[ERROR]   mvn <goals> -rf :elevate
D:\Users\Eric\Software\Project\Repositories\csharp-windows-elevate>


Mime
View raw message