incubator-npanday-users mailing list archives

Site index · List index
Message view « Date » · « Thread »
Top « Date » · « Thread »
From Eric Kolotyluk <eric.koloty...@gmail.com>
Subject Tired of wagon
Date Fri, 23 Sep 2011 22:00:36 GMT
OK, I do not understand why this is failing. Why do I keep seeing wagon: 
when it should be looking in my Nexus respository?

There seems to be a problem resolving 
net.sf.jni4net:jni4net.n:dotnet-library:0.8.5.1 and 
com.kodak.intersystem.dotnet:intersystem-jni4net:dotnet-library:0.0.2-SNAPSHOT

but those artifacts are in my local repository, they are also in my 
Nexus repository, and if I look in 
P:\Intersystem\main\platform.NET\intersystem-service\target I can see 
both intersystem-jni4net.dll & jni4net.n.dll

I am really confused as to what is happening. Is it a configuration 
problem, or an NPanday bug?

Cheers, Eric

P:\Intersystem\main\platform.NET\intersystem-service>mvn -X compile
Apache Maven 3.0.3 (r1075438; 2011-02-28 09:31:09-0800)
Maven home: P:\Tools\Windows\x86\Apache\Maven 3.0.3
Java version: 1.6.0_20, vendor: Sun Microsystems Inc.
Java home: C:\Program Files\Java\jdk1.6.0_20\jre
Default locale: en_CA, platform encoding: Cp1252
OS name: "windows 7", version: "6.1", arch: "amd64", family: "windows"
[INFO] Error stacktraces are turned on.
[DEBUG] Reading global settings from P:\Tools\Windows\x86\Apache\Maven 
3.0.3\conf\settings.xml
[DEBUG] Reading user settings from C:\Users\10069959\.m2\settings.xml
[DEBUG] Using local repository at C:\Users\10069959\.m2\repository
[DEBUG] Using manager EnhancedLocalRepositoryManager with priority 10 
for C:\Users\10069959\.m2\repository
[INFO] Scanning for projects...
[DEBUG] Skipped remote update check for 
com:kodak:0.0.1-SNAPSHOT/maven-metadata.xml, locally built metadata 
up-to-date.
[DEBUG] 
org.apache.npanday.plugins:maven-compile-plugin:jar:1.4.0-incubating:
[DEBUG]    org.apache.maven:maven-artifact:jar:2.0.9:compile
[DEBUG]    org.apache.npanday:dotnet-registry:jar:1.4.0-incubating:compile
[DEBUG]       org.apache.maven:maven-project:jar:2.0.9:compile
[DEBUG]          org.apache.maven:maven-plugin-registry:jar:2.0.9:compile
[DEBUG]       net.sf.kxml:kxml2:jar:2.1.8:compile
[DEBUG]       xmlpull:xmlpull:jar:1.1.3.4a:compile
[DEBUG]       org.openrdf:openrdf-repository-api:jar:2.0-beta5:compile
[DEBUG]          org.openrdf:openrdf-query:jar:2.0-beta5:compile
[DEBUG]          org.openrdf:openrdf-sail-api:jar:2.0-beta5:compile
[DEBUG]          org.openrdf:openrdf-queryresultio-api:jar:2.0-beta5:compile
[DEBUG]          org.openrdf:openrdf-rio-api:jar:2.0-beta5:compile
[DEBUG]          info.aduna:aduna-xml:jar:1.2:compile
[DEBUG]          info.aduna:aduna-lang:jar:1.3:compile
[DEBUG]          org.slf4j:slf4j-api:jar:1.5.11:compile (version managed 
from 1.3.0)
[DEBUG]       org.openrdf:openrdf-repository-sail:jar:2.0-beta5:compile
[DEBUG]          org.openrdf:openrdf-queryparser-api:jar:2.0-beta5:compile
[DEBUG]          
org.openrdf:openrdf-queryalgebra-model:jar:2.0-beta5:compile
[DEBUG]       org.openrdf:openrdf-sail-memory:jar:2.0-beta5:compile
[DEBUG]          
org.openrdf:openrdf-queryalgebra-evaluation:jar:2.0-beta5:compile
[DEBUG]          info.aduna:aduna-concurrent:jar:1.2:compile
[DEBUG]          info.aduna:aduna-io:jar:1.2:compile
[DEBUG]    org.codehaus.gmaven:gmaven-mojo:jar:1.2:compile
[DEBUG]       org.codehaus.gmaven.runtime:gmaven-runtime-api:jar:1.2:compile
[DEBUG]          
org.codehaus.gmaven.feature:gmaven-feature-api:jar:1.2:compile
[DEBUG]       org.codehaus.gmaven.runtime:gmaven-runtime-1.5:jar:1.2:compile
[DEBUG]          
org.codehaus.gmaven.feature:gmaven-feature-support:jar:1.2:compile
[DEBUG]          
org.codehaus.gmaven.runtime:gmaven-runtime-support:jar:1.2:compile
[DEBUG]             org.sonatype.gshell:gshell-io:jar:2.0:compile
[DEBUG]                org.sonatype.gossip:gossip:jar:1.0:compile
[DEBUG]             com.thoughtworks.qdox:qdox:jar:1.8:compile
[DEBUG]          org.apache.ant:ant:jar:1.7.1:compile
[DEBUG]             org.apache.ant:ant-launcher:jar:1.7.1:compile
[DEBUG]       org.apache.maven:maven-plugin-api:jar:2.0.9:compile 
(version managed from 2.0.10)
[DEBUG]    org.codehaus.groovy:groovy-all:jar:1.7.0:compile
[DEBUG]       jline:jline:jar:0.9.94:compile
[DEBUG]    org.codehaus.plexus:plexus-utils:jar:1.5.1:compile
[DEBUG]    org.apache.npanday:dotnet-assembler:jar:1.4.0-incubating:compile
[DEBUG]       
org.apache.npanday:dotnet-model-assembly-plugins:jar:1.4.0-incubating:compile
[DEBUG]       org.apache.npanday:dotnet-core:jar:1.4.0-incubating:compile
[DEBUG]          
org.codehaus.plexus:plexus-archiver:jar:1.0-alpha-9:compile (version 
managed from 1.0-alpha-10)
[DEBUG]             org.codehaus.plexus:plexus-io:jar:1.0-alpha-1:compile
[DEBUG]    
org.apache.npanday:dotnet-dao-project:jar:1.4.0-incubating:compile
[DEBUG]       org.openrdf:openrdf-model:jar:2.0-beta5:compile
[DEBUG]          info.aduna:aduna-collections:jar:1.2:compile
[DEBUG]       org.openrdf:openrdf-sail-nativerdf:jar:2.0-beta5:compile
[DEBUG]       org.openrdf:openrdf-sail-inferencer:jar:2.0-beta5:compile
[DEBUG]          org.openrdf:openrdf-queryparser-serql:jar:2.0-beta5:runtime
[DEBUG]       org.openrdf:openrdf-queryparser-sparql:jar:2.0-beta5:compile
[DEBUG]          info.aduna:aduna-net:jar:1.2:compile
[DEBUG]          info.aduna:aduna-text:jar:1.2:compile
[DEBUG]       org.openrdf:openrdf-rio-rdfxml:jar:2.0-beta5:compile
[DEBUG]       info.aduna:aduna-iteration:jar:1.2:compile
[DEBUG]       org.slf4j:slf4j-jdk14:jar:1.5.11:compile (version managed 
from 1.3.0)
[DEBUG]    org.apache.npanday:dotnet-executable:jar:1.4.0-incubating:compile
[DEBUG]       
org.apache.npanday:dotnet-model-executable-plugins:jar:1.4.0-incubating:compile
[DEBUG]       
org.apache.npanday:dotnet-model-compiler-plugins:jar:1.4.0-incubating:compile
[DEBUG]       org.apache.npanday:dotnet-vendor:jar:1.4.0-incubating:compile
[DEBUG]          
org.apache.npanday:dotnet-model-settings:jar:1.4.0-incubating:compile
[DEBUG]    org.apache.npanday:dotnet-artifact:jar:1.4.0-incubating:compile
[DEBUG]       
org.apache.npanday:dotnet-model-netdependency:jar:1.4.0-incubating:compile
[DEBUG]    org.apache.npanday:dotnet-plugin:jar:1.4.0-incubating:compile
[DEBUG]       
org.apache.npanday:dotnet-model-configuration-appenders:jar:1.4.0-incubating:compile
[DEBUG]    org.apache.maven:maven-core:jar:2.0.9:compile
[DEBUG]       org.apache.maven:maven-settings:jar:2.0.9:compile
[DEBUG]       
org.apache.maven:maven-plugin-parameter-documenter:jar:2.0.9:compile
[DEBUG]       
org.apache.maven.reporting:maven-reporting-api:jar:2.0.9:compile
[DEBUG]          
org.apache.maven.doxia:doxia-sink-api:jar:1.0-alpha-10:compile
[DEBUG]       org.apache.maven:maven-profile:jar:2.0.9:compile
[DEBUG]       org.apache.maven:maven-model:jar:2.0.9:compile
[DEBUG]       
org.codehaus.plexus:plexus-container-default:jar:1.0-alpha-32:compile 
(version managed from 1.0-alpha-9-stable-1)
[DEBUG]          
org.codehaus.plexus:plexus-component-api:jar:1.0-alpha-32:compile
[DEBUG]          
org.codehaus.plexus:plexus-classworlds:jar:1.2-alpha-10:compile
[DEBUG]          junit:junit:jar:3.8.1:compile
[DEBUG]       org.apache.maven:maven-repository-metadata:jar:2.0.9:compile
[DEBUG]       org.apache.maven:maven-error-diagnostics:jar:2.0.9:compile
[DEBUG]       commons-cli:commons-cli:jar:1.0:compile
[DEBUG]       org.apache.maven:maven-plugin-descriptor:jar:2.0.9:compile
[DEBUG]       
org.codehaus.plexus:plexus-interactivity-api:jar:1.0-alpha-4:compile
[DEBUG]       org.apache.maven:maven-artifact-manager:jar:2.0.9:compile
[DEBUG]       org.apache.maven:maven-monitor:jar:2.0.9:compile
[DEBUG]       classworlds:classworlds:jar:1.1:compile
[DEBUG] Created new class realm maven.api
[DEBUG] Importing foreign packages into class realm maven.api
[DEBUG]   Imported: org.apache.maven.wagon.events < plexus.core
[DEBUG]   Imported: org.sonatype.aether.transfer < plexus.core
[DEBUG]   Imported: org.apache.maven.exception < plexus.core
[DEBUG]   Imported: org.sonatype.aether.metadata < plexus.core
[DEBUG]   Imported: org.codehaus.plexus.util.xml.Xpp3Dom < plexus.core
[DEBUG]   Imported: org.sonatype.aether.collection < plexus.core
[DEBUG]   Imported: org.sonatype.aether.version < plexus.core
[DEBUG]   Imported: org.apache.maven.monitor < plexus.core
[DEBUG]   Imported: org.apache.maven.wagon.repository < plexus.core
[DEBUG]   Imported: org.apache.maven.repository < plexus.core
[DEBUG]   Imported: org.apache.maven.wagon.resource < plexus.core
[DEBUG]   Imported: org.codehaus.plexus.logging < plexus.core
[DEBUG]   Imported: org.apache.maven.profiles < plexus.core
[DEBUG]   Imported: org.sonatype.aether.repository < plexus.core
[DEBUG]   Imported: org.apache.maven.classrealm < plexus.core
[DEBUG]   Imported: org.apache.maven.execution < plexus.core
[DEBUG]   Imported: org.sonatype.aether.artifact < plexus.core
[DEBUG]   Imported: org.sonatype.aether.spi < plexus.core
[DEBUG]   Imported: org.apache.maven.reporting < plexus.core
[DEBUG]   Imported: org.apache.maven.usability < plexus.core
[DEBUG]   Imported: org.codehaus.plexus.container < plexus.core
[DEBUG]   Imported: org.codehaus.plexus.component < plexus.core
[DEBUG]   Imported: org.codehaus.plexus.util.xml.pull.XmlSerializer < 
plexus.core
[DEBUG]   Imported: org.apache.maven.wagon.authentication < plexus.core
[DEBUG]   Imported: org.apache.maven.lifecycle < plexus.core
[DEBUG]   Imported: org.codehaus.plexus.classworlds < plexus.core
[DEBUG]   Imported: org.sonatype.aether.graph < plexus.core
[DEBUG]   Imported: org.sonatype.aether.* < plexus.core
[DEBUG]   Imported: org.apache.maven.settings < plexus.core
[DEBUG]   Imported: org.codehaus.classworlds < plexus.core
[DEBUG]   Imported: org.sonatype.aether.impl < plexus.core
[DEBUG]   Imported: org.apache.maven.wagon.* < plexus.core
[DEBUG]   Imported: org.apache.maven.toolchain < plexus.core
[DEBUG]   Imported: org.sonatype.aether.deployment < plexus.core
[DEBUG]   Imported: org.apache.maven.wagon.observers < plexus.core
[DEBUG]   Imported: 
org.codehaus.plexus.util.xml.pull.XmlPullParserException < plexus.core
[DEBUG]   Imported: org.codehaus.plexus.util.xml.pull.XmlPullParser < 
plexus.core
[DEBUG]   Imported: org.apache.maven.configuration < plexus.core
[DEBUG]   Imported: org.apache.maven.cli < plexus.core
[DEBUG]   Imported: org.sonatype.aether.installation < plexus.core
[DEBUG]   Imported: org.codehaus.plexus.context < plexus.core
[DEBUG]   Imported: org.apache.maven.wagon.authorization < plexus.core
[DEBUG]   Imported: org.apache.maven.project < plexus.core
[DEBUG]   Imported: org.apache.maven.rtinfo < plexus.core
[DEBUG]   Imported: org.codehaus.plexus.lifecycle < plexus.core
[DEBUG]   Imported: org.codehaus.plexus.configuration < plexus.core
[DEBUG]   Imported: org.apache.maven.artifact < plexus.core
[DEBUG]   Imported: org.apache.maven.model < plexus.core
[DEBUG]   Imported: org.apache.maven.* < plexus.core
[DEBUG]   Imported: org.apache.maven.wagon.proxy < plexus.core
[DEBUG]   Imported: org.sonatype.aether.resolution < plexus.core
[DEBUG]   Imported: org.apache.maven.plugin < plexus.core
[DEBUG]   Imported: org.codehaus.plexus.* < plexus.core
[DEBUG]   Imported: org.codehaus.plexus.personality < plexus.core
[DEBUG] Populating class realm maven.api
[DEBUG] Created new class realm 
extension>org.apache.npanday.plugins:maven-compile-plugin:1.4.0-incubating
[DEBUG] Importing foreign packages into class realm 
extension>org.apache.npanday.plugins:maven-compile-plugin:1.4.0-incubating
[DEBUG]   Imported: < maven.api
[DEBUG] Populating class realm 
extension>org.apache.npanday.plugins:maven-compile-plugin:1.4.0-incubating
[DEBUG]   Included: 
org.apache.npanday.plugins:maven-compile-plugin:jar:1.4.0-incubating
[DEBUG]   Included: org.apache.npanday:dotnet-registry:jar:1.4.0-incubating
[DEBUG]   Included: net.sf.kxml:kxml2:jar:2.1.8
[DEBUG]   Included: xmlpull:xmlpull:jar:1.1.3.4a
[DEBUG]   Included: org.openrdf:openrdf-repository-api:jar:2.0-beta5
[DEBUG]   Included: org.openrdf:openrdf-query:jar:2.0-beta5
[DEBUG]   Included: org.openrdf:openrdf-sail-api:jar:2.0-beta5
[DEBUG]   Included: org.openrdf:openrdf-queryresultio-api:jar:2.0-beta5
[DEBUG]   Included: org.openrdf:openrdf-rio-api:jar:2.0-beta5
[DEBUG]   Included: info.aduna:aduna-xml:jar:1.2
[DEBUG]   Included: info.aduna:aduna-lang:jar:1.3
[DEBUG]   Included: org.slf4j:slf4j-api:jar:1.5.11
[DEBUG]   Included: org.openrdf:openrdf-repository-sail:jar:2.0-beta5
[DEBUG]   Included: org.openrdf:openrdf-queryparser-api:jar:2.0-beta5
[DEBUG]   Included: org.openrdf:openrdf-queryalgebra-model:jar:2.0-beta5
[DEBUG]   Included: org.openrdf:openrdf-sail-memory:jar:2.0-beta5
[DEBUG]   Included: 
org.openrdf:openrdf-queryalgebra-evaluation:jar:2.0-beta5
[DEBUG]   Included: info.aduna:aduna-concurrent:jar:1.2
[DEBUG]   Included: info.aduna:aduna-io:jar:1.2
[DEBUG]   Included: org.codehaus.gmaven:gmaven-mojo:jar:1.2
[DEBUG]   Included: org.codehaus.gmaven.runtime:gmaven-runtime-api:jar:1.2
[DEBUG]   Included: org.codehaus.gmaven.feature:gmaven-feature-api:jar:1.2
[DEBUG]   Included: org.codehaus.gmaven.runtime:gmaven-runtime-1.5:jar:1.2
[DEBUG]   Included: 
org.codehaus.gmaven.feature:gmaven-feature-support:jar:1.2
[DEBUG]   Included: 
org.codehaus.gmaven.runtime:gmaven-runtime-support:jar:1.2
[DEBUG]   Included: org.sonatype.gshell:gshell-io:jar:2.0
[DEBUG]   Included: org.sonatype.gossip:gossip:jar:1.0
[DEBUG]   Included: com.thoughtworks.qdox:qdox:jar:1.8
[DEBUG]   Included: org.apache.ant:ant:jar:1.7.1
[DEBUG]   Included: org.apache.ant:ant-launcher:jar:1.7.1
[DEBUG]   Included: org.codehaus.groovy:groovy-all:jar:1.7.0
[DEBUG]   Included: jline:jline:jar:0.9.94
[DEBUG]   Included: org.codehaus.plexus:plexus-utils:jar:1.5.1
[DEBUG]   Included: org.apache.npanday:dotnet-assembler:jar:1.4.0-incubating
[DEBUG]   Included: 
org.apache.npanday:dotnet-model-assembly-plugins:jar:1.4.0-incubating
[DEBUG]   Included: org.apache.npanday:dotnet-core:jar:1.4.0-incubating
[DEBUG]   Included: org.codehaus.plexus:plexus-archiver:jar:1.0-alpha-9
[DEBUG]   Included: org.codehaus.plexus:plexus-io:jar:1.0-alpha-1
[DEBUG]   Included: 
org.apache.npanday:dotnet-dao-project:jar:1.4.0-incubating
[DEBUG]   Included: org.openrdf:openrdf-model:jar:2.0-beta5
[DEBUG]   Included: info.aduna:aduna-collections:jar:1.2
[DEBUG]   Included: org.openrdf:openrdf-sail-nativerdf:jar:2.0-beta5
[DEBUG]   Included: org.openrdf:openrdf-sail-inferencer:jar:2.0-beta5
[DEBUG]   Included: org.openrdf:openrdf-queryparser-serql:jar:2.0-beta5
[DEBUG]   Included: org.openrdf:openrdf-queryparser-sparql:jar:2.0-beta5
[DEBUG]   Included: info.aduna:aduna-net:jar:1.2
[DEBUG]   Included: info.aduna:aduna-text:jar:1.2
[DEBUG]   Included: org.openrdf:openrdf-rio-rdfxml:jar:2.0-beta5
[DEBUG]   Included: info.aduna:aduna-iteration:jar:1.2
[DEBUG]   Included: org.slf4j:slf4j-jdk14:jar:1.5.11
[DEBUG]   Included: 
org.apache.npanday:dotnet-executable:jar:1.4.0-incubating
[DEBUG]   Included: 
org.apache.npanday:dotnet-model-executable-plugins:jar:1.4.0-incubating
[DEBUG]   Included: 
org.apache.npanday:dotnet-model-compiler-plugins:jar:1.4.0-incubating
[DEBUG]   Included: org.apache.npanday:dotnet-vendor:jar:1.4.0-incubating
[DEBUG]   Included: 
org.apache.npanday:dotnet-model-settings:jar:1.4.0-incubating
[DEBUG]   Included: org.apache.npanday:dotnet-artifact:jar:1.4.0-incubating
[DEBUG]   Included: 
org.apache.npanday:dotnet-model-netdependency:jar:1.4.0-incubating
[DEBUG]   Included: org.apache.npanday:dotnet-plugin:jar:1.4.0-incubating
[DEBUG]   Included: 
org.apache.npanday:dotnet-model-configuration-appenders:jar:1.4.0-incubating
[DEBUG]   Included: org.apache.maven.reporting:maven-reporting-api:jar:2.0.9
[DEBUG]   Included: org.apache.maven.doxia:doxia-sink-api:jar:1.0-alpha-10
[DEBUG]   Included: junit:junit:jar:3.8.1
[DEBUG]   Included: commons-cli:commons-cli:jar:1.0
[DEBUG]   Included: 
org.codehaus.plexus:plexus-interactivity-api:jar:1.0-alpha-4
[DEBUG] Extension realms for project 
com.kodak.intersystem.dotnet:intersystem-service:dotnet-executable:0.0.2-SNAPSHOT: 
[ClassRe
alm[extension>org.apache.npanday.plugins:maven-compile-plugin:1.4.0-incubating, 
parent: sun.misc.Launcher$AppClassLoader@12360be
0]]
[DEBUG] Created new class realm 
project>com.kodak.intersystem.dotnet:intersystem-service:0.0.2-SNAPSHOT
[DEBUG] Populating class realm 
project>com.kodak.intersystem.dotnet:intersystem-service:0.0.2-SNAPSHOT
[DEBUG] Looking up lifecyle mappings for packaging dotnet-executable 
from ClassRealm[project>com.kodak.intersystem.dotnet:inters
ystem-service:0.0.2-SNAPSHOT, parent: ClassRealm[maven.api, parent: null]]
[DEBUG] === REACTOR BUILD PLAN 
================================================
[DEBUG] Project: 
com.kodak.intersystem.dotnet:intersystem-service:dotnet-executable:0.0.2-SNAPSHOT
[DEBUG] Tasks:   [compile]
[DEBUG] Style:   Regular
[DEBUG] 
=======================================================================
[INFO]
[INFO] 
------------------------------------------------------------------------
[INFO] Building Intersystem Windows Service 0.0.2-SNAPSHOT
[INFO] 
------------------------------------------------------------------------
[DEBUG] Resolving plugin version for 
org.apache.maven.plugins:maven-install-plugin
[DEBUG] Could not find metadata 
org.apache.maven.plugins:maven-install-plugin/maven-metadata.xml in 
local (C:\Users\10069959\.m2
\repository)
[DEBUG] Skipped remote update check for 
org.apache.maven.plugins:maven-install-plugin/maven-metadata.xml, 
locally cached metadat
a up-to-date.
[DEBUG] Resolved plugin version for 
org.apache.maven.plugins:maven-install-plugin to 2.3.1 from repository 
nexus (http://nexus:8
081/nexus/content/groups/public, releases+snapshots)
[DEBUG] Resolving plugin version for 
org.apache.maven.plugins:maven-deploy-plugin
[DEBUG] Could not find metadata 
org.apache.maven.plugins:maven-deploy-plugin/maven-metadata.xml in local 
(C:\Users\10069959\.m2\
repository)
[DEBUG] Skipped remote update check for 
org.apache.maven.plugins:maven-deploy-plugin/maven-metadata.xml, locally 
cached metadata
  up-to-date.
[DEBUG] Resolved plugin version for 
org.apache.maven.plugins:maven-deploy-plugin to 2.7 from repository 
nexus (http://nexus:8081
/nexus/content/groups/public, releases+snapshots)
[DEBUG] Lifecycle default -> [validate, initialize, generate-sources, 
process-sources, generate-resources, process-resources, co
mpile, process-classes, generate-test-sources, process-test-sources, 
generate-test-resources, process-test-resources, test-compi
le, process-test-classes, test, prepare-package, package, 
pre-integration-test, integration-test, post-integration-test, verify,
  install, deploy]
[DEBUG] Lifecycle clean -> [pre-clean, clean, post-clean]
[DEBUG] Lifecycle site -> [pre-site, site, post-site, site-deploy]
[DEBUG] Lifecycle default -> [validate, initialize, generate-sources, 
process-sources, generate-resources, process-resources, co
mpile, process-classes, generate-test-sources, process-test-sources, 
generate-test-resources, process-test-resources, test-compi
le, process-test-classes, test, prepare-package, package, 
pre-integration-test, integration-test, post-integration-test, verify,
  install, deploy]
[DEBUG] Lifecycle clean -> [pre-clean, clean, post-clean]
[DEBUG] Lifecycle site -> [pre-site, site, post-site, site-deploy]
[DEBUG] Lifecycle default -> [validate, initialize, generate-sources, 
process-sources, generate-resources, process-resources, co
mpile, process-classes, generate-test-sources, process-test-sources, 
generate-test-resources, process-test-resources, test-compi
le, process-test-classes, test, prepare-package, package, 
pre-integration-test, integration-test, post-integration-test, verify,
  install, deploy]
[DEBUG] Lifecycle clean -> [pre-clean, clean, post-clean]
[DEBUG] Lifecycle site -> [pre-site, site, post-site, site-deploy]
[DEBUG] Lifecycle default -> [validate, initialize, generate-sources, 
process-sources, generate-resources, process-resources, co
mpile, process-classes, generate-test-sources, process-test-sources, 
generate-test-resources, process-test-resources, test-compi
le, process-test-classes, test, prepare-package, package, 
pre-integration-test, integration-test, post-integration-test, verify,
  install, deploy]
[DEBUG] Lifecycle clean -> [pre-clean, clean, post-clean]
[DEBUG] Lifecycle site -> [pre-site, site, post-site, site-deploy]
[DEBUG] Lifecycle default -> [validate, initialize, generate-sources, 
process-sources, generate-resources, process-resources, co
mpile, process-classes, generate-test-sources, process-test-sources, 
generate-test-resources, process-test-resources, test-compi
le, process-test-classes, test, prepare-package, package, 
pre-integration-test, integration-test, post-integration-test, verify,
  install, deploy]
[DEBUG] Lifecycle clean -> [pre-clean, clean, post-clean]
[DEBUG] Lifecycle site -> [pre-site, site, post-site, site-deploy]
[DEBUG] Lifecycle default -> [validate, initialize, generate-sources, 
process-sources, generate-resources, process-resources, co
mpile, process-classes, generate-test-sources, process-test-sources, 
generate-test-resources, process-test-resources, test-compi
le, process-test-classes, test, prepare-package, package, 
pre-integration-test, integration-test, post-integration-test, verify,
  install, deploy]
[DEBUG] Lifecycle clean -> [pre-clean, clean, post-clean]
[DEBUG] Lifecycle site -> [pre-site, site, post-site, site-deploy]
[DEBUG] === PROJECT BUILD PLAN 
================================================
[DEBUG] Project:       
com.kodak.intersystem.dotnet:intersystem-service:0.0.2-SNAPSHOT
[DEBUG] Dependencies (collect): []
[DEBUG] Dependencies (resolve): []
[DEBUG] Repositories (dependencies): [nexus 
(http://nexus:8081/nexus/content/groups/public, releases+snapshots)]
[DEBUG] Repositories (plugins)     : [nexus 
(http://nexus:8081/nexus/content/groups/public, releases+snapshots)]
[DEBUG] 
-----------------------------------------------------------------------
[DEBUG] Goal:          
org.apache.npanday.plugins:maven-compile-plugin:1.4.0-incubating:initialize 
(default-initialize)
[DEBUG] Style:         Regular
[DEBUG] Configuration: <?xml version="1.0" encoding="UTF-8"?>
<configuration>
<localRepository>${settings.localRepository}</localRepository>
<project>${project}</project>
</configuration>
[DEBUG] 
-----------------------------------------------------------------------
[DEBUG] Goal:          
org.apache.npanday.plugins:maven-resolver-plugin:1.4.0-incubating:resolve (default-resolve)
[DEBUG] Style:         Regular
[DEBUG] Configuration: <?xml version="1.0" encoding="UTF-8"?>
<configuration>
<frameworkVersion>${frameworkVersion}</frameworkVersion>
<isGacInstall default-value="false">${installGacDependencies}</isGacInstall>
<localRepository>${settings.localRepository}</localRepository>
<pomFile>${project.file}</pomFile>
<project>${project}</project>
<skip default-value="false"/>
<vendor>${vendor}</vendor>
</configuration>
[DEBUG] 
-----------------------------------------------------------------------
[DEBUG] Goal:          
org.apache.npanday.plugins:NPanday.Plugin.Settings.JavaBinding:1.4.0-incubating:generate-settings 
(defaul
t-generate-settings)
[DEBUG] Style:         Regular
[DEBUG] Configuration: <?xml version="1.0" encoding="UTF-8"?>
<configuration>
<frameworkVersion>${frameworkVersion}</frameworkVersion>
<localRepository>${settings.localRepository}</localRepository>
<npandaySettingsPath>${npanday.settings}</npandaySettingsPath>
<project>${project}</project>
<settingsPath 
default-value="${user.home}/.m2">${npanday.settings}</settingsPath>
<skip default-value="false"/>
<vendor>${vendor}</vendor>
<vendorVersion>${vendorVersion}</vendorVersion>
</configuration>
[DEBUG] 
-----------------------------------------------------------------------
[DEBUG] Goal:          
org.apache.npanday.plugins:maven-compile-plugin:1.4.0-incubating:generate-assembly-info 
(default-generate
-assembly-info)
[DEBUG] Style:         Regular
[DEBUG] Configuration: <?xml version="1.0" encoding="UTF-8"?>
<configuration>
<frameworkVersion>4.0</frameworkVersion>
<keycontainer>${keycontainer}</keycontainer>
<keyfile>${keyfile}</keyfile>
<language default-value="C_SHARP">${language}</language>
<project>${project}</project>
<sourceDirectory 
default-value="${project.build.sourceDirectory}">${sourceDirectory}</sourceDirectory>
<vendor>${vendor}</vendor>
<vendorVersion>${vendorVersion}</vendorVersion>
</configuration>
[DEBUG] 
-----------------------------------------------------------------------
[DEBUG] Goal:          
org.apache.npanday.plugins:maven-compile-plugin:1.4.0-incubating:process-sources 
(default-process-sources
)
[DEBUG] Style:         Regular
[DEBUG] Configuration: <?xml version="1.0" encoding="UTF-8"?>
<configuration>
<excludes>${excludes}</excludes>
<includes>${includes}</includes>
<language default-value="C_SHARP">${language}</language>
<outputDirectory 
default-value="${project.build.directory}/build-sources">${outputDirectory}</outputDirectory>
<sourceDirectory 
default-value="${project.build.sourceDirectory}">${sourceDirectory}</sourceDirectory>
</configuration>
[DEBUG] 
-----------------------------------------------------------------------
[DEBUG] Goal:          
org.apache.npanday.plugins:maven-compile-plugin:1.4.0-incubating:process-test-sources 
(default-process-te
st-sources)
[DEBUG] Style:         Regular
[DEBUG] Configuration: <?xml version="1.0" encoding="UTF-8"?>
<configuration>
<includes>${includes}</includes>
<language default-value="C_SHARP">${language}</language>
<outputDirectory 
default-value="${project.build.directory}/build-test-sources">${outputDirectory}</outputDirectory>
<sourceDirectory 
default-value="${project.build.testSourceDirectory}">${sourceDirectory}</sourceDirectory>
<testExcludes>${testExcludes}</testExcludes>
</configuration>
[DEBUG] 
-----------------------------------------------------------------------
[DEBUG] Goal:          
org.apache.npanday.plugins:maven-resgen-plugin:1.4.0-incubating:copy-resources 
(default-copy-resources)
[DEBUG] Style:         Regular
[DEBUG] Configuration: <?xml version="1.0" encoding="UTF-8"?>
<configuration>
<project>${project}</project>
</configuration>
[DEBUG] 
-----------------------------------------------------------------------
[DEBUG] Goal:          
org.apache.npanday.plugins:maven-resgen-plugin:1.4.0-incubating:generate 
(default-generate)
[DEBUG] Style:         Regular
[DEBUG] Configuration: <?xml version="1.0" encoding="UTF-8"?>
<configuration>
<frameworkVersion>${frameworkVersion}</frameworkVersion>
<localRepository>${settings.localRepository}</localRepository>
<netHome>${netHome}</netHome>
<project>${project}</project>
<vendor>${vendor}</vendor>
<vendorVersion>${vendorVersion}</vendorVersion>
</configuration>
[DEBUG] 
-----------------------------------------------------------------------
[DEBUG] Goal:          
org.apache.npanday.plugins:maven-resgen-plugin:1.4.0-incubating:generate-existing-resx-to-resource 
(defau
lt-generate-existing-resx-to-resource)
[DEBUG] Style:         Regular
[DEBUG] Configuration: <?xml version="1.0" encoding="UTF-8"?>
<configuration>
<embeddedResources>${embeddedResources}</embeddedResources>
<frameworkVersion>${frameworkVersion}</frameworkVersion>
<netHome>${netHome}</netHome>
<project>${project}</project>
<vendor>${vendor}</vendor>
</configuration>
[DEBUG] 
-----------------------------------------------------------------------
[DEBUG] Goal:          
org.apache.npanday.plugins:maven-compile-plugin:1.4.0-incubating:compile 
(default-compile)
[DEBUG] Style:         Regular
[DEBUG] Configuration: <?xml version="1.0" encoding="UTF-8"?>
<configuration>
<addModules>${addmodules}</addModules>
<baseAddress>${baseaddress}</baseAddress>
<bugReport>${bugreport}</bugReport>
<codePage>${codepage}</codePage>
<define>${define}</define>
<embeddedResources>${embeddedResources}</embeddedResources>
<errorReport>${errorreport}</errorReport>
<frameworkVersion>4.0</frameworkVersion>
<imports>${imports}</imports>
<includeSources>
<includeSource>Properties\AssemblyInfo.cs</includeSource>
<includeSource>src\main\csharp\com\kodak\intersystem\service\IntersystemService.cs</includeSource>
<includeSource>src\main\csharp\com\kodak\intersystem\service\IntersystemService.designer.cs</includeSource>
<includeSource>src\main\csharp\com\kodak\intersystem\service\IntersystemServiceInstaller.cs</includeSource>
<includeSource>src\main\csharp\com\kodak\intersystem\service\IntersystemServiceInstaller.designer.cs</includeSource>
<includeSource>src\main\csharp\com\kodak\intersystem\service\Program.cs</includeSource>
<includeSource>obj\x64\Debug\intersystem-service_Content.g.cs</includeSource>
<includeSource>obj\x64\Debug\intersystem-service_Content.g.i.cs</includeSource>${includeSources}</includeSources>
<isDebug default-value="false">${isDebug}</isDebug>
<keycontainer>${keycontainer}</keycontainer>
<keyfile>${keyfile}</keyfile>
<language default-value="C_SHARP">${language}</language>
<libs>${libs}</libs>
<linkResource>${linkresource}</linkResource>
<localRepository>${settings.localRepository}</localRepository>
<main>com.kodak.intersystem.service.Program</main>
<moduleAssemblyName>${moduleassemblyname}</moduleAssemblyName>
<nowarn>${nowarn}</nowarn>
<optionCompare>${optioncompare}</optionCompare>
<optionStrict>${optionstrict}</optionStrict>
<outputDirectory>${outputDirectory}</outputDirectory>
<parameters>${parameters}</parameters>
<pdb>${pdb}</pdb>
<platform>${platform} default-value =</platform>
<pomFile>${project.file}</pomFile>
<profile default-value="FULL">${profile}</profile>
<profileAssemblyPath>${profileAssemblyPath}</profileAssemblyPath>
<project>${project}</project>
<resource>${resource}</resource>
<rootNamespace>${rootNamespace}</rootNamespace>
<settingsPath 
default-value="${user.home}/.m2">${npanday.settings}</settingsPath>
<skipTestCompile default-value="false">${skipTestCompile}</skipTestCompile>
<testAddModules>${testAddmodules}</testAddModules>
<testBaseAddress>${testBaseaddress}</testBaseAddress>
<testBugReport>${testBugreport}</testBugReport>
<testCodePage>${testCodepage}</testCodePage>
<testDefine>${testDefine}</testDefine>
<testErrorReport>${testErrorreport}</testErrorReport>
<testFrameworkVersion>${testFrameworkVersion}</testFrameworkVersion>
<testImports>${testImports}</testImports>
<testIncludeSources>${testIncludeSources}</testIncludeSources>
<testKeycontainer>${testKeycontainer}</testKeycontainer>
<testKeyfile>${testKeyfile}</testKeyfile>
<testLanguage>${testLanguage}</testLanguage>
<testLibs>${testLibs}</testLibs>
<testLinkResource>${testLinkresource}</testLinkResource>
<testMain>${testMain}</testMain>
<testModuleAssemblyName>${testModuleassemblyname}</testModuleAssemblyName>
<testNowarn>${testNowarn}</testNowarn>
<testOptionCompare>${testOptioncompare}</testOptionCompare>
<testOptionStrict>${testOptionstrict}</testOptionStrict>
<testParameters>${testParameters}</testParameters>
<testPdb>${testPdb}</testPdb>
<testPlatform>${testPlatform} default-value =</testPlatform>
<testProfile default-value="FULL">${testProfile}</testProfile>
<testProfileAssemblyPath>${testProfileAssemblyPath}</testProfileAssemblyPath>
<testResource>${testResource}</testResource>
<testRootNamespace 
default-value="${project.groupId}.${project.artifactId}">${testRootNamespace}</testRootNamespace>
<testVendor>${testVendor}</testVendor>
<testVendorVersion>${testVendorVersion}</testVendorVersion>
<testWarn>${testWarn}</testWarn>
<testWin32Icon>${testWin32icon}</testWin32Icon>
<testWin32Res>${testWin32res}</testWin32Res>
<vendor>${vendor}</vendor>
<vendorVersion>${vendorVersion}</vendorVersion>
<warn>${warn}</warn>
<win32Icon>${win32icon}</win32Icon>
<win32Res>${win32res}</win32Res>
</configuration>
[DEBUG] 
=======================================================================
[INFO]
[INFO] --- maven-compile-plugin:1.4.0-incubating:initialize 
(default-initialize) @ intersystem-service ---
[DEBUG] 
org.apache.npanday.plugins:maven-compile-plugin:jar:1.4.0-incubating:
[DEBUG]    org.apache.maven:maven-artifact:jar:2.0.9:compile
[DEBUG]    org.apache.npanday:dotnet-registry:jar:1.4.0-incubating:compile
[DEBUG]       org.apache.maven:maven-project:jar:2.0.9:compile
[DEBUG]          org.apache.maven:maven-plugin-registry:jar:2.0.9:compile
[DEBUG]       net.sf.kxml:kxml2:jar:2.1.8:compile
[DEBUG]       xmlpull:xmlpull:jar:1.1.3.4a:compile
[DEBUG]       org.openrdf:openrdf-repository-api:jar:2.0-beta5:compile
[DEBUG]          org.openrdf:openrdf-query:jar:2.0-beta5:compile
[DEBUG]          org.openrdf:openrdf-sail-api:jar:2.0-beta5:compile
[DEBUG]          org.openrdf:openrdf-queryresultio-api:jar:2.0-beta5:compile
[DEBUG]          org.openrdf:openrdf-rio-api:jar:2.0-beta5:compile
[DEBUG]          info.aduna:aduna-xml:jar:1.2:compile
[DEBUG]          info.aduna:aduna-lang:jar:1.3:compile
[DEBUG]          org.slf4j:slf4j-api:jar:1.5.11:compile (version managed 
from 1.3.0)
[DEBUG]       org.openrdf:openrdf-repository-sail:jar:2.0-beta5:compile
[DEBUG]          org.openrdf:openrdf-queryparser-api:jar:2.0-beta5:compile
[DEBUG]          
org.openrdf:openrdf-queryalgebra-model:jar:2.0-beta5:compile
[DEBUG]       org.openrdf:openrdf-sail-memory:jar:2.0-beta5:compile
[DEBUG]          
org.openrdf:openrdf-queryalgebra-evaluation:jar:2.0-beta5:compile
[DEBUG]          info.aduna:aduna-concurrent:jar:1.2:compile
[DEBUG]          info.aduna:aduna-io:jar:1.2:compile
[DEBUG]    org.codehaus.gmaven:gmaven-mojo:jar:1.2:compile
[DEBUG]       org.codehaus.gmaven.runtime:gmaven-runtime-api:jar:1.2:compile
[DEBUG]          
org.codehaus.gmaven.feature:gmaven-feature-api:jar:1.2:compile
[DEBUG]       org.codehaus.gmaven.runtime:gmaven-runtime-1.5:jar:1.2:compile
[DEBUG]          
org.codehaus.gmaven.feature:gmaven-feature-support:jar:1.2:compile
[DEBUG]          
org.codehaus.gmaven.runtime:gmaven-runtime-support:jar:1.2:compile
[DEBUG]             org.sonatype.gshell:gshell-io:jar:2.0:compile
[DEBUG]                org.sonatype.gossip:gossip:jar:1.0:compile
[DEBUG]             com.thoughtworks.qdox:qdox:jar:1.8:compile
[DEBUG]          org.apache.ant:ant:jar:1.7.1:compile
[DEBUG]             org.apache.ant:ant-launcher:jar:1.7.1:compile
[DEBUG]       org.apache.maven:maven-plugin-api:jar:2.0.9:compile 
(version managed from 2.0.10)
[DEBUG]    org.codehaus.groovy:groovy-all:jar:1.7.0:compile
[DEBUG]       jline:jline:jar:0.9.94:compile
[DEBUG]    org.codehaus.plexus:plexus-utils:jar:1.5.1:compile
[DEBUG]    org.apache.npanday:dotnet-assembler:jar:1.4.0-incubating:compile
[DEBUG]       
org.apache.npanday:dotnet-model-assembly-plugins:jar:1.4.0-incubating:compile
[DEBUG]       org.apache.npanday:dotnet-core:jar:1.4.0-incubating:compile
[DEBUG]          
org.codehaus.plexus:plexus-archiver:jar:1.0-alpha-9:compile (version 
managed from 1.0-alpha-10)
[DEBUG]             org.codehaus.plexus:plexus-io:jar:1.0-alpha-1:compile
[DEBUG]    
org.apache.npanday:dotnet-dao-project:jar:1.4.0-incubating:compile
[DEBUG]       org.openrdf:openrdf-model:jar:2.0-beta5:compile
[DEBUG]          info.aduna:aduna-collections:jar:1.2:compile
[DEBUG]       org.openrdf:openrdf-sail-nativerdf:jar:2.0-beta5:compile
[DEBUG]       org.openrdf:openrdf-sail-inferencer:jar:2.0-beta5:compile
[DEBUG]          org.openrdf:openrdf-queryparser-serql:jar:2.0-beta5:runtime
[DEBUG]       org.openrdf:openrdf-queryparser-sparql:jar:2.0-beta5:compile
[DEBUG]          info.aduna:aduna-net:jar:1.2:compile
[DEBUG]          info.aduna:aduna-text:jar:1.2:compile
[DEBUG]       org.openrdf:openrdf-rio-rdfxml:jar:2.0-beta5:compile
[DEBUG]       info.aduna:aduna-iteration:jar:1.2:compile
[DEBUG]       org.slf4j:slf4j-jdk14:jar:1.5.11:compile (version managed 
from 1.3.0)
[DEBUG]    org.apache.npanday:dotnet-executable:jar:1.4.0-incubating:compile
[DEBUG]       
org.apache.npanday:dotnet-model-executable-plugins:jar:1.4.0-incubating:compile
[DEBUG]       
org.apache.npanday:dotnet-model-compiler-plugins:jar:1.4.0-incubating:compile
[DEBUG]       org.apache.npanday:dotnet-vendor:jar:1.4.0-incubating:compile
[DEBUG]          
org.apache.npanday:dotnet-model-settings:jar:1.4.0-incubating:compile
[DEBUG]    org.apache.npanday:dotnet-artifact:jar:1.4.0-incubating:compile
[DEBUG]       
org.apache.npanday:dotnet-model-netdependency:jar:1.4.0-incubating:compile
[DEBUG]    org.apache.npanday:dotnet-plugin:jar:1.4.0-incubating:compile
[DEBUG]       
org.apache.npanday:dotnet-model-configuration-appenders:jar:1.4.0-incubating:compile
[DEBUG]    org.apache.maven:maven-core:jar:2.0.9:compile
[DEBUG]       org.apache.maven:maven-settings:jar:2.0.9:compile
[DEBUG]       
org.apache.maven:maven-plugin-parameter-documenter:jar:2.0.9:compile
[DEBUG]       
org.apache.maven.reporting:maven-reporting-api:jar:2.0.9:compile
[DEBUG]          
org.apache.maven.doxia:doxia-sink-api:jar:1.0-alpha-10:compile
[DEBUG]       org.apache.maven:maven-profile:jar:2.0.9:compile
[DEBUG]       org.apache.maven:maven-model:jar:2.0.9:compile
[DEBUG]       
org.codehaus.plexus:plexus-container-default:jar:1.0-alpha-32:compile 
(version managed from 1.0-alpha-9-stable-1)
[DEBUG]          
org.codehaus.plexus:plexus-component-api:jar:1.0-alpha-32:compile
[DEBUG]          
org.codehaus.plexus:plexus-classworlds:jar:1.2-alpha-10:compile
[DEBUG]          junit:junit:jar:3.8.1:compile
[DEBUG]       org.apache.maven:maven-repository-metadata:jar:2.0.9:compile
[DEBUG]       org.apache.maven:maven-error-diagnostics:jar:2.0.9:compile
[DEBUG]       commons-cli:commons-cli:jar:1.0:compile
[DEBUG]       org.apache.maven:maven-plugin-descriptor:jar:2.0.9:compile
[DEBUG]       
org.codehaus.plexus:plexus-interactivity-api:jar:1.0-alpha-4:compile
[DEBUG]       org.apache.maven:maven-artifact-manager:jar:2.0.9:compile
[DEBUG]       org.apache.maven:maven-monitor:jar:2.0.9:compile
[DEBUG]       classworlds:classworlds:jar:1.1:compile
[DEBUG] Created new class realm 
plugin>org.apache.npanday.plugins:maven-compile-plugin:1.4.0-incubating
[DEBUG] Importing foreign packages into class realm 
plugin>org.apache.npanday.plugins:maven-compile-plugin:1.4.0-incubating
[DEBUG]   Imported: < 
project>com.kodak.intersystem.dotnet:intersystem-service:0.0.2-SNAPSHOT
[DEBUG] Populating class realm 
plugin>org.apache.npanday.plugins:maven-compile-plugin:1.4.0-incubating
[DEBUG]   Included: 
org.apache.npanday.plugins:maven-compile-plugin:jar:1.4.0-incubating
[DEBUG]   Included: org.apache.npanday:dotnet-registry:jar:1.4.0-incubating
[DEBUG]   Included: net.sf.kxml:kxml2:jar:2.1.8
[DEBUG]   Included: xmlpull:xmlpull:jar:1.1.3.4a
[DEBUG]   Included: org.openrdf:openrdf-repository-api:jar:2.0-beta5
[DEBUG]   Included: org.openrdf:openrdf-query:jar:2.0-beta5
[DEBUG]   Included: org.openrdf:openrdf-sail-api:jar:2.0-beta5
[DEBUG]   Included: org.openrdf:openrdf-queryresultio-api:jar:2.0-beta5
[DEBUG]   Included: org.openrdf:openrdf-rio-api:jar:2.0-beta5
[DEBUG]   Included: info.aduna:aduna-xml:jar:1.2
[DEBUG]   Included: info.aduna:aduna-lang:jar:1.3
[DEBUG]   Included: org.slf4j:slf4j-api:jar:1.5.11
[DEBUG]   Included: org.openrdf:openrdf-repository-sail:jar:2.0-beta5
[DEBUG]   Included: org.openrdf:openrdf-queryparser-api:jar:2.0-beta5
[DEBUG]   Included: org.openrdf:openrdf-queryalgebra-model:jar:2.0-beta5
[DEBUG]   Included: org.openrdf:openrdf-sail-memory:jar:2.0-beta5
[DEBUG]   Included: 
org.openrdf:openrdf-queryalgebra-evaluation:jar:2.0-beta5
[DEBUG]   Included: info.aduna:aduna-concurrent:jar:1.2
[DEBUG]   Included: info.aduna:aduna-io:jar:1.2
[DEBUG]   Included: org.codehaus.gmaven:gmaven-mojo:jar:1.2
[DEBUG]   Included: org.codehaus.gmaven.runtime:gmaven-runtime-api:jar:1.2
[DEBUG]   Included: org.codehaus.gmaven.feature:gmaven-feature-api:jar:1.2
[DEBUG]   Included: org.codehaus.gmaven.runtime:gmaven-runtime-1.5:jar:1.2
[DEBUG]   Included: 
org.codehaus.gmaven.feature:gmaven-feature-support:jar:1.2
[DEBUG]   Included: 
org.codehaus.gmaven.runtime:gmaven-runtime-support:jar:1.2
[DEBUG]   Included: org.sonatype.gshell:gshell-io:jar:2.0
[DEBUG]   Included: org.sonatype.gossip:gossip:jar:1.0
[DEBUG]   Included: com.thoughtworks.qdox:qdox:jar:1.8
[DEBUG]   Included: org.apache.ant:ant:jar:1.7.1
[DEBUG]   Included: org.apache.ant:ant-launcher:jar:1.7.1
[DEBUG]   Included: org.codehaus.groovy:groovy-all:jar:1.7.0
[DEBUG]   Included: jline:jline:jar:0.9.94
[DEBUG]   Included: org.codehaus.plexus:plexus-utils:jar:1.5.1
[DEBUG]   Included: org.apache.npanday:dotnet-assembler:jar:1.4.0-incubating
[DEBUG]   Included: 
org.apache.npanday:dotnet-model-assembly-plugins:jar:1.4.0-incubating
[DEBUG]   Included: org.apache.npanday:dotnet-core:jar:1.4.0-incubating
[DEBUG]   Included: org.codehaus.plexus:plexus-archiver:jar:1.0-alpha-9
[DEBUG]   Included: org.codehaus.plexus:plexus-io:jar:1.0-alpha-1
[DEBUG]   Included: 
org.apache.npanday:dotnet-dao-project:jar:1.4.0-incubating
[DEBUG]   Included: org.openrdf:openrdf-model:jar:2.0-beta5
[DEBUG]   Included: info.aduna:aduna-collections:jar:1.2
[DEBUG]   Included: org.openrdf:openrdf-sail-nativerdf:jar:2.0-beta5
[DEBUG]   Included: org.openrdf:openrdf-sail-inferencer:jar:2.0-beta5
[DEBUG]   Included: org.openrdf:openrdf-queryparser-serql:jar:2.0-beta5
[DEBUG]   Included: org.openrdf:openrdf-queryparser-sparql:jar:2.0-beta5
[DEBUG]   Included: info.aduna:aduna-net:jar:1.2
[DEBUG]   Included: info.aduna:aduna-text:jar:1.2
[DEBUG]   Included: org.openrdf:openrdf-rio-rdfxml:jar:2.0-beta5
[DEBUG]   Included: info.aduna:aduna-iteration:jar:1.2
[DEBUG]   Included: org.slf4j:slf4j-jdk14:jar:1.5.11
[DEBUG]   Included: 
org.apache.npanday:dotnet-executable:jar:1.4.0-incubating
[DEBUG]   Included: 
org.apache.npanday:dotnet-model-executable-plugins:jar:1.4.0-incubating
[DEBUG]   Included: 
org.apache.npanday:dotnet-model-compiler-plugins:jar:1.4.0-incubating
[DEBUG]   Included: org.apache.npanday:dotnet-vendor:jar:1.4.0-incubating
[DEBUG]   Included: 
org.apache.npanday:dotnet-model-settings:jar:1.4.0-incubating
[DEBUG]   Included: org.apache.npanday:dotnet-artifact:jar:1.4.0-incubating
[DEBUG]   Included: 
org.apache.npanday:dotnet-model-netdependency:jar:1.4.0-incubating
[DEBUG]   Included: org.apache.npanday:dotnet-plugin:jar:1.4.0-incubating
[DEBUG]   Included: 
org.apache.npanday:dotnet-model-configuration-appenders:jar:1.4.0-incubating
[DEBUG]   Included: org.apache.maven.reporting:maven-reporting-api:jar:2.0.9
[DEBUG]   Included: org.apache.maven.doxia:doxia-sink-api:jar:1.0-alpha-10
[DEBUG]   Included: junit:junit:jar:3.8.1
[DEBUG]   Included: commons-cli:commons-cli:jar:1.0
[DEBUG]   Included: 
org.codehaus.plexus:plexus-interactivity-api:jar:1.0-alpha-4
[DEBUG]   Excluded: org.apache.maven:maven-artifact:jar:2.0.9
[DEBUG]   Excluded: org.apache.maven:maven-project:jar:2.0.9
[DEBUG]   Excluded: org.apache.maven:maven-plugin-registry:jar:2.0.9
[DEBUG]   Excluded: org.apache.maven:maven-plugin-api:jar:2.0.9
[DEBUG]   Excluded: org.apache.maven:maven-core:jar:2.0.9
[DEBUG]   Excluded: org.apache.maven:maven-settings:jar:2.0.9
[DEBUG]   Excluded: 
org.apache.maven:maven-plugin-parameter-documenter:jar:2.0.9
[DEBUG]   Excluded: org.apache.maven:maven-profile:jar:2.0.9
[DEBUG]   Excluded: org.apache.maven:maven-model:jar:2.0.9
[DEBUG]   Excluded: 
org.codehaus.plexus:plexus-container-default:jar:1.0-alpha-32
[DEBUG]   Excluded: 
org.codehaus.plexus:plexus-component-api:jar:1.0-alpha-32
[DEBUG]   Excluded: org.codehaus.plexus:plexus-classworlds:jar:1.2-alpha-10
[DEBUG]   Excluded: org.apache.maven:maven-repository-metadata:jar:2.0.9
[DEBUG]   Excluded: org.apache.maven:maven-error-diagnostics:jar:2.0.9
[DEBUG]   Excluded: org.apache.maven:maven-plugin-descriptor:jar:2.0.9
[DEBUG]   Excluded: org.apache.maven:maven-artifact-manager:jar:2.0.9
[DEBUG]   Excluded: org.apache.maven:maven-monitor:jar:2.0.9
[DEBUG]   Excluded: classworlds:classworlds:jar:1.1
[DEBUG] Configuring mojo 
org.apache.npanday.plugins:maven-compile-plugin:1.4.0-incubating:initialize 
from plugin realm ClassReal
m[plugin>org.apache.npanday.plugins:maven-compile-plugin:1.4.0-incubating, 
parent: sun.misc.Launcher$AppClassLoader@12360be0]
[DEBUG] Configuring mojo 
'org.apache.npanday.plugins:maven-compile-plugin:1.4.0-incubating:initialize' 
with basic configurator -
->
[DEBUG]   (f) localRepository = C:\Users\10069959\.m2\repository
[DEBUG]   (f) project = MavenProject: 
com.kodak.intersystem.dotnet:intersystem-service:0.0.2-SNAPSHOT @ 
P:\Intersystem\main\plat
form.NET\intersystem-service\pom.xml
[DEBUG] -- end configuration --
SLF4J: Class path contains multiple SLF4J bindings.
SLF4J: Found binding in 
[jar:file:/C:/Users/10069959/.m2/repository/org/sonatype/gossip/gossip/1.0/gossip-1.0.jar!/org/slf4j/imp
l/StaticLoggerBinder.class]
SLF4J: Found binding in 
[jar:file:/C:/Users/10069959/.m2/repository/org/slf4j/slf4j-jdk14/1.5.11/slf4j-jdk14-1.5.11.jar!/org/slf
4j/impl/StaticLoggerBinder.class]
SLF4J: See http://www.slf4j.org/codes.html#multiple_bindings for an 
explanation.
23-Sep-2011 2:54:53 PM npanday.dao.impl.ProjectDaoImpl 
storeProjectAndResolveDependencies
WARNING: NPANDAY-180-018: Not found in local repository, now retrieving 
artifact from wagon:net.sf.jni4net:jni4net.n:dotnet-libr
ary:0.8.5.1, Failed Path Check = 
P:\Intersystem\main\platform.NET\intersystem-service\target\jni4net.n.dll
[DEBUG] Skipped remote update check for 
com.kodak.intersystem.dotnet:intersystem-jni4net:0.0.2-SNAPSHOT/maven-metadata.xml, 
loca
lly built metadata up-to-date.
23-Sep-2011 2:54:53 PM npanday.dao.impl.ProjectDaoImpl 
storeProjectAndResolveDependencies
WARNING: NPANDAY-180-018: Not found in local repository, now retrieving 
artifact from wagon:com.kodak.intersystem.dotnet:intersy
stem-jni4net:dotnet-library:0.0.2-SNAPSHOT, Failed Path Check = 
P:\Intersystem\main\platform.NET\intersystem-service\target\inte
rsystem-jni4net.dll
[DEBUG] Skipped remote update check for 
com.kodak.intersystem.dotnet:intersystem-jni4net:0.0.2-SNAPSHOT/maven-metadata.xml, 
loca
lly built metadata up-to-date.
[INFO] 
------------------------------------------------------------------------
[INFO] BUILD FAILURE
[INFO] 
------------------------------------------------------------------------
[INFO] Total time: 2.071s
[INFO] Finished at: Fri Sep 23 14:54:53 PDT 2011
[INFO] Final Memory: 8M/368M
[INFO] 
------------------------------------------------------------------------
[ERROR] Failed to execute goal 
org.apache.npanday.plugins:maven-compile-plugin:1.4.0-incubating:initialize 
(default-initialize)
on project intersystem-service: 1 -> [Help 1]
org.apache.maven.lifecycle.LifecycleExecutionException: Failed to 
execute goal org.apache.npanday.plugins:maven-compile-plugin:1
.4.0-incubating:initialize (default-initialize) on project 
intersystem-service: 1
         at 
org.apache.maven.lifecycle.internal.MojoExecutor.execute(MojoExecutor.java:217)
         at 
org.apache.maven.lifecycle.internal.MojoExecutor.execute(MojoExecutor.java:153)
         at 
org.apache.maven.lifecycle.internal.MojoExecutor.execute(MojoExecutor.java:145)
         at 
org.apache.maven.lifecycle.internal.LifecycleModuleBuilder.buildProject(LifecycleModuleBuilder.java:84)
         at 
org.apache.maven.lifecycle.internal.LifecycleModuleBuilder.buildProject(LifecycleModuleBuilder.java:59)
         at 
org.apache.maven.lifecycle.internal.LifecycleStarter.singleThreadedBuild(LifecycleStarter.java:183)
         at 
org.apache.maven.lifecycle.internal.LifecycleStarter.execute(LifecycleStarter.java:161)
         at org.apache.maven.DefaultMaven.doExecute(DefaultMaven.java:319)
         at org.apache.maven.DefaultMaven.execute(DefaultMaven.java:156)
         at org.apache.maven.cli.MavenCli.execute(MavenCli.java:537)
         at org.apache.maven.cli.MavenCli.doMain(MavenCli.java:196)
         at org.apache.maven.cli.MavenCli.main(MavenCli.java:141)
         at sun.reflect.NativeMethodAccessorImpl.invoke0(Native Method)
         at 
sun.reflect.NativeMethodAccessorImpl.invoke(NativeMethodAccessorImpl.java:39)
         at 
sun.reflect.DelegatingMethodAccessorImpl.invoke(DelegatingMethodAccessorImpl.java:25)
         at java.lang.reflect.Method.invoke(Method.java:597)
         at 
org.codehaus.plexus.classworlds.launcher.Launcher.launchEnhanced(Launcher.java:290)
         at 
org.codehaus.plexus.classworlds.launcher.Launcher.launch(Launcher.java:230)
         at 
org.codehaus.plexus.classworlds.launcher.Launcher.mainWithExitCode(Launcher.java:409)
         at 
org.codehaus.plexus.classworlds.launcher.Launcher.main(Launcher.java:352)
Caused by: org.apache.maven.plugin.MojoExecutionException: 1
         at 
npanday.plugin.compile.ComponentInitializerMojo.execute(ComponentInitializerMojo.java:92)
         at 
org.apache.maven.plugin.DefaultBuildPluginManager.executeMojo(DefaultBuildPluginManager.java:101)
         at 
org.apache.maven.lifecycle.internal.MojoExecutor.execute(MojoExecutor.java:209)
         ... 19 more
[ERROR]
[ERROR]
[ERROR] For more information about the errors and possible solutions, 
please read the following articles:
[ERROR] [Help 1] 
http://cwiki.apache.org/confluence/display/MAVEN/MojoExecutionException
P:\Intersystem\main\platform.NET\intersystem-service>









































































































































Mime
View raw message