incubator-mesos-dev mailing list archives

Site index · List index
Message view « Date » · « Thread »
Top « Date » · « Thread »
From Apache Jenkins Server <jenk...@builds.apache.org>
Subject Build failed in Jenkins: Mesos-Trunk-Ubuntu-Build-In-Src-Set-JAVA_HOME #114
Date Thu, 19 Apr 2012 19:53:20 GMT
See <https://builds.apache.org/job/Mesos-Trunk-Ubuntu-Build-In-Src-Set-JAVA_HOME/114/changes>

Changes:

[benh] Fixes for dealing with --disable-python.

------------------------------------------
[...truncated 3084 lines...]
[----------] 8 tests from ConfiguratorTest (61 ms total)

[----------] 5 tests from SampleFrameworks
[ RUN      ] SampleFrameworks.CppFramework
2012-04-19 19:53:09,611:32604(0x2b9487789700):ZOO_ERROR@handle_socket_error_msg@1579: Socket
[127.0.0.1:40334] zk retcode=-4, errno=111(Connection refused): server refused to accept the
client
2012-04-19 19:53:11,323:32604(0x2b9487b8b700):ZOO_ERROR@handle_socket_error_msg@1579: Socket
[127.0.0.1:56028] zk retcode=-4, errno=111(Connection refused): server refused to accept the
client
2012-04-19 19:53:11,346:32604(0x2b948798a700):ZOO_ERROR@handle_socket_error_msg@1579: Socket
[127.0.0.1:52054] zk retcode=-4, errno=111(Connection refused): server refused to accept the
client
2012-04-19 19:53:11,378:32604(0x2b9490a05700):ZOO_ERROR@handle_socket_error_msg@1579: Socket
[127.0.0.1:59406] zk retcode=-4, errno=111(Connection refused): server refused to accept the
client
2012-04-19 19:53:11,406:32604(0x2b9490200700):ZOO_ERROR@handle_socket_error_msg@1579: Socket
[127.0.0.1:42768] zk retcode=-4, errno=111(Connection refused): server refused to accept the
client
2012-04-19 19:53:11,614:32604(0x2b9487789700):ZOO_ERROR@handle_socket_error_msg@1579: Socket
[127.0.0.1:40334] zk retcode=-4, errno=111(Connection refused): server refused to accept the
client
2012-04-19 19:53:13,326:32604(0x2b9487b8b700):ZOO_ERROR@handle_socket_error_msg@1579: Socket
[127.0.0.1:56028] zk retcode=-4, errno=111(Connection refused): server refused to accept the
client
2012-04-19 19:53:13,348:32604(0x2b948798a700):ZOO_ERROR@handle_socket_error_msg@1579: Socket
[127.0.0.1:52054] zk retcode=-4, errno=111(Connection refused): server refused to accept the
client
2012-04-19 19:53:13,380:32604(0x2b9490a05700):ZOO_ERROR@handle_socket_error_msg@1579: Socket
[127.0.0.1:59406] zk retcode=-4, errno=111(Connection refused): server refused to accept the
client
2012-04-19 19:53:13,408:32604(0x2b9490200700):ZOO_ERROR@handle_socket_error_msg@1579: Socket
[127.0.0.1:42768] zk retcode=-4, errno=111(Connection refused): server refused to accept the
client
2012-04-19 19:53:13,616:32604(0x2b9487789700):ZOO_ERROR@handle_socket_error_msg@1579: Socket
[127.0.0.1:40334] zk retcode=-4, errno=111(Connection refused): server refused to accept the
client
[       OK ] SampleFrameworks.CppFramework (5386 ms)
[ RUN      ] SampleFrameworks.NoExecutorFramework
2012-04-19 19:53:15,328:32604(0x2b9487b8b700):ZOO_ERROR@handle_socket_error_msg@1579: Socket
[127.0.0.1:56028] zk retcode=-4, errno=111(Connection refused): server refused to accept the
client
2012-04-19 19:53:15,350:32604(0x2b948798a700):ZOO_ERROR@handle_socket_error_msg@1579: Socket
[127.0.0.1:52054] zk retcode=-4, errno=111(Connection refused): server refused to accept the
client
2012-04-19 19:53:15,383:32604(0x2b9490a05700):ZOO_ERROR@handle_socket_error_msg@1579: Socket
[127.0.0.1:59406] zk retcode=-4, errno=111(Connection refused): server refused to accept the
client
2012-04-19 19:53:15,410:32604(0x2b9490200700):ZOO_ERROR@handle_socket_error_msg@1579: Socket
[127.0.0.1:42768] zk retcode=-4, errno=111(Connection refused): server refused to accept the
client
2012-04-19 19:53:15,618:32604(0x2b9487789700):ZOO_ERROR@handle_socket_error_msg@1579: Socket
[127.0.0.1:40334] zk retcode=-4, errno=111(Connection refused): server refused to accept the
client
[       OK ] SampleFrameworks.NoExecutorFramework (1504 ms)
[ RUN      ] SampleFrameworks.JavaFramework
2012-04-19 19:53:17,330:32604(0x2b9487b8b700):ZOO_ERROR@handle_socket_error_msg@1579: Socket
[127.0.0.1:56028] zk retcode=-4, errno=111(Connection refused): server refused to accept the
client
2012-04-19 19:53:17,353:32604(0x2b948798a700):ZOO_ERROR@handle_socket_error_msg@1579: Socket
[127.0.0.1:52054] zk retcode=-4, errno=111(Connection refused): server refused to accept the
client
2012-04-19 19:53:17,385:32604(0x2b9490a05700):ZOO_ERROR@handle_socket_error_msg@1579: Socket
[127.0.0.1:59406] zk retcode=-4, errno=111(Connection refused): server refused to accept the
client
2012-04-19 19:53:17,412:32604(0x2b9490200700):ZOO_ERROR@handle_socket_error_msg@1579: Socket
[127.0.0.1:42768] zk retcode=-4, errno=111(Connection refused): server refused to accept the
client
2012-04-19 19:53:17,620:32604(0x2b9487789700):ZOO_ERROR@handle_socket_error_msg@1579: Socket
[127.0.0.1:40334] zk retcode=-4, errno=111(Connection refused): server refused to accept the
client
2012-04-19 19:53:19,332:32604(0x2b9487b8b700):ZOO_ERROR@handle_socket_error_msg@1579: Socket
[127.0.0.1:56028] zk retcode=-4, errno=111(Connection refused): server refused to accept the
client
2012-04-19 19:53:19,355:32604(0x2b948798a700):ZOO_ERROR@handle_socket_error_msg@1579: Socket
[127.0.0.1:52054] zk retcode=-4, errno=111(Connection refused): server refused to accept the
client
2012-04-19 19:53:19,387:32604(0x2b9490a05700):ZOO_ERROR@handle_socket_error_msg@1579: Socket
[127.0.0.1:59406] zk retcode=-4, errno=111(Connection refused): server refused to accept the
client
2012-04-19 19:53:19,415:32604(0x2b9490200700):ZOO_ERROR@handle_socket_error_msg@1579: Socket
[127.0.0.1:42768] zk retcode=-4, errno=111(Connection refused): server refused to accept the
client
2012-04-19 19:53:19,622:32604(0x2b9487789700):ZOO_ERROR@handle_socket_error_msg@1579: Socket
[127.0.0.1:40334] zk retcode=-4, errno=111(Connection refused): server refused to accept the
client
[       OK ] SampleFrameworks.JavaFramework (3193 ms)
[ RUN      ] SampleFrameworks.JavaExceptionFramework
[       OK ] SampleFrameworks.JavaExceptionFramework (190 ms)
[ RUN      ] SampleFrameworks.PythonFramework
tests/external_tests.cpp:64: Failure
Value of: exitCode
  Actual: 256
Expected: 0
External test PythonFramework failed
[  FAILED  ] SampleFrameworks.PythonFramework (61 ms)
[----------] 5 tests from SampleFrameworks (10334 ms total)

[----------] 1 test from UUIDTest
[ RUN      ] UUIDTest.test
[       OK ] UUIDTest.test (1 ms)
[----------] 1 test from UUIDTest (1 ms total)

[----------] 23 tests from ResourcesTest
[ RUN      ] ResourcesTest.Parsing
[       OK ] ResourcesTest.Parsing (0 ms)
[ RUN      ] ResourcesTest.Printing
[       OK ] ResourcesTest.Printing (0 ms)
[ RUN      ] ResourcesTest.InitializedIsEmpty
[       OK ] ResourcesTest.InitializedIsEmpty (0 ms)
[ RUN      ] ResourcesTest.BadResourcesNotAllocatable
[       OK ] ResourcesTest.BadResourcesNotAllocatable (0 ms)
[ RUN      ] ResourcesTest.ScalarEquals
[       OK ] ResourcesTest.ScalarEquals (0 ms)
[ RUN      ] ResourcesTest.ScalarSubset
[       OK ] ResourcesTest.ScalarSubset (0 ms)
[ RUN      ] ResourcesTest.ScalarAddition
[       OK ] ResourcesTest.ScalarAddition (1 ms)
[ RUN      ] ResourcesTest.ScalarSubtraction
[       OK ] ResourcesTest.ScalarSubtraction (0 ms)
[ RUN      ] ResourcesTest.RangesEquals
[       OK ] ResourcesTest.RangesEquals (0 ms)
[ RUN      ] ResourcesTest.RangesSubset
[       OK ] ResourcesTest.RangesSubset (0 ms)
[ RUN      ] ResourcesTest.RangesAddition
[       OK ] ResourcesTest.RangesAddition (0 ms)
[ RUN      ] ResourcesTest.RangesAddition2
[       OK ] ResourcesTest.RangesAddition2 (0 ms)
[ RUN      ] ResourcesTest.RangesSubtraction
[       OK ] ResourcesTest.RangesSubtraction (0 ms)
[ RUN      ] ResourcesTest.RangesSubtraction1
[       OK ] ResourcesTest.RangesSubtraction1 (0 ms)
[ RUN      ] ResourcesTest.RangesSubtraction2
[       OK ] ResourcesTest.RangesSubtraction2 (0 ms)
[ RUN      ] ResourcesTest.RangesSubtraction3
[       OK ] ResourcesTest.RangesSubtraction3 (0 ms)
[ RUN      ] ResourcesTest.RangesSubtraction4
[       OK ] ResourcesTest.RangesSubtraction4 (0 ms)
[ RUN      ] ResourcesTest.RangesSubtraction5
[       OK ] ResourcesTest.RangesSubtraction5 (0 ms)
[ RUN      ] ResourcesTest.SetEquals
[       OK ] ResourcesTest.SetEquals (0 ms)
[ RUN      ] ResourcesTest.SetSubset
[       OK ] ResourcesTest.SetSubset (0 ms)
[ RUN      ] ResourcesTest.SetAddition
[       OK ] ResourcesTest.SetAddition (0 ms)
[ RUN      ] ResourcesTest.SetSubtraction
[       OK ] ResourcesTest.SetSubtraction (0 ms)
[ RUN      ] ResourcesTest.EmptyUnequal
[       OK ] ResourcesTest.EmptyUnequal (0 ms)
[----------] 23 tests from ResourcesTest (1 ms total)

[----------] 3 tests from ReplicaTest
[ RUN      ] ReplicaTest.Promise
[       OK ] ReplicaTest.Promise (12 ms)
[ RUN      ] ReplicaTest.Append
[       OK ] ReplicaTest.Append (3 ms)
[ RUN      ] ReplicaTest.Recover
[       OK ] ReplicaTest.Recover (5 ms)
[----------] 3 tests from ReplicaTest (20 ms total)

[----------] 16 tests from CoordinatorTest
[ RUN      ] CoordinatorTest.Elect
[       OK ] CoordinatorTest.Elect (8 ms)
[ RUN      ] CoordinatorTest.AppendRead
[       OK ] CoordinatorTest.AppendRead (8 ms)
[ RUN      ] CoordinatorTest.AppendReadError
[       OK ] CoordinatorTest.AppendReadError (9 ms)
[ RUN      ] CoordinatorTest.Failover
[       OK ] CoordinatorTest.Failover (12 ms)
[ RUN      ] CoordinatorTest.Demoted
[       OK ] CoordinatorTest.Demoted (18 ms)
[ RUN      ] CoordinatorTest.Fill
[       OK ] CoordinatorTest.Fill (21 ms)
[ RUN      ] CoordinatorTest.NotLearnedFill
[       OK ] CoordinatorTest.NotLearnedFill (31 ms)
[ RUN      ] CoordinatorTest.MultipleAppends
[       OK ] CoordinatorTest.MultipleAppends (23 ms)
[ RUN      ] CoordinatorTest.MultipleAppendsNotLearnedFill
[       OK ] CoordinatorTest.MultipleAppendsNotLearnedFill (60 ms)
[ RUN      ] CoordinatorTest.Truncate
[       OK ] CoordinatorTest.Truncate (25 ms)
[ RUN      ] CoordinatorTest.TruncateNotLearnedFill
[       OK ] CoordinatorTest.TruncateNotLearnedFill (80 ms)
[ RUN      ] CoordinatorTest.RacingElect
[       OK ] CoordinatorTest.RacingElect (0 ms)
[ RUN      ] CoordinatorTest.FillNoQuorum
[       OK ] CoordinatorTest.FillNoQuorum (0 ms)
[ RUN      ] CoordinatorTest.FillInconsistent
[       OK ] CoordinatorTest.FillInconsistent (0 ms)
[ RUN      ] CoordinatorTest.LearnedOnOneReplica_NotLearnedOnAnother
[       OK ] CoordinatorTest.LearnedOnOneReplica_NotLearnedOnAnother (0 ms)
[ RUN      ] CoordinatorTest.LearnedOnOneReplica_NotLearnedOnAnother_AnotherFailsAndRecovers
[       OK ] CoordinatorTest.LearnedOnOneReplica_NotLearnedOnAnother_AnotherFailsAndRecovers
(0 ms)
[----------] 16 tests from CoordinatorTest (296 ms total)

[----------] 2 tests from LogTest
[ RUN      ] LogTest.WriteRead
[       OK ] LogTest.WriteRead (10 ms)
[ RUN      ] LogTest.Position
[       OK ] LogTest.Position (11 ms)
[----------] 2 tests from LogTest (21 ms total)

[----------] 9 tests from FaultToleranceTest
[ RUN      ] FaultToleranceTest.SlaveLost
[       OK ] FaultToleranceTest.SlaveLost (3 ms)
[ RUN      ] FaultToleranceTest.SlavePartitioned
[       OK ] FaultToleranceTest.SlavePartitioned (5 ms)
[ RUN      ] FaultToleranceTest.SchedulerFailover
[       OK ] FaultToleranceTest.SchedulerFailover (3 ms)
[ RUN      ] FaultToleranceTest.FrameworkReliableRegistration
[       OK ] FaultToleranceTest.FrameworkReliableRegistration (3 ms)
[ RUN      ] FaultToleranceTest.FrameworkReregister
[       OK ] FaultToleranceTest.FrameworkReregister (2 ms)
[ RUN      ] FaultToleranceTest.SchedulerFailoverStatusUpdate
[       OK ] FaultToleranceTest.SchedulerFailoverStatusUpdate (8 ms)
[ RUN      ] FaultToleranceTest.SchedulerFailoverFrameworkMessage
[       OK ] FaultToleranceTest.SchedulerFailoverFrameworkMessage (6 ms)
[ RUN      ] FaultToleranceTest.SlaveReliableRegistration
[       OK ] FaultToleranceTest.SlaveReliableRegistration (3 ms)
[ RUN      ] FaultToleranceTest.SlaveReregister
[       OK ] FaultToleranceTest.SlaveReregister (2 ms)
[----------] 9 tests from FaultToleranceTest (35 ms total)

[----------] 8 tests from ResourceOffersTest
[ RUN      ] ResourceOffersTest.ResourceOfferWithMultipleSlaves
[       OK ] ResourceOffersTest.ResourceOfferWithMultipleSlaves (4 ms)
[ RUN      ] ResourceOffersTest.TaskUsesNoResources
[       OK ] ResourceOffersTest.TaskUsesNoResources (3 ms)
[ RUN      ] ResourceOffersTest.TaskUsesInvalidResources
[       OK ] ResourceOffersTest.TaskUsesInvalidResources (3 ms)
[ RUN      ] ResourceOffersTest.TaskUsesMoreResourcesThanOffered
[       OK ] ResourceOffersTest.TaskUsesMoreResourcesThanOffered (3 ms)
[ RUN      ] ResourceOffersTest.ResourcesGetReofferedWhenUnused
[       OK ] ResourceOffersTest.ResourcesGetReofferedWhenUnused (3 ms)
[ RUN      ] ResourceOffersTest.ResourcesGetReofferedAfterTaskInfoError
[       OK ] ResourceOffersTest.ResourcesGetReofferedAfterTaskInfoError (4 ms)
[ RUN      ] ResourceOffersTest.Request
[       OK ] ResourceOffersTest.Request (3 ms)
[ RUN      ] ResourceOffersTest.TasksExecutorInfoDiffers
[       OK ] ResourceOffersTest.TasksExecutorInfoDiffers (4 ms)
[----------] 8 tests from ResourceOffersTest (28 ms total)

[----------] 7 tests from MasterTest
[ RUN      ] MasterTest.TaskRunning
[       OK ] MasterTest.TaskRunning (5 ms)
[ RUN      ] MasterTest.KillTask
[       OK ] MasterTest.KillTask (6 ms)
[ RUN      ] MasterTest.FrameworkMessage
[       OK ] MasterTest.FrameworkMessage (5 ms)
[ RUN      ] MasterTest.MultipleExecutors
[       OK ] MasterTest.MultipleExecutors (7 ms)
[ RUN      ] MasterTest.MasterInfo
[       OK ] MasterTest.MasterInfo (2 ms)
[ RUN      ] MasterTest.MasterInfoOnReElection
[       OK ] MasterTest.MasterInfoOnReElection (2 ms)
[ RUN      ] MasterTest.MasterLost
[       OK ] MasterTest.MasterLost (3 ms)
[----------] 7 tests from MasterTest (30 ms total)

[----------] 5 tests from FrameworksManagerTestFixture
[ RUN      ] FrameworksManagerTestFixture.AddFramework
[       OK ] FrameworksManagerTestFixture.AddFramework (2 ms)
[ RUN      ] FrameworksManagerTestFixture.RemoveFramework
[       OK ] FrameworksManagerTestFixture.RemoveFramework (3 ms)
[ RUN      ] FrameworksManagerTestFixture.ResurrectFramework
[       OK ] FrameworksManagerTestFixture.ResurrectFramework (2 ms)
[ RUN      ] FrameworksManagerTestFixture.ResurrectExpiringFramework
[       OK ] FrameworksManagerTestFixture.ResurrectExpiringFramework (3 ms)
[ RUN      ] FrameworksManagerTestFixture.ResurrectInterspersedExpiringFrameworks
[       OK ] FrameworksManagerTestFixture.ResurrectInterspersedExpiringFrameworks (2 ms)
[----------] 5 tests from FrameworksManagerTestFixture (13 ms total)

[----------] 1 test from FrameworksManagerTest
[ RUN      ] FrameworksManagerTest.CacheFailure
E0419 19:53:20.327937 32628 frameworks_manager.cpp:213] Error getting framework info from
underlying storage: Fake Caching Error.
E0419 19:53:20.328966 32630 frameworks_manager.cpp:213] Error getting framework info from
underlying storage: Fake Caching Error.
[       OK ] FrameworksManagerTest.CacheFailure (2 ms)
[----------] 1 test from FrameworksManagerTest (2 ms total)

[----------] Global test environment tear-down
[==========] 121 tests from 23 test cases ran. (25504 ms total)
[  PASSED  ] 120 tests.
[  FAILED  ] 1 test, listed below:
[  FAILED  ] SampleFrameworks.PythonFramework

 1 FAILED TEST
  YOU HAVE 6 DISABLED TESTS

FAIL: mesos-tests
==================
1 of 1 test failed
==================
make[3]: *** [check-TESTS] Error 1
make[3]: Leaving directory `<https://builds.apache.org/job/Mesos-Trunk-Ubuntu-Build-In-Src-Set-JAVA_HOME/ws/src'>
make[2]: *** [check-am] Error 2
make[2]: Leaving directory `<https://builds.apache.org/job/Mesos-Trunk-Ubuntu-Build-In-Src-Set-JAVA_HOME/ws/src'>
make[1]: *** [check] Error 2
make[1]: Leaving directory `<https://builds.apache.org/job/Mesos-Trunk-Ubuntu-Build-In-Src-Set-JAVA_HOME/ws/src'>
make: *** [check-recursive] Error 1
Build step 'Execute shell' marked build as failure

Mime
View raw message