incubator-mesos-dev mailing list archives

Site index · List index
Message view « Date » · « Thread »
Top « Date » · « Thread »
From Apache Jenkins Server <jenk...@builds.apache.org>
Subject Build failed in Jenkins: Mesos-Trunk-Ubuntu-Build-In-Src-Set-JAVA_HOME #64
Date Wed, 29 Feb 2012 06:59:04 GMT
See <https://builds.apache.org/job/Mesos-Trunk-Ubuntu-Build-In-Src-Set-JAVA_HOME/64/changes>

Changes:

[benh] Webui data files should not be installed as executable (contributed by Charles Reiss).

------------------------------------------
[...truncated 794 lines...]
<https://builds.apache.org/job/Mesos-Trunk-Ubuntu-Build-In-Src-Set-JAVA_HOME/ws/third_party/protobuf-2.3.0/src/google/protobuf/io/coded_stream.h>:
In member function 'bool google::protobuf::io::CodedInputStream::ReadLittleEndian32(google::protobuf::uint32*)':
<https://builds.apache.org/job/Mesos-Trunk-Ubuntu-Build-In-Src-Set-JAVA_HOME/ws/third_party/protobuf-2.3.0/src/google/protobuf/io/coded_stream.h>:776:7:
warning: comparison between signed and unsigned integer expressions
<https://builds.apache.org/job/Mesos-Trunk-Ubuntu-Build-In-Src-Set-JAVA_HOME/ws/third_party/protobuf-2.3.0/src/google/protobuf/io/coded_stream.h>:
In member function 'bool google::protobuf::io::CodedInputStream::ReadLittleEndian64(google::protobuf::uint64*)':
<https://builds.apache.org/job/Mesos-Trunk-Ubuntu-Build-In-Src-Set-JAVA_HOME/ws/third_party/protobuf-2.3.0/src/google/protobuf/io/coded_stream.h>:791:7:
warning: comparison between signed and unsigned integer expressions
gcc -pthread -fno-strict-aliasing -DNDEBUG -g -fwrapv -O2 -Wall -Wstrict-prototypes -fPIC
-I<https://builds.apache.org/job/Mesos-Trunk-Ubuntu-Build-In-Src-Set-JAVA_HOME/ws/include>
-I<https://builds.apache.org/job/Mesos-Trunk-Ubuntu-Build-In-Src-Set-JAVA_HOME/ws/include>
-I<https://builds.apache.org/job/Mesos-Trunk-Ubuntu-Build-In-Src-Set-JAVA_HOME/ws/src>
-I<https://builds.apache.org/job/Mesos-Trunk-Ubuntu-Build-In-Src-Set-JAVA_HOME/ws/src/python/native>
-I<https://builds.apache.org/job/Mesos-Trunk-Ubuntu-Build-In-Src-Set-JAVA_HOME/ws/third_party/protobuf-2.3.0/src>
-I/usr/include/python2.6 -c native/module.cpp -o build/temp.linux-x86_64-2.6/native/module.o
cc1plus: warning: command line option "-Wstrict-prototypes" is valid for Ada/C/ObjC but not
for C++
In file included from <https://builds.apache.org/job/Mesos-Trunk-Ubuntu-Build-In-Src-Set-JAVA_HOME/ws/third_party/protobuf-2.3.0/src/google/protobuf/message_lite.h>:43:0,
                 from <https://builds.apache.org/job/Mesos-Trunk-Ubuntu-Build-In-Src-Set-JAVA_HOME/ws/third_party/protobuf-2.3.0/src/google/protobuf/repeated_field.h>:52,
                 from <https://builds.apache.org/job/Mesos-Trunk-Ubuntu-Build-In-Src-Set-JAVA_HOME/ws/src/mesos.pb.h>:23,
                 from <https://builds.apache.org/job/Mesos-Trunk-Ubuntu-Build-In-Src-Set-JAVA_HOME/ws/include/mesos/mesos.hpp>:1,
                 from <https://builds.apache.org/job/Mesos-Trunk-Ubuntu-Build-In-Src-Set-JAVA_HOME/ws/include/mesos/executor.hpp>:24,
                 from native/module.cpp:40:
<https://builds.apache.org/job/Mesos-Trunk-Ubuntu-Build-In-Src-Set-JAVA_HOME/ws/third_party/protobuf-2.3.0/src/google/protobuf/io/coded_stream.h>:
In member function 'bool google::protobuf::io::CodedInputStream::ReadLittleEndian32(google::protobuf::uint32*)':
<https://builds.apache.org/job/Mesos-Trunk-Ubuntu-Build-In-Src-Set-JAVA_HOME/ws/third_party/protobuf-2.3.0/src/google/protobuf/io/coded_stream.h>:776:7:
warning: comparison between signed and unsigned integer expressions
<https://builds.apache.org/job/Mesos-Trunk-Ubuntu-Build-In-Src-Set-JAVA_HOME/ws/third_party/protobuf-2.3.0/src/google/protobuf/io/coded_stream.h>:
In member function 'bool google::protobuf::io::CodedInputStream::ReadLittleEndian64(google::protobuf::uint64*)':
<https://builds.apache.org/job/Mesos-Trunk-Ubuntu-Build-In-Src-Set-JAVA_HOME/ws/third_party/protobuf-2.3.0/src/google/protobuf/io/coded_stream.h>:791:7:
warning: comparison between signed and unsigned integer expressions
gcc -pthread -fno-strict-aliasing -DNDEBUG -g -fwrapv -O2 -Wall -Wstrict-prototypes -fPIC
-I<https://builds.apache.org/job/Mesos-Trunk-Ubuntu-Build-In-Src-Set-JAVA_HOME/ws/include>
-I<https://builds.apache.org/job/Mesos-Trunk-Ubuntu-Build-In-Src-Set-JAVA_HOME/ws/include>
-I<https://builds.apache.org/job/Mesos-Trunk-Ubuntu-Build-In-Src-Set-JAVA_HOME/ws/src>
-I<https://builds.apache.org/job/Mesos-Trunk-Ubuntu-Build-In-Src-Set-JAVA_HOME/ws/src/python/native>
-I<https://builds.apache.org/job/Mesos-Trunk-Ubuntu-Build-In-Src-Set-JAVA_HOME/ws/third_party/protobuf-2.3.0/src>
-I/usr/include/python2.6 -c native/proxy_scheduler.cpp -o build/temp.linux-x86_64-2.6/native/proxy_scheduler.o
cc1plus: warning: command line option "-Wstrict-prototypes" is valid for Ada/C/ObjC but not
for C++
In file included from /usr/include/python2.6/Python.h:8:0,
                 from native/proxy_scheduler.hpp:27,
                 from native/proxy_scheduler.cpp:21:
/usr/include/python2.6/pyconfig.h:1031:0: warning: "_POSIX_C_SOURCE" redefined
/usr/include/features.h:163:0: note: this is the location of the previous definition
/usr/include/python2.6/pyconfig.h:1040:0: warning: "_XOPEN_SOURCE" redefined
/usr/include/features.h:165:0: note: this is the location of the previous definition
In file included from <https://builds.apache.org/job/Mesos-Trunk-Ubuntu-Build-In-Src-Set-JAVA_HOME/ws/third_party/protobuf-2.3.0/src/google/protobuf/message_lite.h>:43:0,
                 from <https://builds.apache.org/job/Mesos-Trunk-Ubuntu-Build-In-Src-Set-JAVA_HOME/ws/third_party/protobuf-2.3.0/src/google/protobuf/repeated_field.h>:52,
                 from <https://builds.apache.org/job/Mesos-Trunk-Ubuntu-Build-In-Src-Set-JAVA_HOME/ws/src/mesos.pb.h>:23,
                 from <https://builds.apache.org/job/Mesos-Trunk-Ubuntu-Build-In-Src-Set-JAVA_HOME/ws/include/mesos/mesos.hpp>:1,
                 from <https://builds.apache.org/job/Mesos-Trunk-Ubuntu-Build-In-Src-Set-JAVA_HOME/ws/include/mesos/scheduler.hpp>:26,
                 from native/proxy_scheduler.hpp:32,
                 from native/proxy_scheduler.cpp:21:
<https://builds.apache.org/job/Mesos-Trunk-Ubuntu-Build-In-Src-Set-JAVA_HOME/ws/third_party/protobuf-2.3.0/src/google/protobuf/io/coded_stream.h>:
In member function 'bool google::protobuf::io::CodedInputStream::ReadLittleEndian32(google::protobuf::uint32*)':
<https://builds.apache.org/job/Mesos-Trunk-Ubuntu-Build-In-Src-Set-JAVA_HOME/ws/third_party/protobuf-2.3.0/src/google/protobuf/io/coded_stream.h>:776:7:
warning: comparison between signed and unsigned integer expressions
<https://builds.apache.org/job/Mesos-Trunk-Ubuntu-Build-In-Src-Set-JAVA_HOME/ws/third_party/protobuf-2.3.0/src/google/protobuf/io/coded_stream.h>:
In member function 'bool google::protobuf::io::CodedInputStream::ReadLittleEndian64(google::protobuf::uint64*)':
<https://builds.apache.org/job/Mesos-Trunk-Ubuntu-Build-In-Src-Set-JAVA_HOME/ws/third_party/protobuf-2.3.0/src/google/protobuf/io/coded_stream.h>:791:7:
warning: comparison between signed and unsigned integer expressions
native/proxy_scheduler.cpp: In member function 'virtual void mesos::python::ProxyScheduler::resourceOffers(mesos::SchedulerDriver*,
const std::vector<mesos::Offer>&)':
native/proxy_scheduler.cpp:81:35: warning: comparison between signed and unsigned integer
expressions
gcc -pthread -fno-strict-aliasing -DNDEBUG -g -fwrapv -O2 -Wall -Wstrict-prototypes -fPIC
-I<https://builds.apache.org/job/Mesos-Trunk-Ubuntu-Build-In-Src-Set-JAVA_HOME/ws/include>
-I<https://builds.apache.org/job/Mesos-Trunk-Ubuntu-Build-In-Src-Set-JAVA_HOME/ws/include>
-I<https://builds.apache.org/job/Mesos-Trunk-Ubuntu-Build-In-Src-Set-JAVA_HOME/ws/src>
-I<https://builds.apache.org/job/Mesos-Trunk-Ubuntu-Build-In-Src-Set-JAVA_HOME/ws/src/python/native>
-I<https://builds.apache.org/job/Mesos-Trunk-Ubuntu-Build-In-Src-Set-JAVA_HOME/ws/third_party/protobuf-2.3.0/src>
-I/usr/include/python2.6 -c native/mesos_executor_driver_impl.cpp -o build/temp.linux-x86_64-2.6/native/mesos_executor_driver_impl.o
cc1plus: warning: command line option "-Wstrict-prototypes" is valid for Ada/C/ObjC but not
for C++
In file included from <https://builds.apache.org/job/Mesos-Trunk-Ubuntu-Build-In-Src-Set-JAVA_HOME/ws/third_party/protobuf-2.3.0/src/google/protobuf/message_lite.h>:43:0,
                 from <https://builds.apache.org/job/Mesos-Trunk-Ubuntu-Build-In-Src-Set-JAVA_HOME/ws/third_party/protobuf-2.3.0/src/google/protobuf/repeated_field.h>:52,
                 from <https://builds.apache.org/job/Mesos-Trunk-Ubuntu-Build-In-Src-Set-JAVA_HOME/ws/src/mesos.pb.h>:23,
                 from <https://builds.apache.org/job/Mesos-Trunk-Ubuntu-Build-In-Src-Set-JAVA_HOME/ws/include/mesos/mesos.hpp>:1,
                 from <https://builds.apache.org/job/Mesos-Trunk-Ubuntu-Build-In-Src-Set-JAVA_HOME/ws/include/mesos/executor.hpp>:24,
                 from native/mesos_executor_driver_impl.hpp:22,
                 from native/mesos_executor_driver_impl.cpp:26:
<https://builds.apache.org/job/Mesos-Trunk-Ubuntu-Build-In-Src-Set-JAVA_HOME/ws/third_party/protobuf-2.3.0/src/google/protobuf/io/coded_stream.h>:
In member function 'bool google::protobuf::io::CodedInputStream::ReadLittleEndian32(google::protobuf::uint32*)':
<https://builds.apache.org/job/Mesos-Trunk-Ubuntu-Build-In-Src-Set-JAVA_HOME/ws/third_party/protobuf-2.3.0/src/google/protobuf/io/coded_stream.h>:776:7:
warning: comparison between signed and unsigned integer expressions
<https://builds.apache.org/job/Mesos-Trunk-Ubuntu-Build-In-Src-Set-JAVA_HOME/ws/third_party/protobuf-2.3.0/src/google/protobuf/io/coded_stream.h>:
In member function 'bool google::protobuf::io::CodedInputStream::ReadLittleEndian64(google::protobuf::uint64*)':
<https://builds.apache.org/job/Mesos-Trunk-Ubuntu-Build-In-Src-Set-JAVA_HOME/ws/third_party/protobuf-2.3.0/src/google/protobuf/io/coded_stream.h>:791:7:
warning: comparison between signed and unsigned integer expressions
gcc -pthread -fno-strict-aliasing -DNDEBUG -g -fwrapv -O2 -Wall -Wstrict-prototypes -fPIC
-I<https://builds.apache.org/job/Mesos-Trunk-Ubuntu-Build-In-Src-Set-JAVA_HOME/ws/include>
-I<https://builds.apache.org/job/Mesos-Trunk-Ubuntu-Build-In-Src-Set-JAVA_HOME/ws/include>
-I<https://builds.apache.org/job/Mesos-Trunk-Ubuntu-Build-In-Src-Set-JAVA_HOME/ws/src>
-I<https://builds.apache.org/job/Mesos-Trunk-Ubuntu-Build-In-Src-Set-JAVA_HOME/ws/src/python/native>
-I<https://builds.apache.org/job/Mesos-Trunk-Ubuntu-Build-In-Src-Set-JAVA_HOME/ws/third_party/protobuf-2.3.0/src>
-I/usr/include/python2.6 -c native/proxy_executor.cpp -o build/temp.linux-x86_64-2.6/native/proxy_executor.o
cc1plus: warning: command line option "-Wstrict-prototypes" is valid for Ada/C/ObjC but not
for C++
In file included from /usr/include/python2.6/Python.h:8:0,
                 from native/proxy_executor.hpp:27,
                 from native/proxy_executor.cpp:21:
/usr/include/python2.6/pyconfig.h:1031:0: warning: "_POSIX_C_SOURCE" redefined
/usr/include/features.h:163:0: note: this is the location of the previous definition
/usr/include/python2.6/pyconfig.h:1040:0: warning: "_XOPEN_SOURCE" redefined
/usr/include/features.h:165:0: note: this is the location of the previous definition
In file included from <https://builds.apache.org/job/Mesos-Trunk-Ubuntu-Build-In-Src-Set-JAVA_HOME/ws/third_party/protobuf-2.3.0/src/google/protobuf/message_lite.h>:43:0,
                 from <https://builds.apache.org/job/Mesos-Trunk-Ubuntu-Build-In-Src-Set-JAVA_HOME/ws/third_party/protobuf-2.3.0/src/google/protobuf/repeated_field.h>:52,
                 from <https://builds.apache.org/job/Mesos-Trunk-Ubuntu-Build-In-Src-Set-JAVA_HOME/ws/src/mesos.pb.h>:23,
                 from <https://builds.apache.org/job/Mesos-Trunk-Ubuntu-Build-In-Src-Set-JAVA_HOME/ws/include/mesos/mesos.hpp>:1,
                 from <https://builds.apache.org/job/Mesos-Trunk-Ubuntu-Build-In-Src-Set-JAVA_HOME/ws/include/mesos/executor.hpp>:24,
                 from native/proxy_executor.hpp:32,
                 from native/proxy_executor.cpp:21:
<https://builds.apache.org/job/Mesos-Trunk-Ubuntu-Build-In-Src-Set-JAVA_HOME/ws/third_party/protobuf-2.3.0/src/google/protobuf/io/coded_stream.h>:
In member function 'bool google::protobuf::io::CodedInputStream::ReadLittleEndian32(google::protobuf::uint32*)':
<https://builds.apache.org/job/Mesos-Trunk-Ubuntu-Build-In-Src-Set-JAVA_HOME/ws/third_party/protobuf-2.3.0/src/google/protobuf/io/coded_stream.h>:776:7:
warning: comparison between signed and unsigned integer expressions
<https://builds.apache.org/job/Mesos-Trunk-Ubuntu-Build-In-Src-Set-JAVA_HOME/ws/third_party/protobuf-2.3.0/src/google/protobuf/io/coded_stream.h>:
In member function 'bool google::protobuf::io::CodedInputStream::ReadLittleEndian64(google::protobuf::uint64*)':
<https://builds.apache.org/job/Mesos-Trunk-Ubuntu-Build-In-Src-Set-JAVA_HOME/ws/third_party/protobuf-2.3.0/src/google/protobuf/io/coded_stream.h>:791:7:
warning: comparison between signed and unsigned integer expressions
g++ -pthread -shared -Wl,-O1 -Wl,-Bsymbolic-functions build/temp.linux-x86_64-2.6/native/mesos_scheduler_driver_impl.o
build/temp.linux-x86_64-2.6/native/module.o build/temp.linux-x86_64-2.6/native/proxy_scheduler.o
build/temp.linux-x86_64-2.6/native/mesos_executor_driver_impl.o build/temp.linux-x86_64-2.6/native/proxy_executor.o
<https://builds.apache.org/job/Mesos-Trunk-Ubuntu-Build-In-Src-Set-JAVA_HOME/ws/src/.libs/libmesos_no_third_party.a>
<https://builds.apache.org/job/Mesos-Trunk-Ubuntu-Build-In-Src-Set-JAVA_HOME/ws/third_party/protobuf-2.3.0/src/.libs/libprotobuf.a>
<https://builds.apache.org/job/Mesos-Trunk-Ubuntu-Build-In-Src-Set-JAVA_HOME/ws/third_party/glog-0.3.1/.libs/libglog.a>
<https://builds.apache.org/job/Mesos-Trunk-Ubuntu-Build-In-Src-Set-JAVA_HOME/ws/third_party/zookeeper-3.3.4/src/c/.libs/libzookeeper_mt.a>
<https://builds.apache.org/job/Mesos-Trunk-Ubuntu-Build-In-Src-Set-JAVA_HOME/ws/third_party/libprocess/.libs/libprocess.a>
<https://builds.apache.org/job/Mesos-Trunk-Ubuntu-Build-In-Src-Set-JAVA_HOME/ws/third_party/libprocess/third_party/libev-3.8/.libs/libev.a>
-o build/lib.linux-x86_64-2.6/_mesos.so
creating build/bdist.linux-x86_64/egg
copying build/lib.linux-x86_64-2.6/_mesos.so -> build/bdist.linux-x86_64/egg
copying build/lib.linux-x86_64-2.6/mesos_pb2.py -> build/bdist.linux-x86_64/egg
copying build/lib.linux-x86_64-2.6/mesos.py -> build/bdist.linux-x86_64/egg
byte-compiling build/bdist.linux-x86_64/egg/mesos_pb2.py to mesos_pb2.pyc
byte-compiling build/bdist.linux-x86_64/egg/mesos.py to mesos.pyc
creating stub loader for _mesos.so
byte-compiling build/bdist.linux-x86_64/egg/_mesos.py to _mesos.pyc
creating build/bdist.linux-x86_64/egg/EGG-INFO
copying src/mesos.egg-info/PKG-INFO -> build/bdist.linux-x86_64/egg/EGG-INFO
copying src/mesos.egg-info/SOURCES.txt -> build/bdist.linux-x86_64/egg/EGG-INFO
copying src/mesos.egg-info/dependency_links.txt -> build/bdist.linux-x86_64/egg/EGG-INFO
copying src/mesos.egg-info/top_level.txt -> build/bdist.linux-x86_64/egg/EGG-INFO
writing build/bdist.linux-x86_64/egg/EGG-INFO/native_libs.txt
zip_safe flag not set; analyzing archive contents...
creating 'dist/mesos-0.0.1-py2.6-linux-x86_64.egg' and adding 'build/bdist.linux-x86_64/egg'
to it
removing 'build/bdist.linux-x86_64/egg' (and everything under it)
/bin/bash ../libtool --tag=CXX   --mode=link g++  -g2 -O2 -L/home/jenkins/tools/java/jdk1.6.0_20-64/jre/lib/amd64/server
-R/home/jenkins/tools/java/jdk1.6.0_20-64/jre/lib/amd64/server -Wl,-ljvm   -o mesos-tests
tests/mesos_tests-main.o tests/mesos_tests-utils.o tests/mesos_tests-master_tests.o tests/mesos_tests-resource_offers_tests.o
tests/mesos_tests-fault_tolerance_tests.o tests/mesos_tests-log_tests.o tests/mesos_tests-resources_tests.o
tests/mesos_tests-uuid_tests.o tests/mesos_tests-external_tests.o tests/mesos_tests-sample_frameworks_tests.o
tests/mesos_tests-configurator_tests.o tests/mesos_tests-strings_tests.o tests/mesos_tests-multihashmap_tests.o
tests/mesos_tests-protobuf_io_tests.o tests/mesos_tests-lxc_isolation_tests.o tests/mesos_tests-utils_tests.o
tests/mesos_tests-url_processor_tests.o tests/mesos_tests-killtree_tests.o tests/mesos_tests-exception_tests.o
tests/mesos_tests-zookeeper_server.o tests/mesos_tests-base_zookeeper_test.o tests/mesos_tests-zookeeper_server_tests.o
tests/mesos_tests-zookeeper_tests.o ../third_party/libgmock.la libmesos.la -lrt
libtool: link: g++ -g2 -O2 -Wl,-ljvm -o .libs/mesos-tests tests/mesos_tests-main.o tests/mesos_tests-utils.o
tests/mesos_tests-master_tests.o tests/mesos_tests-resource_offers_tests.o tests/mesos_tests-fault_tolerance_tests.o
tests/mesos_tests-log_tests.o tests/mesos_tests-resources_tests.o tests/mesos_tests-uuid_tests.o
tests/mesos_tests-external_tests.o tests/mesos_tests-sample_frameworks_tests.o tests/mesos_tests-configurator_tests.o
tests/mesos_tests-strings_tests.o tests/mesos_tests-multihashmap_tests.o tests/mesos_tests-protobuf_io_tests.o
tests/mesos_tests-lxc_isolation_tests.o tests/mesos_tests-utils_tests.o tests/mesos_tests-url_processor_tests.o
tests/mesos_tests-killtree_tests.o tests/mesos_tests-exception_tests.o tests/mesos_tests-zookeeper_server.o
tests/mesos_tests-base_zookeeper_test.o tests/mesos_tests-zookeeper_server_tests.o tests/mesos_tests-zookeeper_tests.o
 -L/home/jenkins/tools/java/jdk1.6.0_20-64/jre/lib/amd64/server ../third_party/.libs/libgmock.a
./.libs/libmesos.so -lrt -pthread -Wl,-rpath -Wl,/home/jenkins/tools/java/jdk1.6.0_20-64/jre/lib/amd64/server
make[3]: Nothing to be done for `examples/python/test_framework.py'.
make[3]: Nothing to be done for `examples/python/test-framework'.
make[3]: Nothing to be done for `examples/python/test_executor.py'.
make[3]: Nothing to be done for `examples/python/test-executor'.
make[3]: Nothing to be done for `tests/external/LxcIsolation/HoldMoreMemThanRequested.sh'.
make[3]: Nothing to be done for `tests/external/LxcIsolation/ScaleUpAndDown.sh'.
make[3]: Nothing to be done for `tests/external/LxcIsolation/TwoSeparateTasks.sh'.
make[3]: Nothing to be done for `tests/external/LxcIsolation/run_scheduled_memhog_test.sh'.
make[3]: Nothing to be done for `tests/external/SampleFrameworks/CppFramework.sh'.
make[3]: Nothing to be done for `tests/external/SampleFrameworks/JavaExceptionFramework.sh'.
make[3]: Nothing to be done for `tests/external/SampleFrameworks/JavaFramework.sh'.
make[3]: Nothing to be done for `tests/external/SampleFrameworks/PythonFramework.sh'.
make[3]: Nothing to be done for `tests/external/KillTree/KillTreeTest.sh'.
make[3]: Leaving directory `<https://builds.apache.org/job/Mesos-Trunk-Ubuntu-Build-In-Src-Set-JAVA_HOME/ws/src'>
make  check-TESTS
make[3]: Entering directory `<https://builds.apache.org/job/Mesos-Trunk-Ubuntu-Build-In-Src-Set-JAVA_HOME/ws/src'>
/bin/bash ../libtool --tag=CXX   --mode=link g++  -g2 -O2   -o libbuild.la  common/libbuild_la-build.lo
 -lrt
libtool: link: rm -fr  .libs/libbuild.a .libs/libbuild.la
libtool: link: ar cru .libs/libbuild.a common/.libs/libbuild_la-build.o 
libtool: link: ranlib .libs/libbuild.a
libtool: link: ( cd ".libs" && rm -f "libbuild.la" && ln -s "../libbuild.la"
"libbuild.la" )
/bin/bash ../libtool --tag=CXX   --mode=link g++  -g2 -O2   -o libmesos_no_third_party.la
 sched/libmesos_no_third_party_la-sched.lo local/libmesos_no_third_party_la-local.lo master/libmesos_no_third_party_la-master.lo
master/libmesos_no_third_party_la-http.lo master/libmesos_no_third_party_la-slaves_manager.lo
master/libmesos_no_third_party_la-frameworks_manager.lo master/libmesos_no_third_party_la-allocator_factory.lo
master/libmesos_no_third_party_la-simple_allocator.lo slave/libmesos_no_third_party_la-slave.lo
slave/libmesos_no_third_party_la-http.lo slave/libmesos_no_third_party_la-isolation_module.lo
slave/libmesos_no_third_party_la-process_based_isolation_module.lo slave/libmesos_no_third_party_la-reaper.lo
launcher/libmesos_no_third_party_la-launcher.lo exec/libmesos_no_third_party_la-exec.lo common/libmesos_no_third_party_la-fatal.lo
common/libmesos_no_third_party_la-lock.lo detector/libmesos_no_third_party_la-detector.lo
detector/libmesos_no_third_party_la-url_processor.lo configurator/libmesos_no_third_party_la-configurator.lo
common/libmesos_no_third_party_la-logging.lo common/libmesos_no_third_party_la-utils.lo common/libmesos_no_third_party_la-date_utils.lo
common/libmesos_no_third_party_la-resources.lo common/libmesos_no_third_party_la-attributes.lo
common/libmesos_no_third_party_la-values.lo zookeeper/libmesos_no_third_party_la-zookeeper.lo
zookeeper/libmesos_no_third_party_la-authentication.lo zookeeper/libmesos_no_third_party_la-group.lo
slave/libmesos_no_third_party_la-lxc_isolation_module.lo libmesos_no_third_party_la-mesos.pb.lo
messages/libmesos_no_third_party_la-messages.pb.lo libbuild.la liblog.la -lrt
libtool: link: rm -fr  .libs/libmesos_no_third_party.a .libs/libmesos_no_third_party.la
libtool: link: (cd .libs/libmesos_no_third_party.lax/libbuild.a && ar x "<https://builds.apache.org/job/Mesos-Trunk-Ubuntu-Build-In-Src-Set-JAVA_HOME/ws/src/./.libs/libbuild.a")>
libtool: link: (cd .libs/libmesos_no_third_party.lax/liblog.a && ar x "<https://builds.apache.org/job/Mesos-Trunk-Ubuntu-Build-In-Src-Set-JAVA_HOME/ws/src/./.libs/liblog.a")>
copying selected object files to avoid basename conflicts...
libtool: link: ln slave/.libs/libmesos_no_third_party_la-http.o .libs/libmesos_no_third_party.lax/lt1-libmesos_no_third_party_la-http.o
|| cp slave/.libs/libmesos_no_third_party_la-http.o .libs/libmesos_no_third_party.lax/lt1-libmesos_no_third_party_la-http.o
libtool: link: ar cru .libs/libmesos_no_third_party.a sched/.libs/libmesos_no_third_party_la-sched.o
local/.libs/libmesos_no_third_party_la-local.o master/.libs/libmesos_no_third_party_la-master.o
master/.libs/libmesos_no_third_party_la-http.o master/.libs/libmesos_no_third_party_la-slaves_manager.o
master/.libs/libmesos_no_third_party_la-frameworks_manager.o master/.libs/libmesos_no_third_party_la-allocator_factory.o
master/.libs/libmesos_no_third_party_la-simple_allocator.o slave/.libs/libmesos_no_third_party_la-slave.o
.libs/libmesos_no_third_party.lax/lt1-libmesos_no_third_party_la-http.o slave/.libs/libmesos_no_third_party_la-isolation_module.o
slave/.libs/libmesos_no_third_party_la-process_based_isolation_module.o slave/.libs/libmesos_no_third_party_la-reaper.o
launcher/.libs/libmesos_no_third_party_la-launcher.o exec/.libs/libmesos_no_third_party_la-exec.o
common/.libs/libmesos_no_third_party_la-fatal.o common/.libs/libmesos_no_third_party_la-lock.o
detector/.libs/libmesos_no_third_party_la-detector.o detector/.libs/libmesos_no_third_party_la-url_processor.o
configurator/.libs/libmesos_no_third_party_la-configurator.o common/.libs/libmesos_no_third_party_la-logging.o
common/.libs/libmesos_no_third_party_la-utils.o common/.libs/libmesos_no_third_party_la-date_utils.o
common/.libs/libmesos_no_third_party_la-resources.o common/.libs/libmesos_no_third_party_la-attributes.o
common/.libs/libmesos_no_third_party_la-values.o zookeeper/.libs/libmesos_no_third_party_la-zookeeper.o
zookeeper/.libs/libmesos_no_third_party_la-authentication.o zookeeper/.libs/libmesos_no_third_party_la-group.o
slave/.libs/libmesos_no_third_party_la-lxc_isolation_module.o .libs/libmesos_no_third_party_la-mesos.pb.o
messages/.libs/libmesos_no_third_party_la-messages.pb.o .libs/libmesos_no_third_party.lax/libbuild.a/libbuild_la-build.o
.libs/libmesos_no_third_party.lax/liblog.a/liblog_la-log.pb.o .libs/libmesos_no_third_party.lax/liblog.a/liblog_la-replica.o
.libs/libmesos_no_third_party.lax/liblog.a/liblog_la-coordinator.o
libtool: link: ranlib .libs/libmesos_no_third_party.a
libtool: link: rm -fr .libs/libmesos_no_third_party.lax .libs/libmesos_no_third_party.lax
libtool: link: ( cd ".libs" && rm -f "libmesos_no_third_party.la" && ln -s
"../libmesos_no_third_party.la" "libmesos_no_third_party.la" )
Building Mesos Python egg ...
WARNING: '.' not a valid package name; please use only.-separated package names in setup.py
running bdist_egg
running egg_info
writing src/mesos.egg-info/PKG-INFO
writing top-level names to src/mesos.egg-info/top_level.txt
writing dependency_links to src/mesos.egg-info/dependency_links.txt
package init file 'src/__init__.py' not found (or not a regular file)
writing manifest file 'src/mesos.egg-info/SOURCES.txt'
installing library code to build/bdist.linux-x86_64/egg
running install_lib
running build_py
running build_ext
building '_mesos' extension
gcc -pthread -fno-strict-aliasing -DNDEBUG -g -fwrapv -O2 -Wall -Wstrict-prototypes -fPIC
-I<https://builds.apache.org/job/Mesos-Trunk-Ubuntu-Build-In-Src-Set-JAVA_HOME/ws/include>
-I<https://builds.apache.org/job/Mesos-Trunk-Ubuntu-Build-In-Src-Set-JAVA_HOME/ws/include>
-I<https://builds.apache.org/job/Mesos-Trunk-Ubuntu-Build-In-Src-Set-JAVA_HOME/ws/src>
-I<https://builds.apache.org/job/Mesos-Trunk-Ubuntu-Build-In-Src-Set-JAVA_HOME/ws/src/python/native>
-I<https://builds.apache.org/job/Mesos-Trunk-Ubuntu-Build-In-Src-Set-JAVA_HOME/ws/third_party/protobuf-2.3.0/src>
-I/usr/include/python2.6 -c native/mesos_scheduler_driver_impl.cpp -o build/temp.linux-x86_64-2.6/native/mesos_scheduler_driver_impl.o
cc1plus: warning: command line option "-Wstrict-prototypes" is valid for Ada/C/ObjC but not
for C++
In file included from <https://builds.apache.org/job/Mesos-Trunk-Ubuntu-Build-In-Src-Set-JAVA_HOME/ws/third_party/protobuf-2.3.0/src/google/protobuf/message_lite.h>:43:0,
                 from <https://builds.apache.org/job/Mesos-Trunk-Ubuntu-Build-In-Src-Set-JAVA_HOME/ws/third_party/protobuf-2.3.0/src/google/protobuf/repeated_field.h>:52,
                 from <https://builds.apache.org/job/Mesos-Trunk-Ubuntu-Build-In-Src-Set-JAVA_HOME/ws/src/mesos.pb.h>:23,
                 from <https://builds.apache.org/job/Mesos-Trunk-Ubuntu-Build-In-Src-Set-JAVA_HOME/ws/include/mesos/mesos.hpp>:1,
                 from <https://builds.apache.org/job/Mesos-Trunk-Ubuntu-Build-In-Src-Set-JAVA_HOME/ws/include/mesos/scheduler.hpp>:26,
                 from native/mesos_scheduler_driver_impl.hpp:22,
                 from native/mesos_scheduler_driver_impl.cpp:26:
<https://builds.apache.org/job/Mesos-Trunk-Ubuntu-Build-In-Src-Set-JAVA_HOME/ws/third_party/protobuf-2.3.0/src/google/protobuf/io/coded_stream.h>:
In member function 'bool google::protobuf::io::CodedInputStream::ReadLittleEndian32(google::protobuf::uint32*)':
<https://builds.apache.org/job/Mesos-Trunk-Ubuntu-Build-In-Src-Set-JAVA_HOME/ws/third_party/protobuf-2.3.0/src/google/protobuf/io/coded_stream.h>:776:7:
warning: comparison between signed and unsigned integer expressions
<https://builds.apache.org/job/Mesos-Trunk-Ubuntu-Build-In-Src-Set-JAVA_HOME/ws/third_party/protobuf-2.3.0/src/google/protobuf/io/coded_stream.h>:
In member function 'bool google::protobuf::io::CodedInputStream::ReadLittleEndian64(google::protobuf::uint64*)':
<https://builds.apache.org/job/Mesos-Trunk-Ubuntu-Build-In-Src-Set-JAVA_HOME/ws/third_party/protobuf-2.3.0/src/google/protobuf/io/coded_stream.h>:791:7:
warning: comparison between signed and unsigned integer expressions
gcc -pthread -fno-strict-aliasing -DNDEBUG -g -fwrapv -O2 -Wall -Wstrict-prototypes -fPIC
-I<https://builds.apache.org/job/Mesos-Trunk-Ubuntu-Build-In-Src-Set-JAVA_HOME/ws/include>
-I<https://builds.apache.org/job/Mesos-Trunk-Ubuntu-Build-In-Src-Set-JAVA_HOME/ws/include>
-I<https://builds.apache.org/job/Mesos-Trunk-Ubuntu-Build-In-Src-Set-JAVA_HOME/ws/src>
-I<https://builds.apache.org/job/Mesos-Trunk-Ubuntu-Build-In-Src-Set-JAVA_HOME/ws/src/python/native>
-I<https://builds.apache.org/job/Mesos-Trunk-Ubuntu-Build-In-Src-Set-JAVA_HOME/ws/third_party/protobuf-2.3.0/src>
-I/usr/include/python2.6 -c native/module.cpp -o build/temp.linux-x86_64-2.6/native/module.o
cc1plus: warning: command line option "-Wstrict-prototypes" is valid for Ada/C/ObjC but not
for C++
In file included from <https://builds.apache.org/job/Mesos-Trunk-Ubuntu-Build-In-Src-Set-JAVA_HOME/ws/third_party/protobuf-2.3.0/src/google/protobuf/message_lite.h>:43:0,
                 from <https://builds.apache.org/job/Mesos-Trunk-Ubuntu-Build-In-Src-Set-JAVA_HOME/ws/third_party/protobuf-2.3.0/src/google/protobuf/repeated_field.h>:52,
                 from <https://builds.apache.org/job/Mesos-Trunk-Ubuntu-Build-In-Src-Set-JAVA_HOME/ws/src/mesos.pb.h>:23,
                 from <https://builds.apache.org/job/Mesos-Trunk-Ubuntu-Build-In-Src-Set-JAVA_HOME/ws/include/mesos/mesos.hpp>:1,
                 from <https://builds.apache.org/job/Mesos-Trunk-Ubuntu-Build-In-Src-Set-JAVA_HOME/ws/include/mesos/executor.hpp>:24,
                 from native/module.cpp:40:
<https://builds.apache.org/job/Mesos-Trunk-Ubuntu-Build-In-Src-Set-JAVA_HOME/ws/third_party/protobuf-2.3.0/src/google/protobuf/io/coded_stream.h>:
In member function 'bool google::protobuf::io::CodedInputStream::ReadLittleEndian32(google::protobuf::uint32*)':
<https://builds.apache.org/job/Mesos-Trunk-Ubuntu-Build-In-Src-Set-JAVA_HOME/ws/third_party/protobuf-2.3.0/src/google/protobuf/io/coded_stream.h>:776:7:
warning: comparison between signed and unsigned integer expressions
<https://builds.apache.org/job/Mesos-Trunk-Ubuntu-Build-In-Src-Set-JAVA_HOME/ws/third_party/protobuf-2.3.0/src/google/protobuf/io/coded_stream.h>:
In member function 'bool google::protobuf::io::CodedInputStream::ReadLittleEndian64(google::protobuf::uint64*)':
<https://builds.apache.org/job/Mesos-Trunk-Ubuntu-Build-In-Src-Set-JAVA_HOME/ws/third_party/protobuf-2.3.0/src/google/protobuf/io/coded_stream.h>:791:7:
warning: comparison between signed and unsigned integer expressions
gcc -pthread -fno-strict-aliasing -DNDEBUG -g -fwrapv -O2 -Wall -Wstrict-prototypes -fPIC
-I<https://builds.apache.org/job/Mesos-Trunk-Ubuntu-Build-In-Src-Set-JAVA_HOME/ws/include>
-I<https://builds.apache.org/job/Mesos-Trunk-Ubuntu-Build-In-Src-Set-JAVA_HOME/ws/include>
-I<https://builds.apache.org/job/Mesos-Trunk-Ubuntu-Build-In-Src-Set-JAVA_HOME/ws/src>
-I<https://builds.apache.org/job/Mesos-Trunk-Ubuntu-Build-In-Src-Set-JAVA_HOME/ws/src/python/native>
-I<https://builds.apache.org/job/Mesos-Trunk-Ubuntu-Build-In-Src-Set-JAVA_HOME/ws/third_party/protobuf-2.3.0/src>
-I/usr/include/python2.6 -c native/proxy_scheduler.cpp -o build/temp.linux-x86_64-2.6/native/proxy_scheduler.o
cc1plus: warning: command line option "-Wstrict-prototypes" is valid for Ada/C/ObjC but not
for C++
In file included from /usr/include/python2.6/Python.h:8:0,
                 from native/proxy_scheduler.hpp:27,
                 from native/proxy_scheduler.cpp:21:
/usr/include/python2.6/pyconfig.h:1031:0: warning: "_POSIX_C_SOURCE" redefined
/usr/include/features.h:163:0: note: this is the location of the previous definition
/usr/include/python2.6/pyconfig.h:1040:0: warning: "_XOPEN_SOURCE" redefined
/usr/include/features.h:165:0: note: this is the location of the previous definition
In file included from <https://builds.apache.org/job/Mesos-Trunk-Ubuntu-Build-In-Src-Set-JAVA_HOME/ws/third_party/protobuf-2.3.0/src/google/protobuf/message_lite.h>:43:0,
                 from <https://builds.apache.org/job/Mesos-Trunk-Ubuntu-Build-In-Src-Set-JAVA_HOME/ws/third_party/protobuf-2.3.0/src/google/protobuf/repeated_field.h>:52,
                 from <https://builds.apache.org/job/Mesos-Trunk-Ubuntu-Build-In-Src-Set-JAVA_HOME/ws/src/mesos.pb.h>:23,
                 from <https://builds.apache.org/job/Mesos-Trunk-Ubuntu-Build-In-Src-Set-JAVA_HOME/ws/include/mesos/mesos.hpp>:1,
                 from <https://builds.apache.org/job/Mesos-Trunk-Ubuntu-Build-In-Src-Set-JAVA_HOME/ws/include/mesos/scheduler.hpp>:26,
                 from native/proxy_scheduler.hpp:32,
                 from native/proxy_scheduler.cpp:21:
<https://builds.apache.org/job/Mesos-Trunk-Ubuntu-Build-In-Src-Set-JAVA_HOME/ws/third_party/protobuf-2.3.0/src/google/protobuf/io/coded_stream.h>:
In member function 'bool google::protobuf::io::CodedInputStream::ReadLittleEndian32(google::protobuf::uint32*)':
<https://builds.apache.org/job/Mesos-Trunk-Ubuntu-Build-In-Src-Set-JAVA_HOME/ws/third_party/protobuf-2.3.0/src/google/protobuf/io/coded_stream.h>:776:7:
warning: comparison between signed and unsigned integer expressions
<https://builds.apache.org/job/Mesos-Trunk-Ubuntu-Build-In-Src-Set-JAVA_HOME/ws/third_party/protobuf-2.3.0/src/google/protobuf/io/coded_stream.h>:
In member function 'bool google::protobuf::io::CodedInputStream::ReadLittleEndian64(google::protobuf::uint64*)':
<https://builds.apache.org/job/Mesos-Trunk-Ubuntu-Build-In-Src-Set-JAVA_HOME/ws/third_party/protobuf-2.3.0/src/google/protobuf/io/coded_stream.h>:791:7:
warning: comparison between signed and unsigned integer expressions
native/proxy_scheduler.cpp: In member function 'virtual void mesos::python::ProxyScheduler::resourceOffers(mesos::SchedulerDriver*,
const std::vector<mesos::Offer>&)':
native/proxy_scheduler.cpp:81:35: warning: comparison between signed and unsigned integer
expressions
gcc -pthread -fno-strict-aliasing -DNDEBUG -g -fwrapv -O2 -Wall -Wstrict-prototypes -fPIC
-I<https://builds.apache.org/job/Mesos-Trunk-Ubuntu-Build-In-Src-Set-JAVA_HOME/ws/include>
-I<https://builds.apache.org/job/Mesos-Trunk-Ubuntu-Build-In-Src-Set-JAVA_HOME/ws/include>
-I<https://builds.apache.org/job/Mesos-Trunk-Ubuntu-Build-In-Src-Set-JAVA_HOME/ws/src>
-I<https://builds.apache.org/job/Mesos-Trunk-Ubuntu-Build-In-Src-Set-JAVA_HOME/ws/src/python/native>
-I<https://builds.apache.org/job/Mesos-Trunk-Ubuntu-Build-In-Src-Set-JAVA_HOME/ws/third_party/protobuf-2.3.0/src>
-I/usr/include/python2.6 -c native/mesos_executor_driver_impl.cpp -o build/temp.linux-x86_64-2.6/native/mesos_executor_driver_impl.o
cc1plus: warning: command line option "-Wstrict-prototypes" is valid for Ada/C/ObjC but not
for C++
In file included from <https://builds.apache.org/job/Mesos-Trunk-Ubuntu-Build-In-Src-Set-JAVA_HOME/ws/third_party/protobuf-2.3.0/src/google/protobuf/message_lite.h>:43:0,
                 from <https://builds.apache.org/job/Mesos-Trunk-Ubuntu-Build-In-Src-Set-JAVA_HOME/ws/third_party/protobuf-2.3.0/src/google/protobuf/repeated_field.h>:52,
                 from <https://builds.apache.org/job/Mesos-Trunk-Ubuntu-Build-In-Src-Set-JAVA_HOME/ws/src/mesos.pb.h>:23,
                 from <https://builds.apache.org/job/Mesos-Trunk-Ubuntu-Build-In-Src-Set-JAVA_HOME/ws/include/mesos/mesos.hpp>:1,
                 from <https://builds.apache.org/job/Mesos-Trunk-Ubuntu-Build-In-Src-Set-JAVA_HOME/ws/include/mesos/executor.hpp>:24,
                 from native/mesos_executor_driver_impl.hpp:22,
                 from native/mesos_executor_driver_impl.cpp:26:
<https://builds.apache.org/job/Mesos-Trunk-Ubuntu-Build-In-Src-Set-JAVA_HOME/ws/third_party/protobuf-2.3.0/src/google/protobuf/io/coded_stream.h>:
In member function 'bool google::protobuf::io::CodedInputStream::ReadLittleEndian32(google::protobuf::uint32*)':
<https://builds.apache.org/job/Mesos-Trunk-Ubuntu-Build-In-Src-Set-JAVA_HOME/ws/third_party/protobuf-2.3.0/src/google/protobuf/io/coded_stream.h>:776:7:
warning: comparison between signed and unsigned integer expressions
<https://builds.apache.org/job/Mesos-Trunk-Ubuntu-Build-In-Src-Set-JAVA_HOME/ws/third_party/protobuf-2.3.0/src/google/protobuf/io/coded_stream.h>:
In member function 'bool google::protobuf::io::CodedInputStream::ReadLittleEndian64(google::protobuf::uint64*)':
<https://builds.apache.org/job/Mesos-Trunk-Ubuntu-Build-In-Src-Set-JAVA_HOME/ws/third_party/protobuf-2.3.0/src/google/protobuf/io/coded_stream.h>:791:7:
warning: comparison between signed and unsigned integer expressions
gcc -pthread -fno-strict-aliasing -DNDEBUG -g -fwrapv -O2 -Wall -Wstrict-prototypes -fPIC
-I<https://builds.apache.org/job/Mesos-Trunk-Ubuntu-Build-In-Src-Set-JAVA_HOME/ws/include>
-I<https://builds.apache.org/job/Mesos-Trunk-Ubuntu-Build-In-Src-Set-JAVA_HOME/ws/include>
-I<https://builds.apache.org/job/Mesos-Trunk-Ubuntu-Build-In-Src-Set-JAVA_HOME/ws/src>
-I<https://builds.apache.org/job/Mesos-Trunk-Ubuntu-Build-In-Src-Set-JAVA_HOME/ws/src/python/native>
-I<https://builds.apache.org/job/Mesos-Trunk-Ubuntu-Build-In-Src-Set-JAVA_HOME/ws/third_party/protobuf-2.3.0/src>
-I/usr/include/python2.6 -c native/proxy_executor.cpp -o build/temp.linux-x86_64-2.6/native/proxy_executor.o
cc1plus: warning: command line option "-Wstrict-prototypes" is valid for Ada/C/ObjC but not
for C++
In file included from /usr/include/python2.6/Python.h:8:0,
                 from native/proxy_executor.hpp:27,
                 from native/proxy_executor.cpp:21:
/usr/include/python2.6/pyconfig.h:1031:0: warning: "_POSIX_C_SOURCE" redefined
/usr/include/features.h:163:0: note: this is the location of the previous definition
/usr/include/python2.6/pyconfig.h:1040:0: warning: "_XOPEN_SOURCE" redefined
/usr/include/features.h:165:0: note: this is the location of the previous definition
In file included from <https://builds.apache.org/job/Mesos-Trunk-Ubuntu-Build-In-Src-Set-JAVA_HOME/ws/third_party/protobuf-2.3.0/src/google/protobuf/message_lite.h>:43:0,
                 from <https://builds.apache.org/job/Mesos-Trunk-Ubuntu-Build-In-Src-Set-JAVA_HOME/ws/third_party/protobuf-2.3.0/src/google/protobuf/repeated_field.h>:52,
                 from <https://builds.apache.org/job/Mesos-Trunk-Ubuntu-Build-In-Src-Set-JAVA_HOME/ws/src/mesos.pb.h>:23,
                 from <https://builds.apache.org/job/Mesos-Trunk-Ubuntu-Build-In-Src-Set-JAVA_HOME/ws/include/mesos/mesos.hpp>:1,
                 from <https://builds.apache.org/job/Mesos-Trunk-Ubuntu-Build-In-Src-Set-JAVA_HOME/ws/include/mesos/executor.hpp>:24,
                 from native/proxy_executor.hpp:32,
                 from native/proxy_executor.cpp:21:
<https://builds.apache.org/job/Mesos-Trunk-Ubuntu-Build-In-Src-Set-JAVA_HOME/ws/third_party/protobuf-2.3.0/src/google/protobuf/io/coded_stream.h>:
In member function 'bool google::protobuf::io::CodedInputStream::ReadLittleEndian32(google::protobuf::uint32*)':
<https://builds.apache.org/job/Mesos-Trunk-Ubuntu-Build-In-Src-Set-JAVA_HOME/ws/third_party/protobuf-2.3.0/src/google/protobuf/io/coded_stream.h>:776:7:
warning: comparison between signed and unsigned integer expressions
<https://builds.apache.org/job/Mesos-Trunk-Ubuntu-Build-In-Src-Set-JAVA_HOME/ws/third_party/protobuf-2.3.0/src/google/protobuf/io/coded_stream.h>:
In member function 'bool google::protobuf::io::CodedInputStream::ReadLittleEndian64(google::protobuf::uint64*)':
<https://builds.apache.org/job/Mesos-Trunk-Ubuntu-Build-In-Src-Set-JAVA_HOME/ws/third_party/protobuf-2.3.0/src/google/protobuf/io/coded_stream.h>:791:7:
warning: comparison between signed and unsigned integer expressions
g++ -pthread -shared -Wl,-O1 -Wl,-Bsymbolic-functions build/temp.linux-x86_64-2.6/native/mesos_scheduler_driver_impl.o
build/temp.linux-x86_64-2.6/native/module.o build/temp.linux-x86_64-2.6/native/proxy_scheduler.o
build/temp.linux-x86_64-2.6/native/mesos_executor_driver_impl.o build/temp.linux-x86_64-2.6/native/proxy_executor.o
<https://builds.apache.org/job/Mesos-Trunk-Ubuntu-Build-In-Src-Set-JAVA_HOME/ws/src/.libs/libmesos_no_third_party.a>
<https://builds.apache.org/job/Mesos-Trunk-Ubuntu-Build-In-Src-Set-JAVA_HOME/ws/third_party/protobuf-2.3.0/src/.libs/libprotobuf.a>
<https://builds.apache.org/job/Mesos-Trunk-Ubuntu-Build-In-Src-Set-JAVA_HOME/ws/third_party/glog-0.3.1/.libs/libglog.a>
<https://builds.apache.org/job/Mesos-Trunk-Ubuntu-Build-In-Src-Set-JAVA_HOME/ws/third_party/zookeeper-3.3.4/src/c/.libs/libzookeeper_mt.a>
<https://builds.apache.org/job/Mesos-Trunk-Ubuntu-Build-In-Src-Set-JAVA_HOME/ws/third_party/libprocess/.libs/libprocess.a>
<https://builds.apache.org/job/Mesos-Trunk-Ubuntu-Build-In-Src-Set-JAVA_HOME/ws/third_party/libprocess/third_party/libev-3.8/.libs/libev.a>
-o build/lib.linux-x86_64-2.6/_mesos.so
creating build/bdist.linux-x86_64/egg
copying build/lib.linux-x86_64-2.6/_mesos.so -> build/bdist.linux-x86_64/egg
copying build/lib.linux-x86_64-2.6/mesos_pb2.py -> build/bdist.linux-x86_64/egg
copying build/lib.linux-x86_64-2.6/mesos.py -> build/bdist.linux-x86_64/egg
byte-compiling build/bdist.linux-x86_64/egg/mesos_pb2.py to mesos_pb2.pyc
byte-compiling build/bdist.linux-x86_64/egg/mesos.py to mesos.pyc
creating stub loader for _mesos.so
byte-compiling build/bdist.linux-x86_64/egg/_mesos.py to _mesos.pyc
creating build/bdist.linux-x86_64/egg/EGG-INFO
copying src/mesos.egg-info/PKG-INFO -> build/bdist.linux-x86_64/egg/EGG-INFO
copying src/mesos.egg-info/SOURCES.txt -> build/bdist.linux-x86_64/egg/EGG-INFO
copying src/mesos.egg-info/dependency_links.txt -> build/bdist.linux-x86_64/egg/EGG-INFO
copying src/mesos.egg-info/top_level.txt -> build/bdist.linux-x86_64/egg/EGG-INFO
writing build/bdist.linux-x86_64/egg/EGG-INFO/native_libs.txt
zip_safe flag not set; analyzing archive contents...
creating 'dist/mesos-0.0.1-py2.6-linux-x86_64.egg' and adding 'build/bdist.linux-x86_64/egg'
to it
removing 'build/bdist.linux-x86_64/egg' (and everything under it)
/bin/bash ../libtool --tag=CXX   --mode=link g++  -g2 -O2 -L/home/jenkins/tools/java/jdk1.6.0_20-64/jre/lib/amd64/server
-R/home/jenkins/tools/java/jdk1.6.0_20-64/jre/lib/amd64/server -Wl,-ljvm   -o mesos-tests
tests/mesos_tests-main.o tests/mesos_tests-utils.o tests/mesos_tests-master_tests.o tests/mesos_tests-resource_offers_tests.o
tests/mesos_tests-fault_tolerance_tests.o tests/mesos_tests-log_tests.o tests/mesos_tests-resources_tests.o
tests/mesos_tests-uuid_tests.o tests/mesos_tests-external_tests.o tests/mesos_tests-sample_frameworks_tests.o
tests/mesos_tests-configurator_tests.o tests/mesos_tests-strings_tests.o tests/mesos_tests-multihashmap_tests.o
tests/mesos_tests-protobuf_io_tests.o tests/mesos_tests-lxc_isolation_tests.o tests/mesos_tests-utils_tests.o
tests/mesos_tests-url_processor_tests.o tests/mesos_tests-killtree_tests.o tests/mesos_tests-exception_tests.o
tests/mesos_tests-zookeeper_server.o tests/mesos_tests-base_zookeeper_test.o tests/mesos_tests-zookeeper_server_tests.o
tests/mesos_tests-zookeeper_tests.o ../third_party/libgmock.la libmesos.la -lrt
libtool: link: g++ -g2 -O2 -Wl,-ljvm -o .libs/mesos-tests tests/mesos_tests-main.o tests/mesos_tests-utils.o
tests/mesos_tests-master_tests.o tests/mesos_tests-resource_offers_tests.o tests/mesos_tests-fault_tolerance_tests.o
tests/mesos_tests-log_tests.o tests/mesos_tests-resources_tests.o tests/mesos_tests-uuid_tests.o
tests/mesos_tests-external_tests.o tests/mesos_tests-sample_frameworks_tests.o tests/mesos_tests-configurator_tests.o
tests/mesos_tests-strings_tests.o tests/mesos_tests-multihashmap_tests.o tests/mesos_tests-protobuf_io_tests.o
tests/mesos_tests-lxc_isolation_tests.o tests/mesos_tests-utils_tests.o tests/mesos_tests-url_processor_tests.o
tests/mesos_tests-killtree_tests.o tests/mesos_tests-exception_tests.o tests/mesos_tests-zookeeper_server.o
tests/mesos_tests-base_zookeeper_test.o tests/mesos_tests-zookeeper_server_tests.o tests/mesos_tests-zookeeper_tests.o
 -L/home/jenkins/tools/java/jdk1.6.0_20-64/jre/lib/amd64/server ../third_party/.libs/libgmock.a
./.libs/libmesos.so -lrt -pthread -Wl,-rpath -Wl,/home/jenkins/tools/java/jdk1.6.0_20-64/jre/lib/amd64/server
<https://builds.apache.org/job/Mesos-Trunk-Ubuntu-Build-In-Src-Set-JAVA_HOME/ws/src/.libs/lt-mesos-tests>:
error while loading shared libraries: libzookeeper_mt.so.2: cannot open shared object file:
No such file or directory
FAIL: mesos-tests
==================
1 of 1 test failed
==================
make[3]: *** [check-TESTS] Error 1
make[3]: Leaving directory `<https://builds.apache.org/job/Mesos-Trunk-Ubuntu-Build-In-Src-Set-JAVA_HOME/ws/src'>
make[2]: *** [check-am] Error 2
make[2]: Leaving directory `<https://builds.apache.org/job/Mesos-Trunk-Ubuntu-Build-In-Src-Set-JAVA_HOME/ws/src'>
make[1]: *** [check] Error 2
make[1]: Leaving directory `<https://builds.apache.org/job/Mesos-Trunk-Ubuntu-Build-In-Src-Set-JAVA_HOME/ws/src'>
make: *** [check-recursive] Error 1
Build step 'Execute shell' marked build as failure


Mime
View raw message