incubator-isis-dev mailing list archives

Site index · List index
Message view « Date » · « Thread »
Top « Date » · « Thread »
From Apache Jenkins Server <jenk...@builds.apache.org>
Subject Build failed in Jenkins: isis-framework-ubuntu #382
Date Wed, 25 Jul 2012 00:12:53 GMT
See <https://builds.apache.org/job/isis-framework-ubuntu/382/>

------------------------------------------
[...truncated 12519 lines...]
[INFO] Wicket Viewer Model ............................... SKIPPED
[INFO] Wicket Viewer UI Components ....................... SKIPPED
[INFO] Wicket Viewer Implementation ...................... SKIPPED
[INFO] Wicket Viewer for TCK ............................. SKIPPED
[INFO] RestfulObjects Viewer ............................. SKIPPED
[INFO] RestfulObjects AppLib ............................. SKIPPED
[INFO] RestfulObjects Implementation ..................... SKIPPED
[INFO] RestfulObjects TCK ................................ SKIPPED
[INFO] BDD Viewers ....................................... SKIPPED
[INFO] BDD Viewers: Common ............................... SKIPPED
[INFO] BDD Viewers: Concordion ........................... SKIPPED
[INFO] BDD (Concordion) Tests against TCK ................ SKIPPED
[INFO] JUnit Viewer ...................................... SKIPPED
[INFO] JUnit Tests for TCK ............................... SKIPPED
[INFO] Apache Isis Quickstart Archetype .................. SKIPPED
[INFO] ------------------------------------------------------------------------
[INFO] BUILD FAILURE
[INFO] ------------------------------------------------------------------------
[INFO] Total time: 1:28.788s
[INFO] Finished at: Wed Jul 25 00:12:33 UTC 2012
[INFO] Final Memory: 134M/666M
[INFO] ------------------------------------------------------------------------
Projects to build: [MavenProject: org.apache.isis:isis:0.3.1-incubating-SNAPSHOT @ <https://builds.apache.org/job/isis-framework-ubuntu/ws/framework/pom.xml,> MavenProject: org.apache.isis.skins:classic-skin:0.3.1-incubating-SNAPSHOT @ <https://builds.apache.org/job/isis-framework-ubuntu/ws/framework/site-skin/pom.xml,> MavenProject: org.apache.isis:applib:0.3.1-incubating-SNAPSHOT @ <https://builds.apache.org/job/isis-framework-ubuntu/ws/framework/applib/pom.xml,> MavenProject: org.apache.isis:core:0.3.1-incubating-SNAPSHOT @ <https://builds.apache.org/job/isis-framework-ubuntu/ws/framework/core/pom.xml,> MavenProject: org.apache.isis.core:testsupport:0.3.1-incubating-SNAPSHOT @ <https://builds.apache.org/job/isis-framework-ubuntu/ws/framework/core/testsupport/pom.xml,> MavenProject: org.apache.isis.core:commons:0.3.1-incubating-SNAPSHOT @ <https://builds.apache.org/job/isis-framework-ubuntu/ws/framework/core/commons/pom.xml,> MavenProject: org.apache.isis.core:metamodel:0.3.1-incubating-SNAPSHOT @ <https://builds.apache.org/job/isis-framework-ubuntu/ws/framework/core/metamodel/pom.xml,> MavenProject: org.apache.isis.core:progmodel:0.3.1-incubating-SNAPSHOT @ <https://builds.apache.org/job/isis-framework-ubuntu/ws/framework/core/progmodel/pom.xml,> MavenProject: org.apache.isis.core:runtime:0.3.1-incubating-SNAPSHOT @ <https://builds.apache.org/job/isis-framework-ubuntu/ws/framework/core/runtime/pom.xml,> MavenProject: org.apache.isis.core:webapp:0.3.1-incubating-SNAPSHOT @ <https://builds.apache.org/job/isis-framework-ubuntu/ws/framework/core/webapp/pom.xml,> MavenProject: org.apache.isis:progmodels:0.3.1-incubating-SNAPSHOT @ <https://builds.apache.org/job/isis-framework-ubuntu/ws/framework/progmodels/pom.xml,> MavenProject: org.apache.isis.progmodels:dflt:0.3.1-incubating-SNAPSHOT @ <https://builds.apache.org/job/isis-framework-ubuntu/ws/framework/progmodels/dflt/pom.xml,> MavenProject: org.apache.isis:runtimes:0.3.1-incubating-SNAPSHOT @ <https://builds.apache.org/job/isis-framework-ubuntu/ws/framework/runtimes/pom.xml,> MavenProject: org.apache.isis.runtimes:dflt:0.3.1-incubating-SNAPSHOT @ <https://builds.apache.org/job/isis-framework-ubuntu/ws/framework/runtimes/dflt/pom.xml,> MavenProject: org.apache.isis.runtimes.dflt:runtime:0.3.1-incubating-SNAPSHOT @ <https://builds.apache.org/job/isis-framework-ubuntu/ws/framework/runtimes/dflt/runtime/pom.xml,> MavenProject: org.apache.isis.runtimes.dflt:monitoring:0.3.1-incubating-SNAPSHOT @ <https://builds.apache.org/job/isis-framework-ubuntu/ws/framework/runtimes/dflt/monitoring/pom.xml,> MavenProject: org.apache.isis.runtimes.dflt:objectstores:0.3.1-incubating-SNAPSHOT @ <https://builds.apache.org/job/isis-framework-ubuntu/ws/framework/runtimes/dflt/objectstores/pom.xml,> MavenProject: org.apache.isis.runtimes.dflt.objectstores:jdo:0.3.1-incubating-SNAPSHOT @ <https://builds.apache.org/job/isis-framework-ubuntu/ws/framework/runtimes/dflt/objectstores/jdo/pom.xml,> MavenProject: org.apache.isis.runtimes.dflt.objectstores:jdo-applib:0.3.1-incubating-SNAPSHOT @ <https://builds.apache.org/job/isis-framework-ubuntu/ws/framework/runtimes/dflt/objectstores/jdo/jdo-applib/pom.xml,> MavenProject: org.apache.isis:viewer:0.3.1-incubating-SNAPSHOT @ <https://builds.apache.org/job/isis-framework-ubuntu/ws/framework/viewer/pom.xml,> MavenProject: org.apache.isis.viewer:wicket:0.3.1-incubating-SNAPSHOT @ <https://builds.apache.org/job/isis-framework-ubuntu/ws/framework/viewer/wicket/pom.xml,> MavenProject: org.apache.isis.viewer:wicket-applib:0.3.1-incubating-SNAPSHOT @ <https://builds.apache.org/job/isis-framework-ubuntu/ws/framework/viewer/wicket/wicket-applib/pom.xml,> MavenProject: org.apache.isis.tck:tck:0.3.1-incubating-SNAPSHOT @ <https://builds.apache.org/job/isis-framework-ubuntu/ws/framework/tck/pom.xml,> MavenProject: org.apache.isis.tck:tck-dom:0.3.1-incubating-SNAPSHOT @ <https://builds.apache.org/job/isis-framework-ubuntu/ws/framework/tck/tck-dom/pom.xml,> MavenProject: org.apache.isis:security:0.3.1-incubating-SNAPSHOT @ <https://builds.apache.org/job/isis-framework-ubuntu/ws/framework/security/pom.xml,> MavenProject: org.apache.isis.security:dflt:0.3.1-incubating-SNAPSHOT @ <https://builds.apache.org/job/isis-framework-ubuntu/ws/framework/security/dflt/pom.xml,> MavenProject: org.apache.isis.runtimes.dflt:bytecode:0.3.1-incubating-SNAPSHOT @ <https://builds.apache.org/job/isis-framework-ubuntu/ws/framework/runtimes/dflt/bytecode/pom.xml,> MavenProject: org.apache.isis.runtimes.dflt.bytecode:dflt:0.3.1-incubating-SNAPSHOT @ <https://builds.apache.org/job/isis-framework-ubuntu/ws/framework/runtimes/dflt/bytecode/dflt/pom.xml,> MavenProject: org.apache.isis.runtimes.dflt.objectstores:dflt:0.3.1-incubating-SNAPSHOT @ <https://builds.apache.org/job/isis-framework-ubuntu/ws/framework/runtimes/dflt/objectstores/dflt/pom.xml,> MavenProject: org.apache.isis.runtimes.dflt:profilestores:0.3.1-incubating-SNAPSHOT @ <https://builds.apache.org/job/isis-framework-ubuntu/ws/framework/runtimes/dflt/profilestores/pom.xml,> MavenProject: org.apache.isis.runtimes.dflt.profilestores:dflt:0.3.1-incubating-SNAPSHOT @ <https://builds.apache.org/job/isis-framework-ubuntu/ws/framework/runtimes/dflt/profilestores/dflt/pom.xml,> MavenProject: org.apache.isis.runtimes.dflt:testsupport:0.3.1-incubating-SNAPSHOT @ <https://builds.apache.org/job/isis-framework-ubuntu/ws/framework/runtimes/dflt/testsupport/pom.xml,> MavenProject: org.apache.isis.runtimes.dflt:webapp:0.3.1-incubating-SNAPSHOT @ <https://builds.apache.org/job/isis-framework-ubuntu/ws/framework/runtimes/dflt/webapp/pom.xml,> MavenProject: org.apache.isis.runtimes.dflt:webserver:0.3.1-incubating-SNAPSHOT @ <https://builds.apache.org/job/isis-framework-ubuntu/ws/framework/runtimes/dflt/webserver/pom.xml,> MavenProject: org.apache.isis.runtimes.dflt.bytecode:javassist:0.3.1-incubating-SNAPSHOT @ <https://builds.apache.org/job/isis-framework-ubuntu/ws/framework/runtimes/dflt/bytecode/javassist/pom.xml,> MavenProject: org.apache.isis.runtimes.dflt.bytecode:identity:0.3.1-incubating-SNAPSHOT @ <https://builds.apache.org/job/isis-framework-ubuntu/ws/framework/runtimes/dflt/bytecode/identity/pom.xml,> MavenProject: org.apache.isis.runtimes.dflt.objectstores:xml:0.3.1-incubating-SNAPSHOT @ <https://builds.apache.org/job/isis-framework-ubuntu/ws/framework/runtimes/dflt/objectstores/xml/pom.xml,> MavenProject: org.apache.isis.runtimes.dflt.objectstores:sql:0.3.1-incubating-SNAPSHOT @ <https://builds.apache.org/job/isis-framework-ubuntu/ws/framework/runtimes/dflt/objectstores/sql/pom.xml,> MavenProject: org.apache.isis.runtimes.dflt.objectstores:sql-impl:0.3.1-incubating-SNAPSHOT @ <https://builds.apache.org/job/isis-framework-ubuntu/ws/framework/runtimes/dflt/objectstores/sql/sql-impl/pom.xml,> MavenProject: org.apache.isis.runtimes.dflt.objectstores:sql-tests-common:0.3.1-incubating-SNAPSHOT @ <https://builds.apache.org/job/isis-framework-ubuntu/ws/framework/runtimes/dflt/objectstores/sql/sql-tests-common/pom.xml,> MavenProject: org.apache.isis.runtimes.dflt.objectstores:sql-tests-served:0.3.1-incubating-SNAPSHOT @ <https://builds.apache.org/job/isis-framework-ubuntu/ws/framework/runtimes/dflt/objectstores/sql/sql-tests-served/pom.xml,> MavenProject: org.apache.isis.runtimes.dflt.objectstores:nosql:0.3.1-incubating-SNAPSHOT @ <https://builds.apache.org/job/isis-framework-ubuntu/ws/framework/runtimes/dflt/objectstores/nosql/pom.xml,> MavenProject: org.apache.isis.runtimes.dflt.objectstores:jdo-metamodel:0.3.1-incubating-SNAPSHOT @ <https://builds.apache.org/job/isis-framework-ubuntu/ws/framework/runtimes/dflt/objectstores/jdo/jdo-metamodel/pom.xml,> MavenProject: org.apache.isis.runtimes.dflt.objectstores:jdo-datanucleus:0.3.1-incubating-SNAPSHOT @ <https://builds.apache.org/job/isis-framework-ubuntu/ws/framework/runtimes/dflt/objectstores/jdo/jdo-datanucleus/pom.xml,> MavenProject: org.apache.isis.runtimes.dflt.profilestores:xml:0.3.1-incubating-SNAPSHOT @ <https://builds.apache.org/job/isis-framework-ubuntu/ws/framework/runtimes/dflt/profilestores/xml/pom.xml,> MavenProject: org.apache.isis.runtimes.dflt.profilestores:sql:0.3.1-incubating-SNAPSHOT @ <https://builds.apache.org/job/isis-framework-ubuntu/ws/framework/runtimes/dflt/profilestores/sql/pom.xml,> MavenProject: org.apache.isis.tck:tck-fixture:0.3.1-incubating-SNAPSHOT @ <https://builds.apache.org/job/isis-framework-ubuntu/ws/framework/tck/tck-fixture/pom.xml,> MavenProject: org.apache.isis.progmodels:wrapper:0.3.1-incubating-SNAPSHOT @ <https://builds.apache.org/job/isis-framework-ubuntu/ws/framework/progmodels/wrapper/pom.xml,> MavenProject: org.apache.isis.progmodels:wrapper-applib:0.3.1-incubating-SNAPSHOT @ <https://builds.apache.org/job/isis-framework-ubuntu/ws/framework/progmodels/wrapper/wrapper-applib/pom.xml,> MavenProject: org.apache.isis.progmodels:wrapper-metamodel:0.3.1-incubating-SNAPSHOT @ <https://builds.apache.org/job/isis-framework-ubuntu/ws/framework/progmodels/wrapper/wrapper-metamodel/pom.xml,> MavenProject: org.apache.isis.progmodels:groovy:0.3.1-incubating-SNAPSHOT @ <https://builds.apache.org/job/isis-framework-ubuntu/ws/framework/progmodels/groovy/pom.xml,> MavenProject: org.apache.isis.progmodels:groovy-applib:0.3.1-incubating-SNAPSHOT @ <https://builds.apache.org/job/isis-framework-ubuntu/ws/framework/progmodels/groovy/applib/pom.xml,> MavenProject: org.apache.isis.progmodels:groovy-metamodel:0.3.1-incubating-SNAPSHOT @ <https://builds.apache.org/job/isis-framework-ubuntu/ws/framework/progmodels/groovy/metamodel/pom.xml,> MavenProject: org.apache.isis.security:file:0.3.1-incubating-SNAPSHOT @ <https://builds.apache.org/job/isis-framework-ubuntu/ws/framework/security/file/pom.xml,> MavenProject: org.apache.isis.security:ldap:0.3.1-incubating-SNAPSHOT @ <https://builds.apache.org/job/isis-framework-ubuntu/ws/framework/security/ldap/pom.xml,> MavenProject: org.apache.isis.security:sql:0.3.1-incubating-SNAPSHOT @ <https://builds.apache.org/job/isis-framework-ubuntu/ws/framework/security/sql/pom.xml,> MavenProject: org.apache.isis.viewer:dnd:0.3.1-incubating-SNAPSHOT @ <https://builds.apache.org/job/isis-framework-ubuntu/ws/framework/viewer/dnd/pom.xml,> MavenProject: org.apache.isis.viewer:dnd-tck:0.3.1-incubating-SNAPSHOT @ <https://builds.apache.org/job/isis-framework-ubuntu/ws/framework/viewer/dnd-tck/pom.xml,> MavenProject: org.apache.isis.viewer:html:0.3.1-incubating-SNAPSHOT @ <https://builds.apache.org/job/isis-framework-ubuntu/ws/framework/viewer/html/pom.xml,> MavenProject: org.apache.isis.viewer:html-tck:0.3.1-incubating-SNAPSHOT @ <https://builds.apache.org/job/isis-framework-ubuntu/ws/framework/viewer/html-tck/pom.xml,> MavenProject: org.apache.isis.viewer:scimpi:0.3.1-incubating-SNAPSHOT @ <https://builds.apache.org/job/isis-framework-ubuntu/ws/framework/viewer/scimpi/pom.xml,> MavenProject: org.apache.isis.viewer:scimpi-dispatcher:0.3.1-incubating-SNAPSHOT @ <https://builds.apache.org/job/isis-framework-ubuntu/ws/framework/viewer/scimpi/scimpi-dispatcher/pom.xml,> MavenProject: org.apache.isis.viewer:scimpi-servlet:0.3.1-incubating-SNAPSHOT @ <https://builds.apache.org/job/isis-framework-ubuntu/ws/framework/viewer/scimpi/scimpi-servlet/pom.xml,> MavenProject: org.apache.isis.viewer:scimpi-tck:0.3.1-incubating-SNAPSHOT @ <https://builds.apache.org/job/isis-framework-ubuntu/ws/framework/viewer/scimpi/scimpi-tck/pom.xml,> MavenProject: org.apache.isis.viewer:wicket-metamodel:0.3.1-incubating-SNAPSHOT @ <https://builds.apache.org/job/isis-framework-ubuntu/ws/framework/viewer/wicket/wicket-metamodel/pom.xml,> MavenProject: org.apache.isis.viewer:wicket-model:0.3.1-incubating-SNAPSHOT @ <https://builds.apache.org/job/isis-framework-ubuntu/ws/framework/viewer/wicket/wicket-model/pom.xml,> MavenProject: org.apache.isis.viewer:wicket-ui:0.3.1-incubating-SNAPSHOT @ <https://builds.apache.org/job/isis-framework-ubuntu/ws/framework/viewer/wicket/wicket-ui/pom.xml,> MavenProject: org.apache.isis.viewer:wicket-viewer:0.3.1-incubating-SNAPSHOT @ <https://builds.apache.org/job/isis-framework-ubuntu/ws/framework/viewer/wicket/wicket-viewer/pom.xml,> MavenProject: org.apache.isis.viewer:wicket-tck:0.3.1-incubating-SNAPSHOT @ <https://builds.apache.org/job/isis-framework-ubuntu/ws/framework/viewer/wicket/wicket-tck/pom.xml,> MavenProject: org.apache.isis.viewer:restfulobjects:0.3.1-incubating-SNAPSHOT @ <https://builds.apache.org/job/isis-framework-ubuntu/ws/framework/viewer/restfulobjects/pom.xml,> MavenProject: org.apache.isis.viewer:restfulobjects-applib:0.3.1-incubating-SNAPSHOT @ <https://builds.apache.org/job/isis-framework-ubuntu/ws/framework/viewer/restfulobjects/restfulobjects-applib/pom.xml,> MavenProject: org.apache.isis.viewer:restfulobjects-viewer:0.3.1-incubating-SNAPSHOT @ <https://builds.apache.org/job/isis-framework-ubuntu/ws/framework/viewer/restfulobjects/restfulobjects-viewer/pom.xml,> MavenProject: org.apache.isis.viewer:restfulobjects-tck:0.3.1-incubating-SNAPSHOT @ <https://builds.apache.org/job/isis-framework-ubuntu/ws/framework/viewer/restfulobjects/restfulobjects-tck/pom.xml,> MavenProject: org.apache.isis.viewer:bdd:0.3.1-incubating-SNAPSHOT @ <https://builds.apache.org/job/isis-framework-ubuntu/ws/framework/viewer/bdd/pom.xml,> MavenProject: org.apache.isis.viewer:bdd-common:0.3.1-incubating-SNAPSHOT @ <https://builds.apache.org/job/isis-framework-ubuntu/ws/framework/viewer/bdd/common/pom.xml,> MavenProject: org.apache.isis.viewer:bdd-concordion:0.3.1-incubating-SNAPSHOT @ <https://builds.apache.org/job/isis-framework-ubuntu/ws/framework/viewer/bdd/concordion/pom.xml,> MavenProject: org.apache.isis.viewer:bdd-concordion-tck:0.3.1-incubating-SNAPSHOT @ <https://builds.apache.org/job/isis-framework-ubuntu/ws/framework/viewer/bdd/concordion-tck/pom.xml,> MavenProject: org.apache.isis.viewer:junit:0.3.1-incubating-SNAPSHOT @ <https://builds.apache.org/job/isis-framework-ubuntu/ws/framework/viewer/junit/pom.xml,> MavenProject: org.apache.isis.viewer:junit-tck:0.3.1-incubating-SNAPSHOT @ <https://builds.apache.org/job/isis-framework-ubuntu/ws/framework/viewer/junit-tck/pom.xml,> MavenProject: org.apache.isis:quickstart-archetype:0.3.1-incubating-SNAPSHOT @ <https://builds.apache.org/job/isis-framework-ubuntu/ws/framework/quickstart-archetype/pom.xml]>
[JENKINS] Archiving <https://builds.apache.org/job/isis-framework-ubuntu/ws/framework/viewer/wicket/wicket-tck/pom.xml> to /home/hudson/hudson/jobs/isis-framework-ubuntu/modules/org.apache.isis.viewer$wicket-tck/builds/2012-07-25_00-11-00/archive/org.apache.isis.viewer/wicket-tck/0.3.1-incubating-SNAPSHOT/wicket-tck-0.3.1-incubating-SNAPSHOT.pom
[JENKINS] Archiving <https://builds.apache.org/job/isis-framework-ubuntu/ws/framework/runtimes/dflt/bytecode/dflt/pom.xml> to /home/hudson/hudson/jobs/isis-framework-ubuntu/modules/org.apache.isis.runtimes.dflt.bytecode$dflt/builds/2012-07-25_00-10-59/archive/org.apache.isis.runtimes.dflt.bytecode/dflt/0.3.1-incubating-SNAPSHOT/dflt-0.3.1-incubating-SNAPSHOT.pom
[JENKINS] Archiving <https://builds.apache.org/job/isis-framework-ubuntu/ws/framework/viewer/junit/pom.xml> to /home/hudson/hudson/jobs/isis-framework-ubuntu/modules/org.apache.isis.viewer$junit/builds/2012-07-25_00-11-00/archive/org.apache.isis.viewer/junit/0.3.1-incubating-SNAPSHOT/junit-0.3.1-incubating-SNAPSHOT.pom
[JENKINS] Archiving <https://builds.apache.org/job/isis-framework-ubuntu/ws/framework/runtimes/pom.xml> to /home/hudson/hudson/jobs/isis-framework-ubuntu/modules/org.apache.isis$runtimes/builds/2012-07-25_00-10-59/archive/org.apache.isis/runtimes/0.3.1-incubating-SNAPSHOT/runtimes-0.3.1-incubating-SNAPSHOT.pom
[JENKINS] Archiving <https://builds.apache.org/job/isis-framework-ubuntu/ws/framework/runtimes/target/runtimes-0.3.1-incubating-SNAPSHOT-site.xml> to /home/hudson/hudson/jobs/isis-framework-ubuntu/modules/org.apache.isis$runtimes/builds/2012-07-25_00-10-59/archive/org.apache.isis/runtimes/0.3.1-incubating-SNAPSHOT/runtimes-0.3.1-incubating-SNAPSHOT-site.xml
[JENKINS] Archiving <https://builds.apache.org/job/isis-framework-ubuntu/ws/framework/runtimes/target/runtimes-0.3.1-incubating-SNAPSHOT-tests.jar> to /home/hudson/hudson/jobs/isis-framework-ubuntu/modules/org.apache.isis$runtimes/builds/2012-07-25_00-10-59/archive/org.apache.isis/runtimes/0.3.1-incubating-SNAPSHOT/runtimes-0.3.1-incubating-SNAPSHOT-tests.jar
[JENKINS] Archiving <https://builds.apache.org/job/isis-framework-ubuntu/ws/framework/viewer/bdd/pom.xml> to /home/hudson/hudson/jobs/isis-framework-ubuntu/modules/org.apache.isis.viewer$bdd/builds/2012-07-25_00-11-00/archive/org.apache.isis.viewer/bdd/0.3.1-incubating-SNAPSHOT/bdd-0.3.1-incubating-SNAPSHOT.pom
[JENKINS] Archiving <https://builds.apache.org/job/isis-framework-ubuntu/ws/framework/viewer/restfulobjects/pom.xml> to /home/hudson/hudson/jobs/isis-framework-ubuntu/modules/org.apache.isis.viewer$restfulobjects/builds/2012-07-25_00-11-00/archive/org.apache.isis.viewer/restfulobjects/0.3.1-incubating-SNAPSHOT/restfulobjects-0.3.1-incubating-SNAPSHOT.pom
[JENKINS] Archiving <https://builds.apache.org/job/isis-framework-ubuntu/ws/framework/runtimes/dflt/objectstores/xml/pom.xml> to /home/hudson/hudson/jobs/isis-framework-ubuntu/modules/org.apache.isis.runtimes.dflt.objectstores$xml/builds/2012-07-25_00-10-59/archive/org.apache.isis.runtimes.dflt.objectstores/xml/0.3.1-incubating-SNAPSHOT/xml-0.3.1-incubating-SNAPSHOT.pom
[JENKINS] Archiving <https://builds.apache.org/job/isis-framework-ubuntu/ws/framework/viewer/scimpi/pom.xml> to /home/hudson/hudson/jobs/isis-framework-ubuntu/modules/org.apache.isis.viewer$scimpi/builds/2012-07-25_00-11-00/archive/org.apache.isis.viewer/scimpi/0.3.1-incubating-SNAPSHOT/scimpi-0.3.1-incubating-SNAPSHOT.pom
[JENKINS] Archiving <https://builds.apache.org/job/isis-framework-ubuntu/ws/framework/progmodels/groovy/applib/pom.xml> to /home/hudson/hudson/jobs/isis-framework-ubuntu/modules/org.apache.isis.progmodels$groovy-applib/builds/2012-07-25_00-10-59/archive/org.apache.isis.progmodels/groovy-applib/0.3.1-incubating-SNAPSHOT/groovy-applib-0.3.1-incubating-SNAPSHOT.pom
[JENKINS] Archiving <https://builds.apache.org/job/isis-framework-ubuntu/ws/framework/viewer/wicket/wicket-model/pom.xml> to /home/hudson/hudson/jobs/isis-framework-ubuntu/modules/org.apache.isis.viewer$wicket-model/builds/2012-07-25_00-11-00/archive/org.apache.isis.viewer/wicket-model/0.3.1-incubating-SNAPSHOT/wicket-model-0.3.1-incubating-SNAPSHOT.pom
[JENKINS] Archiving <https://builds.apache.org/job/isis-framework-ubuntu/ws/framework/runtimes/dflt/webserver/pom.xml> to /home/hudson/hudson/jobs/isis-framework-ubuntu/modules/org.apache.isis.runtimes.dflt$webserver/builds/2012-07-25_00-10-59/archive/org.apache.isis.runtimes.dflt/webserver/0.3.1-incubating-SNAPSHOT/webserver-0.3.1-incubating-SNAPSHOT.pom
[JENKINS] Archiving <https://builds.apache.org/job/isis-framework-ubuntu/ws/framework/site-skin/pom.xml> to /home/hudson/hudson/jobs/isis-framework-ubuntu/modules/org.apache.isis.skins$classic-skin/builds/2012-07-25_00-10-59/archive/org.apache.isis.skins/classic-skin/0.3.1-incubating-SNAPSHOT/classic-skin-0.3.1-incubating-SNAPSHOT.pom
[JENKINS] Archiving <https://builds.apache.org/job/isis-framework-ubuntu/ws/framework/site-skin/target/classic-skin-0.3.1-incubating-SNAPSHOT.jar> to /home/hudson/hudson/jobs/isis-framework-ubuntu/modules/org.apache.isis.skins$classic-skin/builds/2012-07-25_00-10-59/archive/org.apache.isis.skins/classic-skin/0.3.1-incubating-SNAPSHOT/classic-skin-0.3.1-incubating-SNAPSHOT.jar
[JENKINS] Archiving <https://builds.apache.org/job/isis-framework-ubuntu/ws/framework/site-skin/target/classic-skin-0.3.1-incubating-SNAPSHOT-sources.jar> to /home/hudson/hudson/jobs/isis-framework-ubuntu/modules/org.apache.isis.skins$classic-skin/builds/2012-07-25_00-10-59/archive/org.apache.isis.skins/classic-skin/0.3.1-incubating-SNAPSHOT/classic-skin-0.3.1-incubating-SNAPSHOT-sources.jar
[JENKINS] Archiving <https://builds.apache.org/job/isis-framework-ubuntu/ws/framework/site-skin/target/classic-skin-0.3.1-incubating-SNAPSHOT-test-sources.jar> to /home/hudson/hudson/jobs/isis-framework-ubuntu/modules/org.apache.isis.skins$classic-skin/builds/2012-07-25_00-10-59/archive/org.apache.isis.skins/classic-skin/0.3.1-incubating-SNAPSHOT/classic-skin-0.3.1-incubating-SNAPSHOT-test-sources.jar
[JENKINS] Archiving <https://builds.apache.org/job/isis-framework-ubuntu/ws/framework/site-skin/target/classic-skin-0.3.1-incubating-SNAPSHOT-tests.jar> to /home/hudson/hudson/jobs/isis-framework-ubuntu/modules/org.apache.isis.skins$classic-skin/builds/2012-07-25_00-10-59/archive/org.apache.isis.skins/classic-skin/0.3.1-incubating-SNAPSHOT/classic-skin-0.3.1-incubating-SNAPSHOT-tests.jar
[JENKINS] Archiving <https://builds.apache.org/job/isis-framework-ubuntu/ws/framework/quickstart-archetype/pom.xml> to /home/hudson/hudson/jobs/isis-framework-ubuntu/modules/org.apache.isis$quickstart-archetype/builds/2012-07-25_00-11-00/archive/org.apache.isis/quickstart-archetype/0.3.1-incubating-SNAPSHOT/quickstart-archetype-0.3.1-incubating-SNAPSHOT.pom
[JENKINS] Archiving <https://builds.apache.org/job/isis-framework-ubuntu/ws/framework/runtimes/dflt/objectstores/jdo/jdo-metamodel/pom.xml> to /home/hudson/hudson/jobs/isis-framework-ubuntu/modules/org.apache.isis.runtimes.dflt.objectstores$jdo-metamodel/builds/2012-07-25_00-10-59/archive/org.apache.isis.runtimes.dflt.objectstores/jdo-metamodel/0.3.1-incubating-SNAPSHOT/jdo-metamodel-0.3.1-incubating-SNAPSHOT.pom
[JENKINS] Archiving <https://builds.apache.org/job/isis-framework-ubuntu/ws/framework/viewer/bdd/concordion-tck/pom.xml> to /home/hudson/hudson/jobs/isis-framework-ubuntu/modules/org.apache.isis.viewer$bdd-concordion-tck/builds/2012-07-25_00-11-00/archive/org.apache.isis.viewer/bdd-concordion-tck/0.3.1-incubating-SNAPSHOT/bdd-concordion-tck-0.3.1-incubating-SNAPSHOT.pom
[JENKINS] Archiving <https://builds.apache.org/job/isis-framework-ubuntu/ws/framework/runtimes/dflt/objectstores/sql/sql-tests-common/pom.xml> to /home/hudson/hudson/jobs/isis-framework-ubuntu/modules/org.apache.isis.runtimes.dflt.objectstores$sql-tests-common/builds/2012-07-25_00-10-59/archive/org.apache.isis.runtimes.dflt.objectstores/sql-tests-common/0.3.1-incubating-SNAPSHOT/sql-tests-common-0.3.1-incubating-SNAPSHOT.pom
[JENKINS] Archiving <https://builds.apache.org/job/isis-framework-ubuntu/ws/framework/runtimes/dflt/pom.xml> to /home/hudson/hudson/jobs/isis-framework-ubuntu/modules/org.apache.isis.runtimes$dflt/builds/2012-07-25_00-10-59/archive/org.apache.isis.runtimes/dflt/0.3.1-incubating-SNAPSHOT/dflt-0.3.1-incubating-SNAPSHOT.pom
[JENKINS] Archiving <https://builds.apache.org/job/isis-framework-ubuntu/ws/framework/runtimes/dflt/target/dflt-0.3.1-incubating-SNAPSHOT-site.xml> to /home/hudson/hudson/jobs/isis-framework-ubuntu/modules/org.apache.isis.runtimes$dflt/builds/2012-07-25_00-10-59/archive/org.apache.isis.runtimes/dflt/0.3.1-incubating-SNAPSHOT/dflt-0.3.1-incubating-SNAPSHOT-site.xml
[JENKINS] Archiving <https://builds.apache.org/job/isis-framework-ubuntu/ws/framework/runtimes/dflt/target/dflt-0.3.1-incubating-SNAPSHOT-tests.jar> to /home/hudson/hudson/jobs/isis-framework-ubuntu/modules/org.apache.isis.runtimes$dflt/builds/2012-07-25_00-10-59/archive/org.apache.isis.runtimes/dflt/0.3.1-incubating-SNAPSHOT/dflt-0.3.1-incubating-SNAPSHOT-tests.jar
[JENKINS] Archiving <https://builds.apache.org/job/isis-framework-ubuntu/ws/framework/pom.xml> to /home/hudson/hudson/jobs/isis-framework-ubuntu/modules/org.apache.isis$isis/builds/2012-07-25_00-10-59/archive/org.apache.isis/isis/0.3.1-incubating-SNAPSHOT/isis-0.3.1-incubating-SNAPSHOT.pom
[JENKINS] Archiving <https://builds.apache.org/job/isis-framework-ubuntu/ws/framework/target/isis-0.3.1-incubating-SNAPSHOT-site.xml> to /home/hudson/hudson/jobs/isis-framework-ubuntu/modules/org.apache.isis$isis/builds/2012-07-25_00-10-59/archive/org.apache.isis/isis/0.3.1-incubating-SNAPSHOT/isis-0.3.1-incubating-SNAPSHOT-site.xml
[JENKINS] Archiving <https://builds.apache.org/job/isis-framework-ubuntu/ws/framework/target/isis-0.3.1-incubating-SNAPSHOT-tests.jar> to /home/hudson/hudson/jobs/isis-framework-ubuntu/modules/org.apache.isis$isis/builds/2012-07-25_00-10-59/archive/org.apache.isis/isis/0.3.1-incubating-SNAPSHOT/isis-0.3.1-incubating-SNAPSHOT-tests.jar
[JENKINS] Archiving <https://builds.apache.org/job/isis-framework-ubuntu/ws/framework/tck/tck-fixture/pom.xml> to /home/hudson/hudson/jobs/isis-framework-ubuntu/modules/org.apache.isis.tck$tck-fixture/builds/2012-07-25_00-10-59/archive/org.apache.isis.tck/tck-fixture/0.3.1-incubating-SNAPSHOT/tck-fixture-0.3.1-incubating-SNAPSHOT.pom
[JENKINS] Archiving <https://builds.apache.org/job/isis-framework-ubuntu/ws/framework/tck/pom.xml> to /home/hudson/hudson/jobs/isis-framework-ubuntu/modules/org.apache.isis.tck$tck/builds/2012-07-25_00-10-59/archive/org.apache.isis.tck/tck/0.3.1-incubating-SNAPSHOT/tck-0.3.1-incubating-SNAPSHOT.pom
[JENKINS] Archiving <https://builds.apache.org/job/isis-framework-ubuntu/ws/framework/tck/target/tck-0.3.1-incubating-SNAPSHOT-tests.jar> to /home/hudson/hudson/jobs/isis-framework-ubuntu/modules/org.apache.isis.tck$tck/builds/2012-07-25_00-10-59/archive/org.apache.isis.tck/tck/0.3.1-incubating-SNAPSHOT/tck-0.3.1-incubating-SNAPSHOT-tests.jar
[JENKINS] Archiving <https://builds.apache.org/job/isis-framework-ubuntu/ws/framework/runtimes/dflt/webapp/pom.xml> to /home/hudson/hudson/jobs/isis-framework-ubuntu/modules/org.apache.isis.runtimes.dflt$webapp/builds/2012-07-25_00-10-59/archive/org.apache.isis.runtimes.dflt/webapp/0.3.1-incubating-SNAPSHOT/webapp-0.3.1-incubating-SNAPSHOT.pom
[JENKINS] Archiving <https://builds.apache.org/job/isis-framework-ubuntu/ws/framework/viewer/scimpi/scimpi-dispatcher/pom.xml> to /home/hudson/hudson/jobs/isis-framework-ubuntu/modules/org.apache.isis.viewer$scimpi-dispatcher/builds/2012-07-25_00-11-00/archive/org.apache.isis.viewer/scimpi-dispatcher/0.3.1-incubating-SNAPSHOT/scimpi-dispatcher-0.3.1-incubating-SNAPSHOT.pom
[JENKINS] Archiving <https://builds.apache.org/job/isis-framework-ubuntu/ws/framework/runtimes/dflt/bytecode/pom.xml> to /home/hudson/hudson/jobs/isis-framework-ubuntu/modules/org.apache.isis.runtimes.dflt$bytecode/builds/2012-07-25_00-10-59/archive/org.apache.isis.runtimes.dflt/bytecode/0.3.1-incubating-SNAPSHOT/bytecode-0.3.1-incubating-SNAPSHOT.pom
[JENKINS] Archiving <https://builds.apache.org/job/isis-framework-ubuntu/ws/framework/viewer/pom.xml> to /home/hudson/hudson/jobs/isis-framework-ubuntu/modules/org.apache.isis$viewer/builds/2012-07-25_00-11-00/archive/org.apache.isis/viewer/0.3.1-incubating-SNAPSHOT/viewer-0.3.1-incubating-SNAPSHOT.pom
[JENKINS] Archiving <https://builds.apache.org/job/isis-framework-ubuntu/ws/framework/viewer/target/viewer-0.3.1-incubating-SNAPSHOT-site.xml> to /home/hudson/hudson/jobs/isis-framework-ubuntu/modules/org.apache.isis$viewer/builds/2012-07-25_00-11-00/archive/org.apache.isis/viewer/0.3.1-incubating-SNAPSHOT/viewer-0.3.1-incubating-SNAPSHOT-site.xml
[JENKINS] Archiving <https://builds.apache.org/job/isis-framework-ubuntu/ws/framework/viewer/target/viewer-0.3.1-incubating-SNAPSHOT-tests.jar> to /home/hudson/hudson/jobs/isis-framework-ubuntu/modules/org.apache.isis$viewer/builds/2012-07-25_00-11-00/archive/org.apache.isis/viewer/0.3.1-incubating-SNAPSHOT/viewer-0.3.1-incubating-SNAPSHOT-tests.jar
[JENKINS] Archiving <https://builds.apache.org/job/isis-framework-ubuntu/ws/framework/viewer/wicket/wicket-applib/pom.xml> to /home/hudson/hudson/jobs/isis-framework-ubuntu/modules/org.apache.isis.viewer$wicket-applib/builds/2012-07-25_00-11-00/archive/org.apache.isis.viewer/wicket-applib/0.3.1-incubating-SNAPSHOT/wicket-applib-0.3.1-incubating-SNAPSHOT.pom
[JENKINS] Archiving <https://builds.apache.org/job/isis-framework-ubuntu/ws/framework/viewer/wicket/wicket-applib/target/wicket-applib-0.3.1-incubating-SNAPSHOT.jar> to /home/hudson/hudson/jobs/isis-framework-ubuntu/modules/org.apache.isis.viewer$wicket-applib/builds/2012-07-25_00-11-00/archive/org.apache.isis.viewer/wicket-applib/0.3.1-incubating-SNAPSHOT/wicket-applib-0.3.1-incubating-SNAPSHOT.jar
[JENKINS] Archiving <https://builds.apache.org/job/isis-framework-ubuntu/ws/framework/viewer/wicket/wicket-applib/target/wicket-applib-0.3.1-incubating-SNAPSHOT-site.xml> to /home/hudson/hudson/jobs/isis-framework-ubuntu/modules/org.apache.isis.viewer$wicket-applib/builds/2012-07-25_00-11-00/archive/org.apache.isis.viewer/wicket-applib/0.3.1-incubating-SNAPSHOT/wicket-applib-0.3.1-incubating-SNAPSHOT-site.xml
[JENKINS] Archiving <https://builds.apache.org/job/isis-framework-ubuntu/ws/framework/viewer/wicket/wicket-applib/target/wicket-applib-0.3.1-incubating-SNAPSHOT-sources.jar> to /home/hudson/hudson/jobs/isis-framework-ubuntu/modules/org.apache.isis.viewer$wicket-applib/builds/2012-07-25_00-11-00/archive/org.apache.isis.viewer/wicket-applib/0.3.1-incubating-SNAPSHOT/wicket-applib-0.3.1-incubating-SNAPSHOT-sources.jar
[JENKINS] Archiving <https://builds.apache.org/job/isis-framework-ubuntu/ws/framework/viewer/wicket/wicket-applib/target/wicket-applib-0.3.1-incubating-SNAPSHOT-test-sources.jar> to /home/hudson/hudson/jobs/isis-framework-ubuntu/modules/org.apache.isis.viewer$wicket-applib/builds/2012-07-25_00-11-00/archive/org.apache.isis.viewer/wicket-applib/0.3.1-incubating-SNAPSHOT/wicket-applib-0.3.1-incubating-SNAPSHOT-test-sources.jar
[JENKINS] Archiving <https://builds.apache.org/job/isis-framework-ubuntu/ws/framework/viewer/wicket/wicket-applib/target/wicket-applib-0.3.1-incubating-SNAPSHOT-tests.jar> to /home/hudson/hudson/jobs/isis-framework-ubuntu/modules/org.apache.isis.viewer$wicket-applib/builds/2012-07-25_00-11-00/archive/org.apache.isis.viewer/wicket-applib/0.3.1-incubating-SNAPSHOT/wicket-applib-0.3.1-incubating-SNAPSHOT-tests.jar
[JENKINS] Archiving <https://builds.apache.org/job/isis-framework-ubuntu/ws/framework/progmodels/groovy/metamodel/pom.xml> to /home/hudson/hudson/jobs/isis-framework-ubuntu/modules/org.apache.isis.progmodels$groovy-metamodel/builds/2012-07-25_00-11-00/archive/org.apache.isis.progmodels/groovy-metamodel/0.3.1-incubating-SNAPSHOT/groovy-metamodel-0.3.1-incubating-SNAPSHOT.pom
[JENKINS] Archiving <https://builds.apache.org/job/isis-framework-ubuntu/ws/framework/runtimes/dflt/objectstores/sql/sql-impl/pom.xml> to /home/hudson/hudson/jobs/isis-framework-ubuntu/modules/org.apache.isis.runtimes.dflt.objectstores$sql-impl/builds/2012-07-25_00-10-59/archive/org.apache.isis.runtimes.dflt.objectstores/sql-impl/0.3.1-incubating-SNAPSHOT/sql-impl-0.3.1-incubating-SNAPSHOT.pom
[JENKINS] Archiving <https://builds.apache.org/job/isis-framework-ubuntu/ws/framework/viewer/restfulobjects/restfulobjects-viewer/pom.xml> to /home/hudson/hudson/jobs/isis-framework-ubuntu/modules/org.apache.isis.viewer$restfulobjects-viewer/builds/2012-07-25_00-11-00/archive/org.apache.isis.viewer/restfulobjects-viewer/0.3.1-incubating-SNAPSHOT/restfulobjects-viewer-0.3.1-incubating-SNAPSHOT.pom
[JENKINS] Archiving <https://builds.apache.org/job/isis-framework-ubuntu/ws/framework/core/commons/pom.xml> to /home/hudson/hudson/jobs/isis-framework-ubuntu/modules/org.apache.isis.core$commons/builds/2012-07-25_00-10-59/archive/org.apache.isis.core/commons/0.3.1-incubating-SNAPSHOT/commons-0.3.1-incubating-SNAPSHOT.pom
[JENKINS] Archiving <https://builds.apache.org/job/isis-framework-ubuntu/ws/framework/core/commons/target/commons-0.3.1-incubating-SNAPSHOT.jar> to /home/hudson/hudson/jobs/isis-framework-ubuntu/modules/org.apache.isis.core$commons/builds/2012-07-25_00-10-59/archive/org.apache.isis.core/commons/0.3.1-incubating-SNAPSHOT/commons-0.3.1-incubating-SNAPSHOT.jar
[JENKINS] Archiving <https://builds.apache.org/job/isis-framework-ubuntu/ws/framework/core/commons/target/commons-0.3.1-incubating-SNAPSHOT-site.xml> to /home/hudson/hudson/jobs/isis-framework-ubuntu/modules/org.apache.isis.core$commons/builds/2012-07-25_00-10-59/archive/org.apache.isis.core/commons/0.3.1-incubating-SNAPSHOT/commons-0.3.1-incubating-SNAPSHOT-site.xml
[JENKINS] Archiving <https://builds.apache.org/job/isis-framework-ubuntu/ws/framework/core/commons/target/commons-0.3.1-incubating-SNAPSHOT-sources.jar> to /home/hudson/hudson/jobs/isis-framework-ubuntu/modules/org.apache.isis.core$commons/builds/2012-07-25_00-10-59/archive/org.apache.isis.core/commons/0.3.1-incubating-SNAPSHOT/commons-0.3.1-incubating-SNAPSHOT-sources.jar
[JENKINS] Archiving <https://builds.apache.org/job/isis-framework-ubuntu/ws/framework/core/commons/target/commons-0.3.1-incubating-SNAPSHOT-test-sources.jar> to /home/hudson/hudson/jobs/isis-framework-ubuntu/modules/org.apache.isis.core$commons/builds/2012-07-25_00-10-59/archive/org.apache.isis.core/commons/0.3.1-incubating-SNAPSHOT/commons-0.3.1-incubating-SNAPSHOT-test-sources.jar
[JENKINS] Archiving <https://builds.apache.org/job/isis-framework-ubuntu/ws/framework/core/commons/target/commons-0.3.1-incubating-SNAPSHOT-tests.jar> to /home/hudson/hudson/jobs/isis-framework-ubuntu/modules/org.apache.isis.core$commons/builds/2012-07-25_00-10-59/archive/org.apache.isis.core/commons/0.3.1-incubating-SNAPSHOT/commons-0.3.1-incubating-SNAPSHOT-tests.jar
[JENKINS] Archiving <https://builds.apache.org/job/isis-framework-ubuntu/ws/framework/runtimes/dflt/bytecode/identity/pom.xml> to /home/hudson/hudson/jobs/isis-framework-ubuntu/modules/org.apache.isis.runtimes.dflt.bytecode$identity/builds/2012-07-25_00-10-59/archive/org.apache.isis.runtimes.dflt.bytecode/identity/0.3.1-incubating-SNAPSHOT/identity-0.3.1-incubating-SNAPSHOT.pom
[JENKINS] Archiving <https://builds.apache.org/job/isis-framework-ubuntu/ws/framework/viewer/bdd/common/pom.xml> to /home/hudson/hudson/jobs/isis-framework-ubuntu/modules/org.apache.isis.viewer$bdd-common/builds/2012-07-25_00-11-00/archive/org.apache.isis.viewer/bdd-common/0.3.1-incubating-SNAPSHOT/bdd-common-0.3.1-incubating-SNAPSHOT.pom
[JENKINS] Archiving <https://builds.apache.org/job/isis-framework-ubuntu/ws/framework/viewer/wicket/wicket-viewer/pom.xml> to /home/hudson/hudson/jobs/isis-framework-ubuntu/modules/org.apache.isis.viewer$wicket-viewer/builds/2012-07-25_00-11-00/archive/org.apache.isis.viewer/wicket-viewer/0.3.1-incubating-SNAPSHOT/wicket-viewer-0.3.1-incubating-SNAPSHOT.pom
[JENKINS] Archiving <https://builds.apache.org/job/isis-framework-ubuntu/ws/framework/progmodels/wrapper/pom.xml> to /home/hudson/hudson/jobs/isis-framework-ubuntu/modules/org.apache.isis.progmodels$wrapper/builds/2012-07-25_00-10-59/archive/org.apache.isis.progmodels/wrapper/0.3.1-incubating-SNAPSHOT/wrapper-0.3.1-incubating-SNAPSHOT.pom
[JENKINS] Archiving <https://builds.apache.org/job/isis-framework-ubuntu/ws/framework/viewer/restfulobjects/restfulobjects-applib/pom.xml> to /home/hudson/hudson/jobs/isis-framework-ubuntu/modules/org.apache.isis.viewer$restfulobjects-applib/builds/2012-07-25_00-11-00/archive/org.apache.isis.viewer/restfulobjects-applib/0.3.1-incubating-SNAPSHOT/restfulobjects-applib-0.3.1-incubating-SNAPSHOT.pom
[JENKINS] Archiving <https://builds.apache.org/job/isis-framework-ubuntu/ws/framework/progmodels/groovy/pom.xml> to /home/hudson/hudson/jobs/isis-framework-ubuntu/modules/org.apache.isis.progmodels$groovy/builds/2012-07-25_00-10-59/archive/org.apache.isis.progmodels/groovy/0.3.1-incubating-SNAPSHOT/groovy-0.3.1-incubating-SNAPSHOT.pom
[JENKINS] Archiving <https://builds.apache.org/job/isis-framework-ubuntu/ws/framework/viewer/scimpi/scimpi-tck/pom.xml> to /home/hudson/hudson/jobs/isis-framework-ubuntu/modules/org.apache.isis.viewer$scimpi-tck/builds/2012-07-25_00-11-00/archive/org.apache.isis.viewer/scimpi-tck/0.3.1-incubating-SNAPSHOT/scimpi-tck-0.3.1-incubating-SNAPSHOT.pom
[JENKINS] Archiving <https://builds.apache.org/job/isis-framework-ubuntu/ws/framework/runtimes/dflt/testsupport/pom.xml> to /home/hudson/hudson/jobs/isis-framework-ubuntu/modules/org.apache.isis.runtimes.dflt$testsupport/builds/2012-07-25_00-10-59/archive/org.apache.isis.runtimes.dflt/testsupport/0.3.1-incubating-SNAPSHOT/testsupport-0.3.1-incubating-SNAPSHOT.pom
[JENKINS] Archiving <https://builds.apache.org/job/isis-framework-ubuntu/ws/framework/runtimes/dflt/objectstores/sql/pom.xml> to /home/hudson/hudson/jobs/isis-framework-ubuntu/modules/org.apache.isis.runtimes.dflt.objectstores$sql/builds/2012-07-25_00-10-59/archive/org.apache.isis.runtimes.dflt.objectstores/sql/0.3.1-incubating-SNAPSHOT/sql-0.3.1-incubating-SNAPSHOT.pom
[JENKINS] Archiving <https://builds.apache.org/job/isis-framework-ubuntu/ws/framework/security/pom.xml> to /home/hudson/hudson/jobs/isis-framework-ubuntu/modules/org.apache.isis$security/builds/2012-07-25_00-11-00/archive/org.apache.isis/security/0.3.1-incubating-SNAPSHOT/security-0.3.1-incubating-SNAPSHOT.pom
[JENKINS] Archiving <https://builds.apache.org/job/isis-framework-ubuntu/ws/framework/runtimes/dflt/profilestores/dflt/pom.xml> to /home/hudson/hudson/jobs/isis-framework-ubuntu/modules/org.apache.isis.runtimes.dflt.profilestores$dflt/builds/2012-07-25_00-10-59/archive/org.apache.isis.runtimes.dflt.profilestores/dflt/0.3.1-incubating-SNAPSHOT/dflt-0.3.1-incubating-SNAPSHOT.pom
[JENKINS] Archiving <https://builds.apache.org/job/isis-framework-ubuntu/ws/framework/runtimes/dflt/objectstores/jdo/jdo-datanucleus/pom.xml> to /home/hudson/hudson/jobs/isis-framework-ubuntu/modules/org.apache.isis.runtimes.dflt.objectstores$jdo-datanucleus/builds/2012-07-25_00-10-59/archive/org.apache.isis.runtimes.dflt.objectstores/jdo-datanucleus/0.3.1-incubating-SNAPSHOT/jdo-datanucleus-0.3.1-incubating-SNAPSHOT.pom
[JENKINS] Archiving <https://builds.apache.org/job/isis-framework-ubuntu/ws/framework/progmodels/wrapper/wrapper-metamodel/pom.xml> to /home/hudson/hudson/jobs/isis-framework-ubuntu/modules/org.apache.isis.progmodels$wrapper-metamodel/builds/2012-07-25_00-10-59/archive/org.apache.isis.progmodels/wrapper-metamodel/0.3.1-incubating-SNAPSHOT/wrapper-metamodel-0.3.1-incubating-SNAPSHOT.pom
[JENKINS] Archiving <https://builds.apache.org/job/isis-framework-ubuntu/ws/framework/runtimes/dflt/bytecode/javassist/pom.xml> to /home/hudson/hudson/jobs/isis-framework-ubuntu/modules/org.apache.isis.runtimes.dflt.bytecode$javassist/builds/2012-07-25_00-10-59/archive/org.apache.isis.runtimes.dflt.bytecode/javassist/0.3.1-incubating-SNAPSHOT/javassist-0.3.1-incubating-SNAPSHOT.pom
[JENKINS] Archiving <https://builds.apache.org/job/isis-framework-ubuntu/ws/framework/runtimes/dflt/objectstores/sql/sql-tests-served/pom.xml> to /home/hudson/hudson/jobs/isis-framework-ubuntu/modules/org.apache.isis.runtimes.dflt.objectstores$sql-tests-served/builds/2012-07-25_00-10-59/archive/org.apache.isis.runtimes.dflt.objectstores/sql-tests-served/0.3.1-incubating-SNAPSHOT/sql-tests-served-0.3.1-incubating-SNAPSHOT.pom
[JENKINS] Archiving <https://builds.apache.org/job/isis-framework-ubuntu/ws/framework/viewer/wicket/wicket-metamodel/pom.xml> to /home/hudson/hudson/jobs/isis-framework-ubuntu/modules/org.apache.isis.viewer$wicket-metamodel/builds/2012-07-25_00-11-00/archive/org.apache.isis.viewer/wicket-metamodel/0.3.1-incubating-SNAPSHOT/wicket-metamodel-0.3.1-incubating-SNAPSHOT.pom
[JENKINS] Archiving <https://builds.apache.org/job/isis-framework-ubuntu/ws/framework/viewer/dnd/pom.xml> to /home/hudson/hudson/jobs/isis-framework-ubuntu/modules/org.apache.isis.viewer$dnd/builds/2012-07-25_00-11-00/archive/org.apache.isis.viewer/dnd/0.3.1-incubating-SNAPSHOT/dnd-0.3.1-incubating-SNAPSHOT.pom
[JENKINS] Archiving <https://builds.apache.org/job/isis-framework-ubuntu/ws/framework/security/ldap/pom.xml> to /home/hudson/hudson/jobs/isis-framework-ubuntu/modules/org.apache.isis.security$ldap/builds/2012-07-25_00-11-00/archive/org.apache.isis.security/ldap/0.3.1-incubating-SNAPSHOT/ldap-0.3.1-incubating-SNAPSHOT.pom
[JENKINS] Archiving <https://builds.apache.org/job/isis-framework-ubuntu/ws/framework/security/sql/pom.xml> to /home/hudson/hudson/jobs/isis-framework-ubuntu/modules/org.apache.isis.security$sql/builds/2012-07-25_00-11-00/archive/org.apache.isis.security/sql/0.3.1-incubating-SNAPSHOT/sql-0.3.1-incubating-SNAPSHOT.pom
[JENKINS] Archiving <https://builds.apache.org/job/isis-framework-ubuntu/ws/framework/runtimes/dflt/objectstores/pom.xml> to /home/hudson/hudson/jobs/isis-framework-ubuntu/modules/org.apache.isis.runtimes.dflt$objectstores/builds/2012-07-25_00-10-59/archive/org.apache.isis.runtimes.dflt/objectstores/0.3.1-incubating-SNAPSHOT/objectstores-0.3.1-incubating-SNAPSHOT.pom
[JENKINS] Archiving <https://builds.apache.org/job/isis-framework-ubuntu/ws/framework/runtimes/dflt/objectstores/target/objectstores-0.3.1-incubating-SNAPSHOT-site.xml> to /home/hudson/hudson/jobs/isis-framework-ubuntu/modules/org.apache.isis.runtimes.dflt$objectstores/builds/2012-07-25_00-10-59/archive/org.apache.isis.runtimes.dflt/objectstores/0.3.1-incubating-SNAPSHOT/objectstores-0.3.1-incubating-SNAPSHOT-site.xml
[JENKINS] Archiving <https://builds.apache.org/job/isis-framework-ubuntu/ws/framework/runtimes/dflt/objectstores/target/objectstores-0.3.1-incubating-SNAPSHOT-tests.jar> to /home/hudson/hudson/jobs/isis-framework-ubuntu/modules/org.apache.isis.runtimes.dflt$objectstores/builds/2012-07-25_00-10-59/archive/org.apache.isis.runtimes.dflt/objectstores/0.3.1-incubating-SNAPSHOT/objectstores-0.3.1-incubating-SNAPSHOT-tests.jar
[JENKINS] Archiving <https://builds.apache.org/job/isis-framework-ubuntu/ws/framework/progmodels/dflt/pom.xml> to /home/hudson/hudson/jobs/isis-framework-ubuntu/modules/org.apache.isis.progmodels$dflt/builds/2012-07-25_00-10-59/archive/org.apache.isis.progmodels/dflt/0.3.1-incubating-SNAPSHOT/dflt-0.3.1-incubating-SNAPSHOT.pom
[JENKINS] Archiving <https://builds.apache.org/job/isis-framework-ubuntu/ws/framework/progmodels/dflt/target/dflt-0.3.1-incubating-SNAPSHOT.jar> to /home/hudson/hudson/jobs/isis-framework-ubuntu/modules/org.apache.isis.progmodels$dflt/builds/2012-07-25_00-10-59/archive/org.apache.isis.progmodels/dflt/0.3.1-incubating-SNAPSHOT/dflt-0.3.1-incubating-SNAPSHOT.jar
[JENKINS] Archiving <https://builds.apache.org/job/isis-framework-ubuntu/ws/framework/progmodels/dflt/target/dflt-0.3.1-incubating-SNAPSHOT-site.xml> to /home/hudson/hudson/jobs/isis-framework-ubuntu/modules/org.apache.isis.progmodels$dflt/builds/2012-07-25_00-10-59/archive/org.apache.isis.progmodels/dflt/0.3.1-incubating-SNAPSHOT/dflt-0.3.1-incubating-SNAPSHOT-site.xml
[JENKINS] Archiving <https://builds.apache.org/job/isis-framework-ubuntu/ws/framework/progmodels/dflt/target/dflt-0.3.1-incubating-SNAPSHOT-sources.jar> to /home/hudson/hudson/jobs/isis-framework-ubuntu/modules/org.apache.isis.progmodels$dflt/builds/2012-07-25_00-10-59/archive/org.apache.isis.progmodels/dflt/0.3.1-incubating-SNAPSHOT/dflt-0.3.1-incubating-SNAPSHOT-sources.jar
[JENKINS] Archiving <https://builds.apache.org/job/isis-framework-ubuntu/ws/framework/progmodels/dflt/target/dflt-0.3.1-incubating-SNAPSHOT-test-sources.jar> to /home/hudson/hudson/jobs/isis-framework-ubuntu/modules/org.apache.isis.progmodels$dflt/builds/2012-07-25_00-10-59/archive/org.apache.isis.progmodels/dflt/0.3.1-incubating-SNAPSHOT/dflt-0.3.1-incubating-SNAPSHOT-test-sources.jar
[JENKINS] Archiving <https://builds.apache.org/job/isis-framework-ubuntu/ws/framework/progmodels/dflt/target/dflt-0.3.1-incubating-SNAPSHOT-tests.jar> to /home/hudson/hudson/jobs/isis-framework-ubuntu/modules/org.apache.isis.progmodels$dflt/builds/2012-07-25_00-10-59/archive/org.apache.isis.progmodels/dflt/0.3.1-incubating-SNAPSHOT/dflt-0.3.1-incubating-SNAPSHOT-tests.jar
[JENKINS] Archiving <https://builds.apache.org/job/isis-framework-ubuntu/ws/framework/runtimes/dflt/objectstores/nosql/pom.xml> to /home/hudson/hudson/jobs/isis-framework-ubuntu/modules/org.apache.isis.runtimes.dflt.objectstores$nosql/builds/2012-07-25_00-10-59/archive/org.apache.isis.runtimes.dflt.objectstores/nosql/0.3.1-incubating-SNAPSHOT/nosql-0.3.1-incubating-SNAPSHOT.pom
[JENKINS] Archiving <https://builds.apache.org/job/isis-framework-ubuntu/ws/framework/security/dflt/pom.xml> to /home/hudson/hudson/jobs/isis-framework-ubuntu/modules/org.apache.isis.security$dflt/builds/2012-07-25_00-11-00/archive/org.apache.isis.security/dflt/0.3.1-incubating-SNAPSHOT/dflt-0.3.1-incubating-SNAPSHOT.pom
[JENKINS] Archiving <https://builds.apache.org/job/isis-framework-ubuntu/ws/framework/runtimes/dflt/monitoring/pom.xml> to /home/hudson/hudson/jobs/isis-framework-ubuntu/modules/org.apache.isis.runtimes.dflt$monitoring/builds/2012-07-25_00-10-59/archive/org.apache.isis.runtimes.dflt/monitoring/0.3.1-incubating-SNAPSHOT/monitoring-0.3.1-incubating-SNAPSHOT.pom
[JENKINS] Archiving <https://builds.apache.org/job/isis-framework-ubuntu/ws/framework/runtimes/dflt/monitoring/target/monitoring-0.3.1-incubating-SNAPSHOT.jar> to /home/hudson/hudson/jobs/isis-framework-ubuntu/modules/org.apache.isis.runtimes.dflt$monitoring/builds/2012-07-25_00-10-59/archive/org.apache.isis.runtimes.dflt/monitoring/0.3.1-incubating-SNAPSHOT/monitoring-0.3.1-incubating-SNAPSHOT.jar
[JENKINS] Archiving <https://builds.apache.org/job/isis-framework-ubuntu/ws/framework/runtimes/dflt/monitoring/target/monitoring-0.3.1-incubating-SNAPSHOT-site.xml> to /home/hudson/hudson/jobs/isis-framework-ubuntu/modules/org.apache.isis.runtimes.dflt$monitoring/builds/2012-07-25_00-10-59/archive/org.apache.isis.runtimes.dflt/monitoring/0.3.1-incubating-SNAPSHOT/monitoring-0.3.1-incubating-SNAPSHOT-site.xml
[JENKINS] Archiving <https://builds.apache.org/job/isis-framework-ubuntu/ws/framework/runtimes/dflt/monitoring/target/monitoring-0.3.1-incubating-SNAPSHOT-sources.jar> to /home/hudson/hudson/jobs/isis-framework-ubuntu/modules/org.apache.isis.runtimes.dflt$monitoring/builds/2012-07-25_00-10-59/archive/org.apache.isis.runtimes.dflt/monitoring/0.3.1-incubating-SNAPSHOT/monitoring-0.3.1-incubating-SNAPSHOT-sources.jar
[JENKINS] Archiving <https://builds.apache.org/job/isis-framework-ubuntu/ws/framework/runtimes/dflt/monitoring/target/monitoring-0.3.1-incubating-SNAPSHOT-test-sources.jar> to /home/hudson/hudson/jobs/isis-framework-ubuntu/modules/org.apache.isis.runtimes.dflt$monitoring/builds/2012-07-25_00-10-59/archive/org.apache.isis.runtimes.dflt/monitoring/0.3.1-incubating-SNAPSHOT/monitoring-0.3.1-incubating-SNAPSHOT-test-sources.jar
[JENKINS] Archiving <https://builds.apache.org/job/isis-framework-ubuntu/ws/framework/runtimes/dflt/monitoring/target/monitoring-0.3.1-incubating-SNAPSHOT-tests.jar> to /home/hudson/hudson/jobs/isis-framework-ubuntu/modules/org.apache.isis.runtimes.dflt$monitoring/builds/2012-07-25_00-10-59/archive/org.apache.isis.runtimes.dflt/monitoring/0.3.1-incubating-SNAPSHOT/monitoring-0.3.1-incubating-SNAPSHOT-tests.jar
[JENKINS] Archiving <https://builds.apache.org/job/isis-framework-ubuntu/ws/framework/tck/tck-dom/pom.xml> to /home/hudson/hudson/jobs/isis-framework-ubuntu/modules/org.apache.isis.tck$tck-dom/builds/2012-07-25_00-10-59/archive/org.apache.isis.tck/tck-dom/0.3.1-incubating-SNAPSHOT/tck-dom-0.3.1-incubating-SNAPSHOT.pom
[JENKINS] Archiving <https://builds.apache.org/job/isis-framework-ubuntu/ws/framework/core/webapp/pom.xml> to /home/hudson/hudson/jobs/isis-framework-ubuntu/modules/org.apache.isis.core$webapp/builds/2012-07-25_00-10-59/archive/org.apache.isis.core/webapp/0.3.1-incubating-SNAPSHOT/webapp-0.3.1-incubating-SNAPSHOT.pom
[JENKINS] Archiving <https://builds.apache.org/job/isis-framework-ubuntu/ws/framework/core/webapp/target/webapp-0.3.1-incubating-SNAPSHOT.jar> to /home/hudson/hudson/jobs/isis-framework-ubuntu/modules/org.apache.isis.core$webapp/builds/2012-07-25_00-10-59/archive/org.apache.isis.core/webapp/0.3.1-incubating-SNAPSHOT/webapp-0.3.1-incubating-SNAPSHOT.jar
[JENKINS] Archiving <https://builds.apache.org/job/isis-framework-ubuntu/ws/framework/core/webapp/target/webapp-0.3.1-incubating-SNAPSHOT-site.xml> to /home/hudson/hudson/jobs/isis-framework-ubuntu/modules/org.apache.isis.core$webapp/builds/2012-07-25_00-10-59/archive/org.apache.isis.core/webapp/0.3.1-incubating-SNAPSHOT/webapp-0.3.1-incubating-SNAPSHOT-site.xml
[JENKINS] Archiving <https://builds.apache.org/job/isis-framework-ubuntu/ws/framework/core/webapp/target/webapp-0.3.1-incubating-SNAPSHOT-sources.jar> to /home/hudson/hudson/jobs/isis-framework-ubuntu/modules/org.apache.isis.core$webapp/builds/2012-07-25_00-10-59/archive/org.apache.isis.core/webapp/0.3.1-incubating-SNAPSHOT/webapp-0.3.1-incubating-SNAPSHOT-sources.jar
[JENKINS] Archiving <https://builds.apache.org/job/isis-framework-ubuntu/ws/framework/core/webapp/target/webapp-0.3.1-incubating-SNAPSHOT-test-sources.jar> to /home/hudson/hudson/jobs/isis-framework-ubuntu/modules/org.apache.isis.core$webapp/builds/2012-07-25_00-10-59/archive/org.apache.isis.core/webapp/0.3.1-incubating-SNAPSHOT/webapp-0.3.1-incubating-SNAPSHOT-test-sources.jar
[JENKINS] Archiving <https://builds.apache.org/job/isis-framework-ubuntu/ws/framework/core/webapp/target/webapp-0.3.1-incubating-SNAPSHOT-tests.jar> to /home/hudson/hudson/jobs/isis-framework-ubuntu/modules/org.apache.isis.core$webapp/builds/2012-07-25_00-10-59/archive/org.apache.isis.core/webapp/0.3.1-incubating-SNAPSHOT/webapp-0.3.1-incubating-SNAPSHOT-tests.jar
[JENKINS] Archiving <https://builds.apache.org/job/isis-framework-ubuntu/ws/framework/core/metamodel/pom.xml> to /home/hudson/hudson/jobs/isis-framework-ubuntu/modules/org.apache.isis.core$metamodel/builds/2012-07-25_00-10-59/archive/org.apache.isis.core/metamodel/0.3.1-incubating-SNAPSHOT/metamodel-0.3.1-incubating-SNAPSHOT.pom
[JENKINS] Archiving <https://builds.apache.org/job/isis-framework-ubuntu/ws/framework/core/metamodel/target/metamodel-0.3.1-incubating-SNAPSHOT.jar> to /home/hudson/hudson/jobs/isis-framework-ubuntu/modules/org.apache.isis.core$metamodel/builds/2012-07-25_00-10-59/archive/org.apache.isis.core/metamodel/0.3.1-incubating-SNAPSHOT/metamodel-0.3.1-incubating-SNAPSHOT.jar
[JENKINS] Archiving <https://builds.apache.org/job/isis-framework-ubuntu/ws/framework/core/metamodel/target/metamodel-0.3.1-incubating-SNAPSHOT-site.xml> to /home/hudson/hudson/jobs/isis-framework-ubuntu/modules/org.apache.isis.core$metamodel/builds/2012-07-25_00-10-59/archive/org.apache.isis.core/metamodel/0.3.1-incubating-SNAPSHOT/metamodel-0.3.1-incubating-SNAPSHOT-site.xml
[JENKINS] Archiving <https://builds.apache.org/job/isis-framework-ubuntu/ws/framework/core/metamodel/target/metamodel-0.3.1-incubating-SNAPSHOT-sources.jar> to /home/hudson/hudson/jobs/isis-framework-ubuntu/modules/org.apache.isis.core$metamodel/builds/2012-07-25_00-10-59/archive/org.apache.isis.core/metamodel/0.3.1-incubating-SNAPSHOT/metamodel-0.3.1-incubating-SNAPSHOT-sources.jar
[JENKINS] Archiving <https://builds.apache.org/job/isis-framework-ubuntu/ws/framework/core/metamodel/target/metamodel-0.3.1-incubating-SNAPSHOT-test-sources.jar> to /home/hudson/hudson/jobs/isis-framework-ubuntu/modules/org.apache.isis.core$metamodel/builds/2012-07-25_00-10-59/archive/org.apache.isis.core/metamodel/0.3.1-incubating-SNAPSHOT/metamodel-0.3.1-incubating-SNAPSHOT-test-sources.jar
[JENKINS] Archiving <https://builds.apache.org/job/isis-framework-ubuntu/ws/framework/core/metamodel/target/metamodel-0.3.1-incubating-SNAPSHOT-tests.jar> to /home/hudson/hudson/jobs/isis-framework-ubuntu/modules/org.apache.isis.core$metamodel/builds/2012-07-25_00-10-59/archive/org.apache.isis.core/metamodel/0.3.1-incubating-SNAPSHOT/metamodel-0.3.1-incubating-SNAPSHOT-tests.jar
[JENKINS] Archiving <https://builds.apache.org/job/isis-framework-ubuntu/ws/framework/progmodels/wrapper/wrapper-applib/pom.xml> to /home/hudson/hudson/jobs/isis-framework-ubuntu/modules/org.apache.isis.progmodels$wrapper-applib/builds/2012-07-25_00-10-59/archive/org.apache.isis.progmodels/wrapper-applib/0.3.1-incubating-SNAPSHOT/wrapper-applib-0.3.1-incubating-SNAPSHOT.pom
[JENKINS] Archiving <https://builds.apache.org/job/isis-framework-ubuntu/ws/framework/core/runtime/pom.xml> to /home/hudson/hudson/jobs/isis-framework-ubuntu/modules/org.apache.isis.core$runtime/builds/2012-07-25_00-10-59/archive/org.apache.isis.core/runtime/0.3.1-incubating-SNAPSHOT/runtime-0.3.1-incubating-SNAPSHOT.pom
[JENKINS] Archiving <https://builds.apache.org/job/isis-framework-ubuntu/ws/framework/core/runtime/target/runtime-0.3.1-incubating-SNAPSHOT.jar> to /home/hudson/hudson/jobs/isis-framework-ubuntu/modules/org.apache.isis.core$runtime/builds/2012-07-25_00-10-59/archive/org.apache.isis.core/runtime/0.3.1-incubating-SNAPSHOT/runtime-0.3.1-incubating-SNAPSHOT.jar
[JENKINS] Archiving <https://builds.apache.org/job/isis-framework-ubuntu/ws/framework/core/runtime/target/runtime-0.3.1-incubating-SNAPSHOT-site.xml> to /home/hudson/hudson/jobs/isis-framework-ubuntu/modules/org.apache.isis.core$runtime/builds/2012-07-25_00-10-59/archive/org.apache.isis.core/runtime/0.3.1-incubating-SNAPSHOT/runtime-0.3.1-incubating-SNAPSHOT-site.xml
[JENKINS] Archiving <https://builds.apache.org/job/isis-framework-ubuntu/ws/framework/core/runtime/target/runtime-0.3.1-incubating-SNAPSHOT-sources.jar> to /home/hudson/hudson/jobs/isis-framework-ubuntu/modules/org.apache.isis.core$runtime/builds/2012-07-25_00-10-59/archive/org.apache.isis.core/runtime/0.3.1-incubating-SNAPSHOT/runtime-0.3.1-incubating-SNAPSHOT-sources.jar
[JENKINS] Archiving <https://builds.apache.org/job/isis-framework-ubuntu/ws/framework/core/runtime/target/runtime-0.3.1-incubating-SNAPSHOT-test-sources.jar> to /home/hudson/hudson/jobs/isis-framework-ubuntu/modules/org.apache.isis.core$runtime/builds/2012-07-25_00-10-59/archive/org.apache.isis.core/runtime/0.3.1-incubating-SNAPSHOT/runtime-0.3.1-incubating-SNAPSHOT-test-sources.jar
[JENKINS] Archiving <https://builds.apache.org/job/isis-framework-ubuntu/ws/framework/core/runtime/target/runtime-0.3.1-incubating-SNAPSHOT-tests.jar> to /home/hudson/hudson/jobs/isis-framework-ubuntu/modules/org.apache.isis.core$runtime/builds/2012-07-25_00-10-59/archive/org.apache.isis.core/runtime/0.3.1-incubating-SNAPSHOT/runtime-0.3.1-incubating-SNAPSHOT-tests.jar
[JENKINS] Archiving <https://builds.apache.org/job/isis-framework-ubuntu/ws/framework/viewer/wicket/wicket-ui/pom.xml> to /home/hudson/hudson/jobs/isis-framework-ubuntu/modules/org.apache.isis.viewer$wicket-ui/builds/2012-07-25_00-11-00/archive/org.apache.isis.viewer/wicket-ui/0.3.1-incubating-SNAPSHOT/wicket-ui-0.3.1-incubating-SNAPSHOT.pom
[JENKINS] Archiving <https://builds.apache.org/job/isis-framework-ubuntu/ws/framework/progmodels/pom.xml> to /home/hudson/hudson/jobs/isis-framework-ubuntu/modules/org.apache.isis$progmodels/builds/2012-07-25_00-10-59/archive/org.apache.isis/progmodels/0.3.1-incubating-SNAPSHOT/progmodels-0.3.1-incubating-SNAPSHOT.pom
[JENKINS] Archiving <https://builds.apache.org/job/isis-framework-ubuntu/ws/framework/progmodels/target/progmodels-0.3.1-incubating-SNAPSHOT-site.xml> to /home/hudson/hudson/jobs/isis-framework-ubuntu/modules/org.apache.isis$progmodels/builds/2012-07-25_00-10-59/archive/org.apache.isis/progmodels/0.3.1-incubating-SNAPSHOT/progmodels-0.3.1-incubating-SNAPSHOT-site.xml
[JENKINS] Archiving <https://builds.apache.org/job/isis-framework-ubuntu/ws/framework/progmodels/target/progmodels-0.3.1-incubating-SNAPSHOT-tests.jar> to /home/hudson/hudson/jobs/isis-framework-ubuntu/modules/org.apache.isis$progmodels/builds/2012-07-25_00-10-59/archive/org.apache.isis/progmodels/0.3.1-incubating-SNAPSHOT/progmodels-0.3.1-incubating-SNAPSHOT-tests.jar
[JENKINS] Archiving <https://builds.apache.org/job/isis-framework-ubuntu/ws/framework/core/testsupport/pom.xml> to /home/hudson/hudson/jobs/isis-framework-ubuntu/modules/org.apache.isis.core$testsupport/builds/2012-07-25_00-10-59/archive/org.apache.isis.core/testsupport/0.3.1-incubating-SNAPSHOT/testsupport-0.3.1-incubating-SNAPSHOT.pom
[JENKINS] Archiving <https://builds.apache.org/job/isis-framework-ubuntu/ws/framework/core/testsupport/target/testsupport-0.3.1-incubating-SNAPSHOT.jar> to /home/hudson/hudson/jobs/isis-framework-ubuntu/modules/org.apache.isis.core$testsupport/builds/2012-07-25_00-10-59/archive/org.apache.isis.core/testsupport/0.3.1-incubating-SNAPSHOT/testsupport-0.3.1-incubating-SNAPSHOT.jar
[JENKINS] Archiving <https://builds.apache.org/job/isis-framework-ubuntu/ws/framework/core/testsupport/target/testsupport-0.3.1-incubating-SNAPSHOT-site.xml> to /home/hudson/hudson/jobs/isis-framework-ubuntu/modules/org.apache.isis.core$testsupport/builds/2012-07-25_00-10-59/archive/org.apache.isis.core/testsupport/0.3.1-incubating-SNAPSHOT/testsupport-0.3.1-incubating-SNAPSHOT-site.xml
[JENKINS] Archiving <https://builds.apache.org/job/isis-framework-ubuntu/ws/framework/core/testsupport/target/testsupport-0.3.1-incubating-SNAPSHOT-sources.jar> to /home/hudson/hudson/jobs/isis-framework-ubuntu/modules/org.apache.isis.core$testsupport/builds/2012-07-25_00-10-59/archive/org.apache.isis.core/testsupport/0.3.1-incubating-SNAPSHOT/testsupport-0.3.1-incubating-SNAPSHOT-sources.jar
[JENKINS] Archiving <https://builds.apache.org/job/isis-framework-ubuntu/ws/framework/core/testsupport/target/testsupport-0.3.1-incubating-SNAPSHOT-test-sources.jar> to /home/hudson/hudson/jobs/isis-framework-ubuntu/modules/org.apache.isis.core$testsupport/builds/2012-07-25_00-10-59/archive/org.apache.isis.core/testsupport/0.3.1-incubating-SNAPSHOT/testsupport-0.3.1-incubating-SNAPSHOT-test-sources.jar
[JENKINS] Archiving <https://builds.apache.org/job/isis-framework-ubuntu/ws/framework/core/testsupport/target/testsupport-0.3.1-incubating-SNAPSHOT-tests.jar> to /home/hudson/hudson/jobs/isis-framework-ubuntu/modules/org.apache.isis.core$testsupport/builds/2012-07-25_00-10-59/archive/org.apache.isis.core/testsupport/0.3.1-incubating-SNAPSHOT/testsupport-0.3.1-incubating-SNAPSHOT-tests.jar
[JENKINS] Archiving <https://builds.apache.org/job/isis-framework-ubuntu/ws/framework/core/progmodel/pom.xml> to /home/hudson/hudson/jobs/isis-framework-ubuntu/modules/org.apache.isis.core$progmodel/builds/2012-07-25_00-10-59/archive/org.apache.isis.core/progmodel/0.3.1-incubating-SNAPSHOT/progmodel-0.3.1-incubating-SNAPSHOT.pom
[JENKINS] Archiving <https://builds.apache.org/job/isis-framework-ubuntu/ws/framework/core/progmodel/target/progmodel-0.3.1-incubating-SNAPSHOT.jar> to /home/hudson/hudson/jobs/isis-framework-ubuntu/modules/org.apache.isis.core$progmodel/builds/2012-07-25_00-10-59/archive/org.apache.isis.core/progmodel/0.3.1-incubating-SNAPSHOT/progmodel-0.3.1-incubating-SNAPSHOT.jar
[JENKINS] Archiving <https://builds.apache.org/job/isis-framework-ubuntu/ws/framework/core/progmodel/target/progmodel-0.3.1-incubating-SNAPSHOT-site.xml> to /home/hudson/hudson/jobs/isis-framework-ubuntu/modules/org.apache.isis.core$progmodel/builds/2012-07-25_00-10-59/archive/org.apache.isis.core/progmodel/0.3.1-incubating-SNAPSHOT/progmodel-0.3.1-incubating-SNAPSHOT-site.xml
[JENKINS] Archiving <https://builds.apache.org/job/isis-framework-ubuntu/ws/framework/core/progmodel/target/progmodel-0.3.1-incubating-SNAPSHOT-sources.jar> to /home/hudson/hudson/jobs/isis-framework-ubuntu/modules/org.apache.isis.core$progmodel/builds/2012-07-25_00-10-59/archive/org.apache.isis.core/progmodel/0.3.1-incubating-SNAPSHOT/progmodel-0.3.1-incubating-SNAPSHOT-sources.jar
[JENKINS] Archiving <https://builds.apache.org/job/isis-framework-ubuntu/ws/framework/core/progmodel/target/progmodel-0.3.1-incubating-SNAPSHOT-test-sources.jar> to /home/hudson/hudson/jobs/isis-framework-ubuntu/modules/org.apache.isis.core$progmodel/builds/2012-07-25_00-10-59/archive/org.apache.isis.core/progmodel/0.3.1-incubating-SNAPSHOT/progmodel-0.3.1-incubating-SNAPSHOT-test-sources.jar
[JENKINS] Archiving <https://builds.apache.org/job/isis-framework-ubuntu/ws/framework/core/progmodel/target/progmodel-0.3.1-incubating-SNAPSHOT-tests.jar> to /home/hudson/hudson/jobs/isis-framework-ubuntu/modules/org.apache.isis.core$progmodel/builds/2012-07-25_00-10-59/archive/org.apache.isis.core/progmodel/0.3.1-incubating-SNAPSHOT/progmodel-0.3.1-incubating-SNAPSHOT-tests.jar
[JENKINS] Archiving <https://builds.apache.org/job/isis-framework-ubuntu/ws/framework/runtimes/dflt/profilestores/xml/pom.xml> to /home/hudson/hudson/jobs/isis-framework-ubuntu/modules/org.apache.isis.runtimes.dflt.profilestores$xml/builds/2012-07-25_00-10-59/archive/org.apache.isis.runtimes.dflt.profilestores/xml/0.3.1-incubating-SNAPSHOT/xml-0.3.1-incubating-SNAPSHOT.pom
[JENKINS] Archiving <https://builds.apache.org/job/isis-framework-ubuntu/ws/framework/viewer/bdd/concordion/pom.xml> to /home/hudson/hudson/jobs/isis-framework-ubuntu/modules/org.apache.isis.viewer$bdd-concordion/builds/2012-07-25_00-11-00/archive/org.apache.isis.viewer/bdd-concordion/0.3.1-incubating-SNAPSHOT/bdd-concordion-0.3.1-incubating-SNAPSHOT.pom
[JENKINS] Archiving <https://builds.apache.org/job/isis-framework-ubuntu/ws/framework/runtimes/dflt/profilestores/pom.xml> to /home/hudson/hudson/jobs/isis-framework-ubuntu/modules/org.apache.isis.runtimes.dflt$profilestores/builds/2012-07-25_00-10-59/archive/org.apache.isis.runtimes.dflt/profilestores/0.3.1-incubating-SNAPSHOT/profilestores-0.3.1-incubating-SNAPSHOT.pom
[JENKINS] Archiving <https://builds.apache.org/job/isis-framework-ubuntu/ws/framework/viewer/html/pom.xml> to /home/hudson/hudson/jobs/isis-framework-ubuntu/modules/org.apache.isis.viewer$html/builds/2012-07-25_00-11-00/archive/org.apache.isis.viewer/html/0.3.1-incubating-SNAPSHOT/html-0.3.1-incubating-SNAPSHOT.pom
[JENKINS] Archiving <https://builds.apache.org/job/isis-framework-ubuntu/ws/framework/viewer/restfulobjects/restfulobjects-tck/pom.xml> to /home/hudson/hudson/jobs/isis-framework-ubuntu/modules/org.apache.isis.viewer$restfulobjects-tck/builds/2012-07-25_00-11-00/archive/org.apache.isis.viewer/restfulobjects-tck/0.3.1-incubating-SNAPSHOT/restfulobjects-tck-0.3.1-incubating-SNAPSHOT.pom
[JENKINS] Archiving <https://builds.apache.org/job/isis-framework-ubuntu/ws/framework/runtimes/dflt/profilestores/sql/pom.xml> to /home/hudson/hudson/jobs/isis-framework-ubuntu/modules/org.apache.isis.runtimes.dflt.profilestores$sql/builds/2012-07-25_00-10-59/archive/org.apache.isis.runtimes.dflt.profilestores/sql/0.3.1-incubating-SNAPSHOT/sql-0.3.1-incubating-SNAPSHOT.pom
[JENKINS] Archiving <https://builds.apache.org/job/isis-framework-ubuntu/ws/framework/runtimes/dflt/runtime/pom.xml> to /home/hudson/hudson/jobs/isis-framework-ubuntu/modules/org.apache.isis.runtimes.dflt$runtime/builds/2012-07-25_00-10-59/archive/org.apache.isis.runtimes.dflt/runtime/0.3.1-incubating-SNAPSHOT/runtime-0.3.1-incubating-SNAPSHOT.pom
[JENKINS] Archiving <https://builds.apache.org/job/isis-framework-ubuntu/ws/framework/runtimes/dflt/runtime/target/runtime-0.3.1-incubating-SNAPSHOT.jar> to /home/hudson/hudson/jobs/isis-framework-ubuntu/modules/org.apache.isis.runtimes.dflt$runtime/builds/2012-07-25_00-10-59/archive/org.apache.isis.runtimes.dflt/runtime/0.3.1-incubating-SNAPSHOT/runtime-0.3.1-incubating-SNAPSHOT.jar
[JENKINS] Archiving <https://builds.apache.org/job/isis-framework-ubuntu/ws/framework/runtimes/dflt/runtime/target/runtime-0.3.1-incubating-SNAPSHOT-site.xml> to /home/hudson/hudson/jobs/isis-framework-ubuntu/modules/org.apache.isis.runtimes.dflt$runtime/builds/2012-07-25_00-10-59/archive/org.apache.isis.runtimes.dflt/runtime/0.3.1-incubating-SNAPSHOT/runtime-0.3.1-incubating-SNAPSHOT-site.xml
[JENKINS] Archiving <https://builds.apache.org/job/isis-framework-ubuntu/ws/framework/runtimes/dflt/runtime/target/runtime-0.3.1-incubating-SNAPSHOT-sources.jar> to /home/hudson/hudson/jobs/isis-framework-ubuntu/modules/org.apache.isis.runtimes.dflt$runtime/builds/2012-07-25_00-10-59/archive/org.apache.isis.runtimes.dflt/runtime/0.3.1-incubating-SNAPSHOT/runtime-0.3.1-incubating-SNAPSHOT-sources.jar
[JENKINS] Archiving <https://builds.apache.org/job/isis-framework-ubuntu/ws/framework/runtimes/dflt/runtime/target/runtime-0.3.1-incubating-SNAPSHOT-test-sources.jar> to /home/hudson/hudson/jobs/isis-framework-ubuntu/modules/org.apache.isis.runtimes.dflt$runtime/builds/2012-07-25_00-10-59/archive/org.apache.isis.runtimes.dflt/runtime/0.3.1-incubating-SNAPSHOT/runtime-0.3.1-incubating-SNAPSHOT-test-sources.jar
[JENKINS] Archiving <https://builds.apache.org/job/isis-framework-ubuntu/ws/framework/runtimes/dflt/runtime/target/runtime-0.3.1-incubating-SNAPSHOT-tests.jar> to /home/hudson/hudson/jobs/isis-framework-ubuntu/modules/org.apache.isis.runtimes.dflt$runtime/builds/2012-07-25_00-10-59/archive/org.apache.isis.runtimes.dflt/runtime/0.3.1-incubating-SNAPSHOT/runtime-0.3.1-incubating-SNAPSHOT-tests.jar
[JENKINS] Archiving <https://builds.apache.org/job/isis-framework-ubuntu/ws/framework/viewer/scimpi/scimpi-servlet/pom.xml> to /home/hudson/hudson/jobs/isis-framework-ubuntu/modules/org.apache.isis.viewer$scimpi-servlet/builds/2012-07-25_00-11-00/archive/org.apache.isis.viewer/scimpi-servlet/0.3.1-incubating-SNAPSHOT/scimpi-servlet-0.3.1-incubating-SNAPSHOT.pom
[JENKINS] Archiving <https://builds.apache.org/job/isis-framework-ubuntu/ws/framework/applib/pom.xml> to /home/hudson/hudson/jobs/isis-framework-ubuntu/modules/org.apache.isis$applib/builds/2012-07-25_00-10-59/archive/org.apache.isis/applib/0.3.1-incubating-SNAPSHOT/applib-0.3.1-incubating-SNAPSHOT.pom
[JENKINS] Archiving <https://builds.apache.org/job/isis-framework-ubuntu/ws/framework/applib/target/applib-0.3.1-incubating-SNAPSHOT.jar> to /home/hudson/hudson/jobs/isis-framework-ubuntu/modules/org.apache.isis$applib/builds/2012-07-25_00-10-59/archive/org.apache.isis/applib/0.3.1-incubating-SNAPSHOT/applib-0.3.1-incubating-SNAPSHOT.jar
[JENKINS] Archiving <https://builds.apache.org/job/isis-framework-ubuntu/ws/framework/applib/target/applib-0.3.1-incubating-SNAPSHOT-site.xml> to /home/hudson/hudson/jobs/isis-framework-ubuntu/modules/org.apache.isis$applib/builds/2012-07-25_00-10-59/archive/org.apache.isis/applib/0.3.1-incubating-SNAPSHOT/applib-0.3.1-incubating-SNAPSHOT-site.xml
[JENKINS] Archiving <https://builds.apache.org/job/isis-framework-ubuntu/ws/framework/applib/target/applib-0.3.1-incubating-SNAPSHOT-sources.jar> to /home/hudson/hudson/jobs/isis-framework-ubuntu/modules/org.apache.isis$applib/builds/2012-07-25_00-10-59/archive/org.apache.isis/applib/0.3.1-incubating-SNAPSHOT/applib-0.3.1-incubating-SNAPSHOT-sources.jar
[JENKINS] Archiving <https://builds.apache.org/job/isis-framework-ubuntu/ws/framework/applib/target/applib-0.3.1-incubating-SNAPSHOT-test-sources.jar> to /home/hudson/hudson/jobs/isis-framework-ubuntu/modules/org.apache.isis$applib/builds/2012-07-25_00-10-59/archive/org.apache.isis/applib/0.3.1-incubating-SNAPSHOT/applib-0.3.1-incubating-SNAPSHOT-test-sources.jar
[JENKINS] Archiving <https://builds.apache.org/job/isis-framework-ubuntu/ws/framework/applib/target/applib-0.3.1-incubating-SNAPSHOT-tests.jar> to /home/hudson/hudson/jobs/isis-framework-ubuntu/modules/org.apache.isis$applib/builds/2012-07-25_00-10-59/archive/org.apache.isis/applib/0.3.1-incubating-SNAPSHOT/applib-0.3.1-incubating-SNAPSHOT-tests.jar
[JENKINS] Archiving <https://builds.apache.org/job/isis-framework-ubuntu/ws/framework/security/file/pom.xml> to /home/hudson/hudson/jobs/isis-framework-ubuntu/modules/org.apache.isis.security$file/builds/2012-07-25_00-11-00/archive/org.apache.isis.security/file/0.3.1-incubating-SNAPSHOT/file-0.3.1-incubating-SNAPSHOT.pom
[JENKINS] Archiving <https://builds.apache.org/job/isis-framework-ubuntu/ws/framework/viewer/html-tck/pom.xml> to /home/hudson/hudson/jobs/isis-framework-ubuntu/modules/org.apache.isis.viewer$html-tck/builds/2012-07-25_00-11-00/archive/org.apache.isis.viewer/html-tck/0.3.1-incubating-SNAPSHOT/html-tck-0.3.1-incubating-SNAPSHOT.pom
[JENKINS] Archiving <https://builds.apache.org/job/isis-framework-ubuntu/ws/framework/viewer/wicket/pom.xml> to /home/hudson/hudson/jobs/isis-framework-ubuntu/modules/org.apache.isis.viewer$wicket/builds/2012-07-25_00-11-00/archive/org.apache.isis.viewer/wicket/0.3.1-incubating-SNAPSHOT/wicket-0.3.1-incubating-SNAPSHOT.pom
[JENKINS] Archiving <https://builds.apache.org/job/isis-framework-ubuntu/ws/framework/viewer/wicket/target/wicket-0.3.1-incubating-SNAPSHOT-site.xml> to /home/hudson/hudson/jobs/isis-framework-ubuntu/modules/org.apache.isis.viewer$wicket/builds/2012-07-25_00-11-00/archive/org.apache.isis.viewer/wicket/0.3.1-incubating-SNAPSHOT/wicket-0.3.1-incubating-SNAPSHOT-site.xml
[JENKINS] Archiving <https://builds.apache.org/job/isis-framework-ubuntu/ws/framework/viewer/wicket/target/wicket-0.3.1-incubating-SNAPSHOT-tests.jar> to /home/hudson/hudson/jobs/isis-framework-ubuntu/modules/org.apache.isis.viewer$wicket/builds/2012-07-25_00-11-00/archive/org.apache.isis.viewer/wicket/0.3.1-incubating-SNAPSHOT/wicket-0.3.1-incubating-SNAPSHOT-tests.jar
[JENKINS] Archiving <https://builds.apache.org/job/isis-framework-ubuntu/ws/framework/runtimes/dflt/objectstores/jdo/jdo-applib/pom.xml> to /home/hudson/hudson/jobs/isis-framework-ubuntu/modules/org.apache.isis.runtimes.dflt.objectstores$jdo-applib/builds/2012-07-25_00-10-59/archive/org.apache.isis.runtimes.dflt.objectstores/jdo-applib/0.3.1-incubating-SNAPSHOT/jdo-applib-0.3.1-incubating-SNAPSHOT.pom
[JENKINS] Archiving <https://builds.apache.org/job/isis-framework-ubuntu/ws/framework/runtimes/dflt/objectstores/jdo/jdo-applib/target/jdo-applib-0.3.1-incubating-SNAPSHOT.jar> to /home/hudson/hudson/jobs/isis-framework-ubuntu/modules/org.apache.isis.runtimes.dflt.objectstores$jdo-applib/builds/2012-07-25_00-10-59/archive/org.apache.isis.runtimes.dflt.objectstores/jdo-applib/0.3.1-incubating-SNAPSHOT/jdo-applib-0.3.1-incubating-SNAPSHOT.jar
[JENKINS] Archiving <https://builds.apache.org/job/isis-framework-ubuntu/ws/framework/runtimes/dflt/objectstores/jdo/jdo-applib/target/jdo-applib-0.3.1-incubating-SNAPSHOT-site.xml> to /home/hudson/hudson/jobs/isis-framework-ubuntu/modules/org.apache.isis.runtimes.dflt.objectstores$jdo-applib/builds/2012-07-25_00-10-59/archive/org.apache.isis.runtimes.dflt.objectstores/jdo-applib/0.3.1-incubating-SNAPSHOT/jdo-applib-0.3.1-incubating-SNAPSHOT-site.xml
[JENKINS] Archiving <https://builds.apache.org/job/isis-framework-ubuntu/ws/framework/runtimes/dflt/objectstores/jdo/jdo-applib/target/jdo-applib-0.3.1-incubating-SNAPSHOT-sources.jar> to /home/hudson/hudson/jobs/isis-framework-ubuntu/modules/org.apache.isis.runtimes.dflt.objectstores$jdo-applib/builds/2012-07-25_00-10-59/archive/org.apache.isis.runtimes.dflt.objectstores/jdo-applib/0.3.1-incubating-SNAPSHOT/jdo-applib-0.3.1-incubating-SNAPSHOT-sources.jar
[JENKINS] Archiving <https://builds.apache.org/job/isis-framework-ubuntu/ws/framework/runtimes/dflt/objectstores/jdo/jdo-applib/target/jdo-applib-0.3.1-incubating-SNAPSHOT-test-sources.jar> to /home/hudson/hudson/jobs/isis-framework-ubuntu/modules/org.apache.isis.runtimes.dflt.objectstores$jdo-applib/builds/2012-07-25_00-10-59/archive/org.apache.isis.runtimes.dflt.objectstores/jdo-applib/0.3.1-incubating-SNAPSHOT/jdo-applib-0.3.1-incubating-SNAPSHOT-test-sources.jar
[JENKINS] Archiving <https://builds.apache.org/job/isis-framework-ubuntu/ws/framework/runtimes/dflt/objectstores/jdo/jdo-applib/target/jdo-applib-0.3.1-incubating-SNAPSHOT-tests.jar> to /home/hudson/hudson/jobs/isis-framework-ubuntu/modules/org.apache.isis.runtimes.dflt.objectstores$jdo-applib/builds/2012-07-25_00-10-59/archive/org.apache.isis.runtimes.dflt.objectstores/jdo-applib/0.3.1-incubating-SNAPSHOT/jdo-applib-0.3.1-incubating-SNAPSHOT-tests.jar
[JENKINS] Archiving <https://builds.apache.org/job/isis-framework-ubuntu/ws/framework/core/pom.xml> to /home/hudson/hudson/jobs/isis-framework-ubuntu/modules/org.apache.isis$core/builds/2012-07-25_00-10-59/archive/org.apache.isis/core/0.3.1-incubating-SNAPSHOT/core-0.3.1-incubating-SNAPSHOT.pom
[JENKINS] Archiving <https://builds.apache.org/job/isis-framework-ubuntu/ws/framework/core/target/core-0.3.1-incubating-SNAPSHOT-site.xml> to /home/hudson/hudson/jobs/isis-framework-ubuntu/modules/org.apache.isis$core/builds/2012-07-25_00-10-59/archive/org.apache.isis/core/0.3.1-incubating-SNAPSHOT/core-0.3.1-incubating-SNAPSHOT-site.xml
[JENKINS] Archiving <https://builds.apache.org/job/isis-framework-ubuntu/ws/framework/core/target/core-0.3.1-incubating-SNAPSHOT-tests.jar> to /home/hudson/hudson/jobs/isis-framework-ubuntu/modules/org.apache.isis$core/builds/2012-07-25_00-10-59/archive/org.apache.isis/core/0.3.1-incubating-SNAPSHOT/core-0.3.1-incubating-SNAPSHOT-tests.jar
[JENKINS] Archiving <https://builds.apache.org/job/isis-framework-ubuntu/ws/framework/runtimes/dflt/objectstores/jdo/pom.xml> to /home/hudson/hudson/jobs/isis-framework-ubuntu/modules/org.apache.isis.runtimes.dflt.objectstores$jdo/builds/2012-07-25_00-10-59/archive/org.apache.isis.runtimes.dflt.objectstores/jdo/0.3.1-incubating-SNAPSHOT/jdo-0.3.1-incubating-SNAPSHOT.pom
[JENKINS] Archiving <https://builds.apache.org/job/isis-framework-ubuntu/ws/framework/runtimes/dflt/objectstores/jdo/target/jdo-0.3.1-incubating-SNAPSHOT-site.xml> to /home/hudson/hudson/jobs/isis-framework-ubuntu/modules/org.apache.isis.runtimes.dflt.objectstores$jdo/builds/2012-07-25_00-10-59/archive/org.apache.isis.runtimes.dflt.objectstores/jdo/0.3.1-incubating-SNAPSHOT/jdo-0.3.1-incubating-SNAPSHOT-site.xml
[JENKINS] Archiving <https://builds.apache.org/job/isis-framework-ubuntu/ws/framework/runtimes/dflt/objectstores/jdo/target/jdo-0.3.1-incubating-SNAPSHOT-tests.jar> to /home/hudson/hudson/jobs/isis-framework-ubuntu/modules/org.apache.isis.runtimes.dflt.objectstores$jdo/builds/2012-07-25_00-10-59/archive/org.apache.isis.runtimes.dflt.objectstores/jdo/0.3.1-incubating-SNAPSHOT/jdo-0.3.1-incubating-SNAPSHOT-tests.jar
[JENKINS] Archiving <https://builds.apache.org/job/isis-framework-ubuntu/ws/framework/viewer/junit-tck/pom.xml> to /home/hudson/hudson/jobs/isis-framework-ubuntu/modules/org.apache.isis.viewer$junit-tck/builds/2012-07-25_00-11-00/archive/org.apache.isis.viewer/junit-tck/0.3.1-incubating-SNAPSHOT/junit-tck-0.3.1-incubating-SNAPSHOT.pom
[JENKINS] Archiving <https://builds.apache.org/job/isis-framework-ubuntu/ws/framework/viewer/dnd-tck/pom.xml> to /home/hudson/hudson/jobs/isis-framework-ubuntu/modules/org.apache.isis.viewer$dnd-tck/builds/2012-07-25_00-11-00/archive/org.apache.isis.viewer/dnd-tck/0.3.1-incubating-SNAPSHOT/dnd-tck-0.3.1-incubating-SNAPSHOT.pom
[JENKINS] Archiving <https://builds.apache.org/job/isis-framework-ubuntu/ws/framework/runtimes/dflt/objectstores/dflt/pom.xml> to /home/hudson/hudson/jobs/isis-framework-ubuntu/modules/org.apache.isis.runtimes.dflt.objectstores$dflt/builds/2012-07-25_00-10-59/archive/org.apache.isis.runtimes.dflt.objectstores/dflt/0.3.1-incubating-SNAPSHOT/dflt-0.3.1-incubating-SNAPSHOT.pom
Waiting for Jenkins to finish collecting data
mavenExecutionResult exceptions not empty
message : Failed to execute goal org.datanucleus:maven-datanucleus-plugin:3.0.2:enhance (default) on project tck-dom: Error executing DataNucleus tool org.datanucleus.enhancer.DataNucleusEnhancer
cause : Error executing DataNucleus tool org.datanucleus.enhancer.DataNucleusEnhancer
Stack trace : 
org.apache.maven.lifecycle.LifecycleExecutionException: Failed to execute goal org.datanucleus:maven-datanucleus-plugin:3.0.2:enhance (default) on project tck-dom: Error executing DataNucleus tool org.datanucleus.enhancer.DataNucleusEnhancer
	at org.apache.maven.lifecycle.internal.MojoExecutor.execute(MojoExecutor.java:217)
	at org.apache.maven.lifecycle.internal.MojoExecutor.execute(MojoExecutor.java:153)
	at org.apache.maven.lifecycle.internal.MojoExecutor.execute(MojoExecutor.java:145)
	at org.apache.maven.lifecycle.internal.LifecycleModuleBuilder.buildProject(LifecycleModuleBuilder.java:84)
	at org.apache.maven.lifecycle.internal.LifecycleModuleBuilder.buildProject(LifecycleModuleBuilder.java:59)
	at org.apache.maven.lifecycle.internal.LifecycleStarter.singleThreadedBuild(LifecycleStarter.java:183)
	at org.apache.maven.lifecycle.internal.LifecycleStarter.execute(LifecycleStarter.java:161)
	at org.apache.maven.DefaultMaven.doExecute(DefaultMaven.java:320)
	at org.apache.maven.DefaultMaven.execute(DefaultMaven.java:156)
	at org.jvnet.hudson.maven3.launcher.Maven3Launcher.main(Maven3Launcher.java:79)
	at sun.reflect.NativeMethodAccessorImpl.invoke0(Native Method)
	at sun.reflect.NativeMethodAccessorImpl.invoke(NativeMethodAccessorImpl.java:39)
	at sun.reflect.DelegatingMethodAccessorImpl.invoke(DelegatingMethodAccessorImpl.java:25)
	at java.lang.reflect.Method.invoke(Method.java:597)
	at org.codehaus.plexus.classworlds.launcher.Launcher.launchStandard(Launcher.java:329)
	at org.codehaus.plexus.classworlds.launcher.Launcher.launch(Launcher.java:239)
	at org.jvnet.hudson.maven3.agent.Maven3Main.launch(Maven3Main.java:158)
	at hudson.maven.Maven3Builder.call(Maven3Builder.java:98)
	at hudson.maven.Maven3Builder.call(Maven3Builder.java:64)
	at hudson.remoting.UserRequest.perform(UserRequest.java:118)
	at hudson.remoting.UserRequest.perform(UserRequest.java:48)
	at hudson.remoting.Request$2.run(Request.java:326)
	at hudson.remoting.InterceptingExecutorService$1.call(InterceptingExecutorService.java:72)
	at java.util.concurrent.FutureTask$Sync.innerRun(FutureTask.java:303)
	at java.util.concurrent.FutureTask.run(FutureTask.java:138)
	at java.util.concurrent.ThreadPoolExecutor$Worker.runTask(ThreadPoolExecutor.java:886)
	at java.util.concurrent.ThreadPoolExecutor$Worker.run(ThreadPoolExecutor.java:908)
	at java.lang.Thread.run(Thread.java:662)
Caused by: org.apache.maven.plugin.MojoExecutionException: Error executing DataNucleus tool org.datanucleus.enhancer.DataNucleusEnhancer
	at org.datanucleus.maven.AbstractDataNucleusMojo.executeInJvm(AbstractDataNucleusMojo.java:350)
	at org.datanucleus.maven.AbstractEnhancerMojo.enhance(AbstractEnhancerMojo.java:249)
	at org.datanucleus.maven.AbstractEnhancerMojo.executeDataNucleusTool(AbstractEnhancerMojo.java:72)
	at org.datanucleus.maven.AbstractDataNucleusMojo.execute(AbstractDataNucleusMojo.java:126)
	at org.apache.maven.plugin.DefaultBuildPluginManager.executeMojo(DefaultBuildPluginManager.java:101)
	at org.apache.maven.lifecycle.internal.MojoExecutor.execute(MojoExecutor.java:209)
	... 27 more
Caused by: java.lang.reflect.InvocationTargetException
	at sun.reflect.NativeMethodAccessorImpl.invoke0(Native Method)
	at sun.reflect.NativeMethodAccessorImpl.invoke(NativeMethodAccessorImpl.java:39)
	at sun.reflect.DelegatingMethodAccessorImpl.invoke(DelegatingMethodAccessorImpl.java:25)
	at java.lang.reflect.Method.invoke(Method.java:597)
	at org.datanucleus.maven.AbstractDataNucleusMojo.executeInJvm(AbstractDataNucleusMojo.java:333)
	... 32 more
Caused by: org.datanucleus.exceptions.NucleusException: Plugin (Bundle) "org.datanucleus.enhancer" is already registered. Ensure you dont have multiple JAR versions of the same plugin in the classpath. The URL "file:/home/jenkins/jenkins-slave/maven-repositories/1/org/datanucleus/datanucleus-enhancer/3.0.1/datanucleus-enhancer-3.0.1.jar" is already registered, and you are trying to register an identical plugin located at URL "file:/x1/jenkins/jenkins-slave/maven-repositories/1/org/datanucleus/datanucleus-enhancer/3.0.1/datanucleus-enhancer-3.0.1.jar."
	at org.datanucleus.plugin.NonManagedPluginRegistry.registerBundle(NonManagedPluginRegistry.java:541)
	at org.datanucleus.plugin.NonManagedPluginRegistry.registerBundle(NonManagedPluginRegistry.java:395)
	at org.datanucleus.plugin.NonManagedPluginRegistry.registerExtensions(NonManagedPluginRegistry.java:219)
	at org.datanucleus.plugin.NonManagedPluginRegistry.registerExtensionPoints(NonManagedPluginRegistry.java:160)
	at org.datanucleus.plugin.PluginManager.<init>(PluginManager.java:65)
	at org.datanucleus.plugin.PluginManager.createPluginManager(PluginManager.java:416)
	at org.datanucleus.NucleusContext.<init>(NucleusContext.java:216)
	at org.datanucleus.NucleusContext.<init>(NucleusContext.java:196)
	at org.datanucleus.enhancer.DataNucleusEnhancer.<init>(DataNucleusEnhancer.java:171)
	at org.datanucleus.enhancer.DataNucleusEnhancer.main(DataNucleusEnhancer.java:1265)
	... 37 more
Sending e-mails to: isis-dev@incubator.apache.org
channel stopped

Mime
View raw message