incubator-isis-dev mailing list archives

Site index · List index
Message view « Date » · « Thread »
Top « Date » · « Thread »
From Apache Jenkins Server <jenk...@builds.apache.org>
Subject Build failed in Jenkins: isis-framework-ubuntu » JPA ObjectStore MetaModel Support #327
Date Thu, 31 May 2012 01:05:57 GMT
See <https://builds.apache.org/job/isis-framework-ubuntu/org.apache.isis.runtimes.dflt.objectstores$jpa-openjpa/327/changes>

Changes:

[danhaywood] ISIS-48: more on openjpa object store

------------------------------------------
projectStarted org.apache.isis.runtimes.dflt.objectstores:jpa-openjpa:0.3.1-incubating-SNAPSHOT
[INFO]                                                                         
[INFO] ------------------------------------------------------------------------
[INFO] Building JPA ObjectStore MetaModel Support 0.3.1-incubating-SNAPSHOT
[INFO] ------------------------------------------------------------------------
mojoStarted org.apache.maven.plugins:maven-clean-plugin:2.4.1(default-clean)
[INFO] 
[INFO] --- maven-clean-plugin:2.4.1:clean (default-clean) @ jpa-openjpa ---
mojoSucceeded org.apache.maven.plugins:maven-clean-plugin:2.4.1(default-clean)
mojoStarted org.apache.maven.plugins:maven-enforcer-plugin:1.0.1(validate-enforce)[INFO] The
requirePluginVersions rule is currently not compatible with Maven3.

[INFO] 
[INFO] --- maven-enforcer-plugin:1.0.1:enforce (validate-enforce) @ jpa-openjpa ---
mojoSucceeded org.apache.maven.plugins:maven-enforcer-plugin:1.0.1(validate-enforce)
mojoStarted org.apache.maven.plugins:maven-remote-resources-plugin:1.2.1(default)
[INFO] 
[INFO] --- maven-remote-resources-plugin:1.2.1:process (default) @ jpa-openjpa ---
mojoSucceeded org.apache.maven.plugins:maven-remote-resources-plugin:1.2.1(default)
mojoStarted org.apache.maven.plugins:maven-remote-resources-plugin:1.2.1(process-remote-resources)[INFO]
Skipping remote-resource generation in this project because it's not the Execution Root

[INFO] 
[INFO] --- maven-remote-resources-plugin:1.2.1:process (process-remote-resources) @ jpa-openjpa
---
mojoSucceeded org.apache.maven.plugins:maven-remote-resources-plugin:1.2.1(process-remote-resources)
mojoStarted org.apache.maven.plugins:maven-resources-plugin:2.4.3(default-resources)[INFO]
Using 'UTF-8' encoding to copy filtered resources.
[INFO] Copying 0 resource
[INFO] Copying 3 resources

[INFO] 
[INFO] --- maven-resources-plugin:2.4.3:resources (default-resources) @ jpa-openjpa ---
mojoSucceeded org.apache.maven.plugins:maven-resources-plugin:2.4.3(default-resources)
mojoStarted org.apache.maven.plugins:maven-compiler-plugin:2.3.1(default-compile)[INFO] Compiling
21 source files to <https://builds.apache.org/job/isis-framework-ubuntu/org.apache.isis.runtimes.dflt.objectstores$jpa-openjpa/ws/target/classes>

[INFO] 
[INFO] --- maven-compiler-plugin:2.3.1:compile (default-compile) @ jpa-openjpa ---
[INFO] -------------------------------------------------------------
[ERROR] COMPILATION ERROR : 
[INFO] -------------------------------------------------------------
[ERROR] <https://builds.apache.org/job/isis-framework-ubuntu/org.apache.isis.runtimes.dflt.objectstores$jpa-openjpa/ws/src/main/java/org/apache/isis/runtimes/dflt/objectstores/jpa/openjpa/persistence/IsisLifecycleListener.java>:[9,31]
package org.apache.openjpa.event does not exist

[ERROR] <https://builds.apache.org/job/isis-framework-ubuntu/org.apache.isis.runtimes.dflt.objectstores$jpa-openjpa/ws/src/main/java/org/apache/isis/runtimes/dflt/objectstores/jpa/openjpa/persistence/IsisLifecycleListener.java>:[10,31]
package org.apache.openjpa.event does not exist

[ERROR] <https://builds.apache.org/job/isis-framework-ubuntu/org.apache.isis.runtimes.dflt.objectstores$jpa-openjpa/ws/src/main/java/org/apache/isis/runtimes/dflt/objectstores/jpa/openjpa/persistence/IsisLifecycleListener.java>:[26,43]
cannot find symbol
symbol: class AbstractLifecycleListener
public class IsisLifecycleListener extends AbstractLifecycleListener implements SuspendableListener
{

[ERROR] <https://builds.apache.org/job/isis-framework-ubuntu/org.apache.isis.runtimes.dflt.objectstores$jpa-openjpa/ws/src/main/java/org/apache/isis/runtimes/dflt/objectstores/jpa/openjpa/persistence/IsisLifecycleListener.java>:[33,30]
cannot find symbol
symbol  : class LifecycleEvent
location: class org.apache.isis.runtimes.dflt.objectstores.jpa.openjpa.persistence.IsisLifecycleListener

[ERROR] <https://builds.apache.org/job/isis-framework-ubuntu/org.apache.isis.runtimes.dflt.objectstores$jpa-openjpa/ws/src/main/java/org/apache/isis/runtimes/dflt/objectstores/jpa/openjpa/persistence/IsisLifecycleListener.java>:[66,29]
cannot find symbol
symbol  : class LifecycleEvent
location: class org.apache.isis.runtimes.dflt.objectstores.jpa.openjpa.persistence.IsisLifecycleListener

[ERROR] <https://builds.apache.org/job/isis-framework-ubuntu/org.apache.isis.runtimes.dflt.objectstores$jpa-openjpa/ws/src/main/java/org/apache/isis/runtimes/dflt/objectstores/jpa/openjpa/persistence/IsisLifecycleListener.java>:[90,26]
cannot find symbol
symbol  : class LifecycleEvent
location: class org.apache.isis.runtimes.dflt.objectstores.jpa.openjpa.persistence.IsisLifecycleListener

[ERROR] <https://builds.apache.org/job/isis-framework-ubuntu/org.apache.isis.runtimes.dflt.objectstores$jpa-openjpa/ws/src/main/java/org/apache/isis/runtimes/dflt/objectstores/jpa/openjpa/persistence/IsisLifecycleListener.java>:[161,36]
cannot find symbol
symbol  : class LifecycleEvent
location: class org.apache.isis.runtimes.dflt.objectstores.jpa.openjpa.persistence.IsisLifecycleListener

[ERROR] <https://builds.apache.org/job/isis-framework-ubuntu/org.apache.isis.runtimes.dflt.objectstores$jpa-openjpa/ws/src/main/java/org/apache/isis/runtimes/dflt/objectstores/jpa/openjpa/OpenJpaApplicationComponents.java>:[12,37]
package org.apache.openjpa.persistence does not exist

[ERROR] <https://builds.apache.org/job/isis-framework-ubuntu/org.apache.isis.runtimes.dflt.objectstores$jpa-openjpa/ws/src/main/java/org/apache/isis/runtimes/dflt/objectstores/jpa/openjpa/OpenJpaApplicationComponents.java>:[24,18]
cannot find symbol
symbol  : class OpenJPAEntityManagerFactorySPI
location: class org.apache.isis.runtimes.dflt.objectstores.jpa.openjpa.OpenJpaApplicationComponents

[ERROR] <https://builds.apache.org/job/isis-framework-ubuntu/org.apache.isis.runtimes.dflt.objectstores$jpa-openjpa/ws/src/main/java/org/apache/isis/runtimes/dflt/objectstores/jpa/openjpa/OpenJpaObjectStore.java>:[17,24]
cannot find symbol
symbol  : class Transaction
location: package javax.transaction

[ERROR] <https://builds.apache.org/job/isis-framework-ubuntu/org.apache.isis.runtimes.dflt.objectstores$jpa-openjpa/ws/src/main/java/org/apache/isis/runtimes/dflt/objectstores/jpa/openjpa/OpenJpaObjectStore.java>:[23,37]
package org.apache.openjpa.persistence does not exist

[ERROR] <https://builds.apache.org/job/isis-framework-ubuntu/org.apache.isis.runtimes.dflt.objectstores$jpa-openjpa/ws/src/main/java/org/apache/isis/runtimes/dflt/objectstores/jpa/openjpa/metamodel/facets/RemoveOpenJpaEnhancementTypesFacetFactory.java>:[22,33]
package org.apache.openjpa.enhance does not exist

[ERROR] <https://builds.apache.org/job/isis-framework-ubuntu/org.apache.isis.runtimes.dflt.objectstores$jpa-openjpa/ws/src/main/java/org/apache/isis/runtimes/dflt/objectstores/jpa/openjpa/persistence/IsisLifecycleListener.java>:[32,4]
method does not override or implement a method from a supertype

[ERROR] <https://builds.apache.org/job/isis-framework-ubuntu/org.apache.isis.runtimes.dflt.objectstores$jpa-openjpa/ws/src/main/java/org/apache/isis/runtimes/dflt/objectstores/jpa/openjpa/persistence/IsisLifecycleListener.java>:[65,4]
method does not override or implement a method from a supertype

[ERROR] <https://builds.apache.org/job/isis-framework-ubuntu/org.apache.isis.runtimes.dflt.objectstores$jpa-openjpa/ws/src/main/java/org/apache/isis/runtimes/dflt/objectstores/jpa/openjpa/persistence/IsisLifecycleListener.java>:[89,4]
method does not override or implement a method from a supertype

[ERROR] <https://builds.apache.org/job/isis-framework-ubuntu/org.apache.isis.runtimes.dflt.objectstores$jpa-openjpa/ws/src/main/java/org/apache/isis/runtimes/dflt/objectstores/jpa/openjpa/OpenJpaApplicationComponents.java>:[40,35]
cannot find symbol
symbol  : class OpenJPAEntityManagerFactorySPI
location: class org.apache.isis.runtimes.dflt.objectstores.jpa.openjpa.OpenJpaApplicationComponents

[ERROR] <https://builds.apache.org/job/isis-framework-ubuntu/org.apache.isis.runtimes.dflt.objectstores$jpa-openjpa/ws/src/main/java/org/apache/isis/runtimes/dflt/objectstores/jpa/openjpa/OpenJpaObjectStore.java>:[216,8]
cannot find symbol
symbol  : class OpenJPAEntityManager
location: class org.apache.isis.runtimes.dflt.objectstores.jpa.openjpa.OpenJpaObjectStore

[ERROR] <https://builds.apache.org/job/isis-framework-ubuntu/org.apache.isis.runtimes.dflt.objectstores$jpa-openjpa/ws/src/main/java/org/apache/isis/runtimes/dflt/objectstores/jpa/openjpa/OpenJpaObjectStore.java>:[216,37]
cannot find symbol
symbol  : class OpenJPAEntityManager
location: class org.apache.isis.runtimes.dflt.objectstores.jpa.openjpa.OpenJpaObjectStore

[ERROR] <https://builds.apache.org/job/isis-framework-ubuntu/org.apache.isis.runtimes.dflt.objectstores$jpa-openjpa/ws/src/main/java/org/apache/isis/runtimes/dflt/objectstores/jpa/openjpa/metamodel/facets/RemoveOpenJpaEnhancementTypesFacetFactory.java>:[32,14]
cannot find symbol
symbol  : class PersistenceCapable
location: class org.apache.isis.runtimes.dflt.objectstores.jpa.openjpa.metamodel.facets.RemoveOpenJpaEnhancementTypesFacetFactory

[INFO] 19 errors 
mojoFailed org.apache.maven.plugins:maven-compiler-plugin:2.3.1(default-compile)[INFO] -------------------------------------------------------------

projectFailed org.apache.isis.runtimes.dflt.objectstores:jpa-openjpa:0.3.1-incubating-SNAPSHOT

Mime
View raw message