incubator-isis-dev mailing list archives

Site index · List index
Message view « Date » · « Thread »
Top « Date » · « Thread »
From Apache Jenkins Server <jenk...@builds.apache.org>
Subject Build failed in Jenkins: isis-trunk-windows » Restful Viewer2 Implementation #157
Date Sun, 26 Jun 2011 00:09:06 GMT
See <https://builds.apache.org/job/isis-trunk-windows/org.apache.isis.viewer$restful-viewer2/157/changes>

Changes:

[danhaywood] adding NOTICE files to each module/submodule (following vote on general@incubator.a.o
on 0.1.2-RC4-incubating)

[danhaywood] more work on viewer2; added ability to look up ObjectAction just by Id ('placeOrder')
rather than fully qualified Id 'placeOrder(..., ...)'

------------------------------------------
[INFO] ------------------------------------------------------------------------
[INFO] Building Restful Viewer2 Implementation
[INFO]    task-segment: [clean, install]
[INFO] ------------------------------------------------------------------------
[INFO] [clean:clean {execution: default-clean}]
[INFO] Deleting C:\hudson\hudson-slave\workspace\isis-trunk-windows\trunk\viewer\restful\viewer2\target
[INFO] [enforcer:enforce {execution: validate-enforce}]
[INFO] [remote-resources:process {execution: default}]
[INFO] [remote-resources:process {execution: process-remote-resources}]
[INFO] Skipping remote-resource generation in this project because it's not the Execution
Root
[INFO] [resources:resources {execution: default-resources}]
[INFO] Using 'UTF-8' encoding to copy filtered resources.
[INFO] Copying 4 resources
[INFO] Copying 3 resources
[INFO] [compiler:compile {execution: default-compile}]
[INFO] Compiling 35 source files to C:\hudson\hudson-slave\workspace\isis-trunk-windows\trunk\viewer\restful\viewer2\target\classes
[INFO] -------------------------------------------------------------
[ERROR] COMPILATION ERROR : 
[INFO] -------------------------------------------------------------
[ERROR] \hudson\hudson-slave\workspace\isis-trunk-windows\trunk\viewer\restful\viewer2\src\main\java\org\apache\isis\viewer\restful\viewer2\resources\objects\MutatorSpec.java:[25,141]
cannot find symbol
symbol  : class BodyArgs
location: class org.apache.isis.viewer.restful.viewer2.resources.objects.MutatorSpec

[ERROR] \hudson\hudson-slave\workspace\isis-trunk-windows\trunk\viewer\restful\viewer2\src\main\java\org\apache\isis\viewer\restful\viewer2\resources\objects\MutatorSpec.java:[29,141]
cannot find symbol
symbol  : class BodyArgs
location: class org.apache.isis.viewer.restful.viewer2.resources.objects.MutatorSpec

[ERROR] \hudson\hudson-slave\workspace\isis-trunk-windows\trunk\viewer\restful\viewer2\src\main\java\org\apache\isis\viewer\restful\viewer2\resources\objects\MutatorSpec.java:[37,17]
cannot find symbol
symbol  : class BodyArgs
location: class org.apache.isis.viewer.restful.viewer2.resources.objects.MutatorSpec

[ERROR] \hudson\hudson-slave\workspace\isis-trunk-windows\trunk\viewer\restful\viewer2\src\main\java\org\apache\isis\viewer\restful\viewer2\resources\objects\MutatorSpec.java:[39,132]
cannot find symbol
symbol  : class BodyArgs
location: class org.apache.isis.viewer.restful.viewer2.resources.objects.MutatorSpec

[ERROR] \hudson\hudson-slave\workspace\isis-trunk-windows\trunk\viewer\restful\viewer2\src\main\java\org\apache\isis\viewer\restful\viewer2\resources\objects\MemberType.java:[40,109]
cannot find symbol
symbol  : variable BodyArgs
location: class org.apache.isis.viewer.restful.viewer2.resources.objects.MemberType

[ERROR] \hudson\hudson-slave\workspace\isis-trunk-windows\trunk\viewer\restful\viewer2\src\main\java\org\apache\isis\viewer\restful\viewer2\resources\objects\MemberType.java:[41,110]
cannot find symbol
symbol  : variable BodyArgs
location: class org.apache.isis.viewer.restful.viewer2.resources.objects.MemberType

[ERROR] \hudson\hudson-slave\workspace\isis-trunk-windows\trunk\viewer\restful\viewer2\src\main\java\org\apache\isis\viewer\restful\viewer2\resources\objects\MemberType.java:[49,116]
cannot find symbol
symbol  : variable BodyArgs
location: class org.apache.isis.viewer.restful.viewer2.resources.objects.MemberType

[ERROR] \hudson\hudson-slave\workspace\isis-trunk-windows\trunk\viewer\restful\viewer2\src\main\java\org\apache\isis\viewer\restful\viewer2\resources\objects\MemberType.java:[50,134]
cannot find symbol
symbol  : variable BodyArgs
location: class org.apache.isis.viewer.restful.viewer2.resources.objects.MemberType

[ERROR] \hudson\hudson-slave\workspace\isis-trunk-windows\trunk\viewer\restful\viewer2\src\main\java\org\apache\isis\viewer\restful\viewer2\resources\objects\MemberType.java:[58,111]
cannot find symbol
symbol  : variable BodyArgs
location: class org.apache.isis.viewer.restful.viewer2.resources.objects.MemberType

[INFO] 9 errors 
[INFO] -------------------------------------------------------------
[JENKINS] Archiving C:\hudson\hudson-slave\workspace\isis-trunk-windows\trunk\viewer\restful\viewer2\pom.xml
to /home/hudson/hudson/jobs/isis-trunk-windows/modules/org.apache.isis.viewer$restful-viewer2/builds/2011-06-26_00-03-22/archive/org.apache.isis.viewer/restful-viewer2/0.1.2-incubating-SNAPSHOT/restful-viewer2-0.1.2-incubating-SNAPSHOT.pom
[INFO] ------------------------------------------------------------------------
[ERROR] BUILD FAILURE
[INFO] ------------------------------------------------------------------------
[INFO] Compilation failure

\hudson\hudson-slave\workspace\isis-trunk-windows\trunk\viewer\restful\viewer2\src\main\java\org\apache\isis\viewer\restful\viewer2\resources\objects\MutatorSpec.java:[25,141]
cannot find symbol
symbol  : class BodyArgs
location: class org.apache.isis.viewer.restful.viewer2.resources.objects.MutatorSpec

\hudson\hudson-slave\workspace\isis-trunk-windows\trunk\viewer\restful\viewer2\src\main\java\org\apache\isis\viewer\restful\viewer2\resources\objects\MutatorSpec.java:[29,141]
cannot find symbol
symbol  : class BodyArgs
location: class org.apache.isis.viewer.restful.viewer2.resources.objects.MutatorSpec

\hudson\hudson-slave\workspace\isis-trunk-windows\trunk\viewer\restful\viewer2\src\main\java\org\apache\isis\viewer\restful\viewer2\resources\objects\MutatorSpec.java:[37,17]
cannot find symbol
symbol  : class BodyArgs
location: class org.apache.isis.viewer.restful.viewer2.resources.objects.MutatorSpec

\hudson\hudson-slave\workspace\isis-trunk-windows\trunk\viewer\restful\viewer2\src\main\java\org\apache\isis\viewer\restful\viewer2\resources\objects\MutatorSpec.java:[39,132]
cannot find symbol
symbol  : class BodyArgs
location: class org.apache.isis.viewer.restful.viewer2.resources.objects.MutatorSpec

\hudson\hudson-slave\workspace\isis-trunk-windows\trunk\viewer\restful\viewer2\src\main\java\org\apache\isis\viewer\restful\viewer2\resources\objects\MemberType.java:[40,109]
cannot find symbol
symbol  : variable BodyArgs
location: class org.apache.isis.viewer.restful.viewer2.resources.objects.MemberType

\hudson\hudson-slave\workspace\isis-trunk-windows\trunk\viewer\restful\viewer2\src\main\java\org\apache\isis\viewer\restful\viewer2\resources\objects\MemberType.java:[41,110]
cannot find symbol
symbol  : variable BodyArgs
location: class org.apache.isis.viewer.restful.viewer2.resources.objects.MemberType

\hudson\hudson-slave\workspace\isis-trunk-windows\trunk\viewer\restful\viewer2\src\main\java\org\apache\isis\viewer\restful\viewer2\resources\objects\MemberType.java:[49,116]
cannot find symbol
symbol  : variable BodyArgs
location: class org.apache.isis.viewer.restful.viewer2.resources.objects.MemberType

\hudson\hudson-slave\workspace\isis-trunk-windows\trunk\viewer\restful\viewer2\src\main\java\org\apache\isis\viewer\restful\viewer2\resources\objects\MemberType.java:[50,134]
cannot find symbol
symbol  : variable BodyArgs
location: class org.apache.isis.viewer.restful.viewer2.resources.objects.MemberType

\hudson\hudson-slave\workspace\isis-trunk-windows\trunk\viewer\restful\viewer2\src\main\java\org\apache\isis\viewer\restful\viewer2\resources\objects\MemberType.java:[58,111]
cannot find symbol
symbol  : variable BodyArgs
location: class org.apache.isis.viewer.restful.viewer2.resources.objects.MemberType


[INFO] ------------------------------------------------------------------------
[INFO] For more information, run Maven with the -e switch
[INFO] ------------------------------------------------------------------------
[INFO] Total time: 5 minutes 36 seconds
[INFO] Finished at: Sun Jun 26 01:09:00 BST 2011
[INFO] Final Memory: 512M/1165M
[INFO] ------------------------------------------------------------------------


Mime
View raw message