incubator-hise-dev mailing list archives

Site index · List index
Message view « Date » · « Thread »
Top « Date » · « Thread »
From hud...@touk.pl
Subject Build failed in Hudson: hise-trunk-full #152
Date Thu, 28 Oct 2010 19:52:45 GMT
See <https://touk.pl/hudson/job/hise-trunk-full/152/changes>

Changes:

[rr] Update for JDK 1.5 compatibility

------------------------------------------
[...truncated 2557 lines...]
INFO: Trying to find Dozer configuration file: dozer.properties
Oct 28, 2010 8:51:30 PM org.dozer.util.InitLogger log
INFO: Dozer configuration file not found: dozer.properties.  Using defaults for all Dozer
global properties.
Oct 28, 2010 8:51:30 PM org.dozer.util.InitLogger log
INFO: Initializing Dozer.  Version: 5.1, Thread Name:main
Oct 28, 2010 8:51:30 PM org.dozer.util.InitLogger log
INFO: Dozer JMX MBean [org.dozer.jmx:type=DozerStatisticsController] auto registered with
the Platform MBean Server
Oct 28, 2010 8:51:30 PM org.dozer.util.InitLogger log
INFO: Dozer JMX MBean [org.dozer.jmx:type=DozerAdminController] auto registered with the Platform
MBean Server
Oct 28, 2010 8:51:30 PM org.dozer.util.InitLogger log
INFO: Initializing a new instance of the dozer bean mapper.
Tests run: 1, Failures: 0, Errors: 0, Skipped: 0, Time elapsed: 16.077 sec

Results :

Tests run: 6, Failures: 0, Errors: 0, Skipped: 0

[INFO] [xml:validate {execution: default}]
[INFO] [war:war]
[INFO] Exploding webapp...
[INFO] Assembling webapp hise-fe in /mnt/data/jobs/hise-trunk-full/workspace/trunk/hise-fe/target/hise-fe
[INFO] Copy webapp webResources to /mnt/data/jobs/hise-trunk-full/workspace/trunk/hise-fe/target/hise-fe
[INFO] Copy webapp webResources to /mnt/data/jobs/hise-trunk-full/workspace/trunk/hise-fe/target/hise-fe
[INFO] Generating war /mnt/data/jobs/hise-trunk-full/workspace/trunk/hise-fe/target/hise-fe.war
[INFO] Building war: /mnt/data/jobs/hise-trunk-full/workspace/trunk/hise-fe/target/hise-fe.war
[INFO] [install:install]
[INFO] Installing /mnt/data/jobs/hise-trunk-full/workspace/trunk/hise-fe/target/hise-fe.war
to /var/lib/tomcat/.m2/repository/org/apache/hise/hise-fe/1.0.0-SNAPSHOT/hise-fe-1.0.0-SNAPSHOT.war
[INFO] 
[INFO] 
[INFO] ------------------------------------------------------------------------
[INFO] Reactor Summary:
[INFO] ------------------------------------------------------------------------
[INFO] Unnamed - org.apache.hise:hise:pom:1.0.0-SNAPSHOT ..... SUCCESS [4.910s]
[INFO] Unnamed - org.apache.hise:hise-wsdl:jar:1.0.0-SNAPSHOT  SUCCESS [2.937s]
[INFO] Unnamed - org.apache.hise:hise-wsdl-classes:jar:1.0.0-SNAPSHOT  SUCCESS [25.844s]
[INFO] Unnamed - org.apache.hise:hise-services:jar:1.0.0-SNAPSHOT  SUCCESS [25.294s]
[INFO] Unnamed - org.apache.hise:hise-test-example-osgi:bundle:1.0.0-SNAPSHOT  SUCCESS [3.099s]
[INFO] Unnamed - org.apache.hise:hise-test-example:jar:1.0.0-SNAPSHOT  SUCCESS [2.931s]
[INFO] Unnamed - org.apache.hise:hise-rtests:jar:1.0.0-SNAPSHOT  SUCCESS [13.354s]
[INFO] Unnamed - org.apache.hise:hise-web:war:1.0.0-SNAPSHOT . SUCCESS [7.761s]
[INFO] hise-bundle ........................................... SUCCESS [4.990s]
[INFO] Unnamed - org.apache.hise:hise-karaf:jar:1.0.0-SNAPSHOT  SUCCESS [1.583s]
[INFO] HISE webservice client ................................ SUCCESS [11.673s]
[INFO] Frontend for HISE web services (web application) ...... SUCCESS [1:51.346s]
[INFO] ------------------------------------------------------------------------
[INFO] ------------------------------------------------------------------------
[INFO] BUILD SUCCESSFUL
[INFO] ------------------------------------------------------------------------
[INFO] Total time: 3 minutes 37 seconds
[INFO] Finished at: Thu Oct 28 20:51:42 GMT+01:00 2010
[INFO] Final Memory: 101M/492M
[INFO] ------------------------------------------------------------------------
 ____                  _          __  __ _      
/ ___|  ___ _ ____   _(_) ___ ___|  \/  (_)_  __
\___ \ / _ \ '__\ \ / / |/ __/ _ \ |\/| | \ \/ /
 ___) |  __/ |   \ V /| | (_|  __/ |  | | |>  < 
|____/ \___|_|    \_/ |_|\___\___|_|  |_|_/_/\_\

  Apache ServiceMix (4.2.0-fuse-01-00)

Hit '<tab>' for a list of available commands
and '[cmd] --help' for help on a specific command.

karaf@root> features:addUrl mvn:org.apache.hise/hise-karaf/1.0.0-SNAPSHOT/xml/features
features:addUrl mvn:org.apache.hise/hise-karaf/1.0.0-SNAPSHOT/xml/features
karaf@root> features:install hise-h2-test-example-osgi
features:install hise-h2-test-example-osgi
karaf@root> osgi:list|grep -i hise-test-example-osgi
osgi:list|grep -i hise-test-example-osgi
[ 156] [Active     ] [            ] [       ] [   60] Unnamed - org.apache.hise:hise-test-example-osgi:bundle:1.0.0-SNAPSHOT
(1.0.0.SNAPSHOT)
karaf@root> osgi:list|grep -i hise-test-example-osgi
osgi:list|grep -i hise-test-example-osgi
[ 156] [Active     ] [            ] [       ] [   60] Unnamed - org.apache.hise:hise-test-example-osgi:bundle:1.0.0-SNAPSHOT
(1.0.0.SNAPSHOT)
karaf@root> osgi:list|grep -i hise-test-example-osgi
osgi:list|grep -i hise-test-example-osgi
[ 156] [Active     ] [            ] [       ] [   60] Unnamed - org.apache.hise:hise-test-example-osgi:bundle:1.0.0-SNAPSHOT
(1.0.0.SNAPSHOT)
karaf@root> osgi:list|grep -i hise-test-example-osgi
osgi:list|grep -i hise-test-example-osgi
[ 156] [Active     ] [            ] [Waiting] [   60] Unnamed - org.apache.hise:hise-test-example-osgi:bundle:1.0.0-SNAPSHOT
(1.0.0.SNAPSHOT)
karaf@root> osgi:list|grep -i hise-test-example-osgi
osgi:list|grep -i hise-test-example-osgi
[ 156] [Active     ] [            ] [Waiting] [   60] Unnamed - org.apache.hise:hise-test-example-osgi:bundle:1.0.0-SNAPSHOT
(1.0.0.SNAPSHOT)
karaf@root> osgi:list|grep -i hise-test-example-osgi
osgi:list|grep -i hise-test-example-osgi
[ 156] [Active     ] [            ] [Waiting] [   60] Unnamed - org.apache.hise:hise-test-example-osgi:bundle:1.0.0-SNAPSHOT
(1.0.0.SNAPSHOT)
karaf@root> 85  org.apache.hise  WARN   [SpringOsgiExtenderThread-20] openjpa.Runtime
- An error occurred while registering a ClassTransformer with PersistenceUnitInfo: name 'org.apache.hise',
root URL [bundleresource://151.fwk1967571412/]. The error has been consumed. To see it, set
your openjpa.Runtime log level to TRACE. Load-time class transformation will not be available.
osgi:list|grep -i hise-test-example-osgi
osgi:list|grep -i hise-test-example-osgi
[ 156] [Active     ] [            ] [Waiting] [   60] Unnamed - org.apache.hise:hise-test-example-osgi:bundle:1.0.0-SNAPSHOT
(1.0.0.SNAPSHOT)
karaf@root> osgi:list|grep -i hise-test-example-osgi
osgi:list|grep -i hise-test-example-osgi
[ 156] [Active     ] [            ] [Waiting] [   60] Unnamed - org.apache.hise:hise-test-example-osgi:bundle:1.0.0-SNAPSHOT
(1.0.0.SNAPSHOT)
karaf@root> osgi:list|grep -i hise-test-example-osgi
osgi:list|grep -i hise-test-example-osgi
[ 156] [Active     ] [            ] [Waiting] [   60] Unnamed - org.apache.hise:hise-test-example-osgi:bundle:1.0.0-SNAPSHOT
(1.0.0.SNAPSHOT)
karaf@root> osgi:list|grep -i hise-test-example-osgi
3713  org.apache.hise  INFO   [pool-5-thread-1] openjpa.Runtime - Starting OpenJPA 0.0.0
osgi:list|grep -i hise-test-example-osgi
[ 156] [Active     ] [            ] [Waiting] [   60] Unnamed - org.apache.hise:hise-test-example-osgi:bundle:1.0.0-SNAPSHOT
(1.0.0.SNAPSHOT)
karaf@root> 3849  org.apache.hise  INFO   [pool-5-thread-1] openjpa.jdbc.JDBC -
Using dictionary class "org.apache.openjpa.jdbc.sql.H2Dictionary".
osgi:list|grep -i hise-test-example-osgi
osgi:list|grep -i hise-test-example-osgi
[ 156] [Active     ] [            ] [Waiting] [   60] Unnamed - org.apache.hise:hise-test-example-osgi:bundle:1.0.0-SNAPSHOT
(1.0.0.SNAPSHOT)
karaf@root> osgi:list|grep -i hise-test-example-osgi
osgi:list|grep -i hise-test-example-osgi
[ 156] [Active     ] [            ] [Waiting] [   60] Unnamed - org.apache.hise:hise-test-example-osgi:bundle:1.0.0-SNAPSHOT
(1.0.0.SNAPSHOT)
karaf@root> osgi:list|grep -i hise-test-example-osgi
Exception in thread "SpringOsgiExtenderThread-56" org.springframework.beans.factory.BeanCreationException:
Error creating bean with name 'org.apache.hise.engine.store.HISEDeployer#0' defined in URL
[bundleentry://156.fwk1967571412/META-INF/spring/beans.xml]: Cannot create inner bean 'org.apache.hise.engine.store.HISEDD#6ae6235d'
of type [org.apache.hise.engine.store.HISEDD] while setting bean property 'deploymentInfo';
nested exception is org.springframework.beans.factory.BeanCreationException: Error creating
bean with name 'org.apache.hise.engine.store.HISEDD#6ae6235d' defined in URL [bundleentry://156.fwk1967571412/META-INF/spring/beans.xml]:
Cannot create inner bean 'org.apache.hise.engine.store.TaskDD#328d5485' of type [org.apache.hise.engine.store.TaskDD]
while setting bean property 'tasksDI' with key [0]; nested exception is org.springframework.beans.factory.BeanCreationException:
Error creating bean with name 'org.apache.hise.engine.store.TaskDD#328d5485' defined in URL
[bundleentry://156.fwk1967571412/META-INF/spring/beans.xml]: Cannot resolve reference to bean
'hiseJaxWSSender1' while setting bean property 'sender'; nested exception is org.springframework.beans.factory.BeanCreationException:
Error creating bean with name 'hiseJaxWSSender1' defined in URL [bundleentry://156.fwk1967571412/META-INF/spring/beans.xml]:
Invocation of init method failed; nested exception is javax.xml.ws.spi.FactoryFinder$ConfigurationError:
Provider org.apache.axis2.jaxws.spi.Provider not found
	at org.springframework.beans.factory.support.BeanDefinitionValueResolver.resolveInnerBean(BeanDefinitionValueResolver.java:230)
	at org.springframework.beans.factory.support.BeanDefinitionValueResolver.resolveValueIfNecessary(BeanDefinitionValueResolver.java:117)
	at org.springframework.beans.factory.support.AbstractAutowireCapableBeanFactory.applyPropertyValues(AbstractAutowireCapableBeanFactory.java:1245)
	at org.springframework.beans.factory.support.AbstractAutowireCapableBeanFactory.populateBean(AbstractAutowireCapableBeanFactory.java:1010)
	at org.springframework.beans.factory.support.AbstractAutowireCapableBeanFactory.doCreateBean(AbstractAutowireCapableBeanFactory.java:472)
	at org.springframework.beans.factory.support.AbstractAutowireCapableBeanFactory$1.run(AbstractAutowireCapableBeanFactory.java:409)
	at java.security.AccessController.doPrivileged(Native Method)
	at org.springframework.beans.factory.support.AbstractAutowireCapableBeanFactory.createBean(AbstractAutowireCapableBeanFactory.java:380)
	at org.springframework.beans.factory.support.AbstractBeanFactory$1.getObject(AbstractBeanFactory.java:264)
	at org.springframework.beans.factory.support.DefaultSingletonBeanRegistry.getSingleton(DefaultSingletonBeanRegistry.java:222)
	at org.springframework.beans.factory.support.AbstractBeanFactory.doGetBean(AbstractBeanFactory.java:261)
	at org.springframework.beans.factory.support.AbstractBeanFactory.getBean(AbstractBeanFactory.java:185)
	at org.springframework.beans.factory.support.AbstractBeanFactory.getBean(AbstractBeanFactory.java:164)
	at org.springframework.beans.factory.support.DefaultListableBeanFactory.preInstantiateSingletons(DefaultListableBeanFactory.java:429)
	at org.springframework.context.support.AbstractApplicationContext.finishBeanFactoryInitialization(AbstractApplicationContext.java:728)
	at org.springframework.osgi.context.support.AbstractDelegatedExecutionApplicationContext.access$1600(AbstractDelegatedExecutionApplicationContext.java:69)
	at org.springframework.osgi.context.support.AbstractDelegatedExecutionApplicationContext$4.run(AbstractDelegatedExecutionApplicationContext.java:355)
	at org.springframework.osgi.util.internal.PrivilegedUtils.executeWithCustomTCCL(PrivilegedUtils.java:85)
	at org.springframework.osgi.context.support.AbstractDelegatedExecutionApplicationContext.completeRefresh(AbstractDelegatedExecutionApplicationContext.java:320)
	at org.springframework.osgi.extender.internal.dependencies.startup.DependencyWaiterApplicationContextExecutor$CompleteRefreshTask.run(DependencyWaiterApplicationContextExecutor.java:136)
	at java.lang.Thread.run(Thread.java:595)
Caused by: org.springframework.beans.factory.BeanCreationException: Error creating bean with
name 'org.apache.hise.engine.store.HISEDD#6ae6235d' defined in URL [bundleentry://156.fwk1967571412/META-INF/spring/beans.xml]:
Cannot create inner bean 'org.apache.hise.engine.store.TaskDD#328d5485' of type [org.apache.hise.engine.store.TaskDD]
while setting bean property 'tasksDI' with key [0]; nested exception is org.springframework.beans.factory.BeanCreationException:
Error creating bean with name 'org.apache.hise.engine.store.TaskDD#328d5485' defined in URL
[bundleentry://156.fwk1967571412/META-INF/spring/beans.xml]: Cannot resolve reference to bean
'hiseJaxWSSender1' while setting bean property 'sender'; nested exception is org.springframework.beans.factory.BeanCreationException:
Error creating bean with name 'hiseJaxWSSender1' defined in URL [bundleentry://156.fwk1967571412/META-INF/spring/beans.xml]:
Invocation of init method failed; nested exception is javax.xml.ws.spi.FactoryFinder$ConfigurationError:
Provider org.apache.axis2.jaxws.spi.Provider not found
	at org.springframework.beans.factory.support.BeanDefinitionValueResolver.resolveInnerBean(BeanDefinitionValueResolver.java:230)
	at org.springframework.beans.factory.support.BeanDefinitionValueResolver.resolveValueIfNecessary(BeanDefinitionValueResolver.java:117)
	at org.springframework.beans.factory.support.BeanDefinitionValueResolver.resolveManagedList(BeanDefinitionValueResolver.java:287)
	at org.springframework.beans.factory.support.BeanDefinitionValueResolver.resolveValueIfNecessary(BeanDefinitionValueResolver.java:126)
	at org.springframework.beans.factory.support.AbstractAutowireCapableBeanFactory.applyPropertyValues(AbstractAutowireCapableBeanFactory.java:1245)
	at org.springframework.beans.factory.support.AbstractAutowireCapableBeanFactory.populateBean(AbstractAutowireCapableBeanFactory.java:1010)
	at org.springframework.beans.factory.support.AbstractAutowireCapableBeanFactory.doCreateBean(AbstractAutowireCapableBeanFactory.java:472)
	at org.springframework.beans.factory.support.AbstractAutowireCapableBeanFactory$1.run(AbstractAutowireCapableBeanFactory.java:409)
	at java.security.AccessController.doPrivileged(Native Method)
	at org.springframework.beans.factory.support.AbstractAutowireCapableBeanFactory.createBean(AbstractAutowireCapableBeanFactory.java:380)
	at org.springframework.beans.factory.support.BeanDefinitionValueResolver.resolveInnerBean(BeanDefinitionValueResolver.java:219)
	... 20 more
Caused by: org.springframework.beans.factory.BeanCreationException: Error creating bean with
name 'org.apache.hise.engine.store.TaskDD#328d5485' defined in URL [bundleentry://156.fwk1967571412/META-INF/spring/beans.xml]:
Cannot resolve reference to bean 'hiseJaxWSSender1' while setting bean property 'sender';
nested exception is org.springframework.beans.factory.BeanCreationException: Error creating
bean with name 'hiseJaxWSSender1' defined in URL [bundleentry://156.fwk1967571412/META-INF/spring/beans.xml]:
Invocation of init method failed; nested exception is javax.xml.ws.spi.FactoryFinder$ConfigurationError:
Provider org.apache.axis2.jaxws.spi.Provider not found
	at org.springframework.beans.factory.support.BeanDefinitionValueResolver.resolveReference(BeanDefinitionValueResolver.java:275)
	at org.springframework.beans.factory.support.BeanDefinitionValueResolver.resolveValueIfNecessary(BeanDefinitionValueResolver.java:104)
	at org.springframework.beans.factory.support.AbstractAutowireCapableBeanFactory.applyPropertyValues(AbstractAutowireCapableBeanFactory.java:1245)
	at org.springframework.beans.factory.support.AbstractAutowireCapableBeanFactory.populateBean(AbstractAutowireCapableBeanFactory.java:1010)
	at org.springframework.beans.factory.support.AbstractAutowireCapableBeanFactory.doCreateBean(AbstractAutowireCapableBeanFactory.java:472)
	at org.springframework.beans.factory.support.AbstractAutowireCapableBeanFactory$1.run(AbstractAutowireCapableBeanFactory.java:409)
	at java.security.AccessController.doPrivileged(Native Method)
	at org.springframework.beans.factory.support.AbstractAutowireCapableBeanFactory.createBean(AbstractAutowireCapableBeanFactory.java:380)
	at org.springframework.beans.factory.support.BeanDefinitionValueResolver.resolveInnerBean(BeanDefinitionValueResolver.java:219)
	... 30 more
Caused by: org.springframework.beans.factory.BeanCreationException: Error creating bean with
name 'hiseJaxWSSender1' defined in URL [bundleentry://156.fwk1967571412/META-INF/spring/beans.xml]:
Invocation of init method failed; nested exception is javax.xml.ws.spi.FactoryFinder$ConfigurationError:
Provider org.apache.axis2.jaxws.spi.Provider not found
	at org.springframework.beans.factory.support.AbstractAutowireCapableBeanFactory.initializeBean(AbstractAutowireCapableBeanFactory.java:1338)
	at org.springframework.beans.factory.support.AbstractAutowireCapableBeanFactory.doCreateBean(AbstractAutowireCapableBeanFactory.java:473)
	at org.springframework.beans.factory.support.AbstractAutowireCapableBeanFactory$1.run(AbstractAutowireCapableBeanFactory.java:409)
	at java.security.AccessController.doPrivileged(Native Method)
	at org.springframework.beans.factory.support.AbstractAutowireCapableBeanFactory.createBean(AbstractAutowireCapableBeanFactory.java:380)
	at org.springframework.beans.factory.support.AbstractBeanFactory$1.getObject(AbstractBeanFactory.java:264)
	at org.springframework.beans.factory.support.DefaultSingletonBeanRegistry.getSingleton(DefaultSingletonBeanRegistry.java:222)
	at org.springframework.beans.factory.support.AbstractBeanFactory.doGetBean(AbstractBeanFactory.java:261)
	at org.springframework.beans.factory.support.AbstractBeanFactory.getBean(AbstractBeanFactory.java:185)
	at org.springframework.beans.factory.support.AbstractBeanFactory.getBean(AbstractBeanFactory.java:164)
	at org.springframework.beans.factory.support.BeanDefinitionValueResolver.resolveReference(BeanDefinitionValueResolver.java:269)
	... 38 more
Caused by: javax.xml.ws.spi.FactoryFinder$ConfigurationError: Provider org.apache.axis2.jaxws.spi.Provider
not found
	at javax.xml.ws.spi.FactoryFinder$2.run(FactoryFinder.java:135)
	at javax.xml.ws.spi.FactoryFinder.doPrivileged(FactoryFinder.java:264)
	at javax.xml.ws.spi.FactoryFinder.newInstance(FactoryFinder.java:122)
	at javax.xml.ws.spi.FactoryFinder.access$200(FactoryFinder.java:42)
	at javax.xml.ws.spi.FactoryFinder$3.run(FactoryFinder.java:255)
	at javax.xml.ws.spi.FactoryFinder.doPrivileged(FactoryFinder.java:264)
	at javax.xml.ws.spi.FactoryFinder.find(FactoryFinder.java:165)
	at javax.xml.ws.spi.Provider.provider(Provider.java:39)
	at javax.xml.ws.Service.<init>(Service.java:36)
	at org.apache.hise.engine.jaxws.HISEJaxWSClient$HISEService.<init>(HISEJaxWSClient.java:56)
	at org.apache.hise.engine.jaxws.HISEJaxWSClient.init(HISEJaxWSClient.java:62)
	at sun.reflect.NativeMethodAccessorImpl.invoke0(Native Method)
	at sun.reflect.NativeMethodAccessorImpl.invoke(NativeMethodAccessorImpl.java:39)
	at sun.reflect.DelegatingMethodAccessorImpl.invoke(DelegatingMethodAccessorImpl.java:25)
	at java.lang.reflect.Method.invoke(Method.java:585)
	at org.springframework.beans.factory.support.AbstractAutowireCapableBeanFactory.invokeCustomInitMethod(AbstractAutowireCapableBeanFactory.java:1414)
	at org.springframework.beans.factory.support.AbstractAutowireCapableBeanFactory.invokeInitMethods(AbstractAutowireCapableBeanFactory.java:1375)
	at org.springframework.beans.factory.support.AbstractAutowireCapableBeanFactory.initializeBean(AbstractAutowireCapableBeanFactory.java:1335)
	... 48 more
osgi:list|grep -i hise-test-example-osgi
[ 156] [Active     ] [            ] [Failed ] [   60] Unnamed - org.apache.hise:hise-test-example-osgi:bundle:1.0.0-SNAPSHOT
(1.0.0.SNAPSHOT)
karaf@root> osgi:list|grep -i hise-test-example-osgi
osgi:list|grep -i hise-test-example-osgi
[ 156] [Active     ] [            ] [Failed ] [   60] Unnamed - org.apache.hise:hise-test-example-osgi:bundle:1.0.0-SNAPSHOT
(1.0.0.SNAPSHOT)
karaf@root> osgi:list|grep -i hise-test-example-osgi
osgi:list|grep -i hise-test-example-osgi
[ 156] [Active     ] [            ] [Failed ] [   60] Unnamed - org.apache.hise:hise-test-example-osgi:bundle:1.0.0-SNAPSHOT
(1.0.0.SNAPSHOT)
karaf@root> osgi:list|grep -i hise-test-example-osgi
osgi:list|grep -i hise-test-example-osgi
[ 156] [Active     ] [            ] [Failed ] [   60] Unnamed - org.apache.hise:hise-test-example-osgi:bundle:1.0.0-SNAPSHOT
(1.0.0.SNAPSHOT)
karaf@root> osgi:list|grep -i hise-test-example-osgi
osgi:list|grep -i hise-test-example-osgi
[ 156] [Active     ] [            ] [Failed ] [   60] Unnamed - org.apache.hise:hise-test-example-osgi:bundle:1.0.0-SNAPSHOT
(1.0.0.SNAPSHOT)
karaf@root> osgi:list|grep -i hise-test-example-osgi
osgi:list|grep -i hise-test-example-osgi
[ 156] [Active     ] [            ] [Failed ] [   60] Unnamed - org.apache.hise:hise-test-example-osgi:bundle:1.0.0-SNAPSHOT
(1.0.0.SNAPSHOT)
karaf@root> osgi:list|grep -i hise-test-example-osgi
osgi:list|grep -i hise-test-example-osgi
[ 156] [Active     ] [            ] [Failed ] [   60] Unnamed - org.apache.hise:hise-test-example-osgi:bundle:1.0.0-SNAPSHOT
(1.0.0.SNAPSHOT)
karaf@root> osgi:list|grep -i hise-test-example-osgi
osgi:list|grep -i hise-test-example-osgi
[ 156] [Active     ] [            ] [Failed ] [   60] Unnamed - org.apache.hise:hise-test-example-osgi:bundle:1.0.0-SNAPSHOT
(1.0.0.SNAPSHOT)
karaf@root> osgi:list|grep -i hise-test-example-osgi
osgi:list|grep -i hise-test-example-osgi
[ 156] [Active     ] [            ] [Failed ] [   60] Unnamed - org.apache.hise:hise-test-example-osgi:bundle:1.0.0-SNAPSHOT
(1.0.0.SNAPSHOT)
karaf@root> osgi:list|grep -i hise-test-example-osgi
osgi:list|grep -i hise-test-example-osgi
[ 156] [Active     ] [            ] [Failed ] [   60] Unnamed - org.apache.hise:hise-test-example-osgi:bundle:1.0.0-SNAPSHOT
(1.0.0.SNAPSHOT)
karaf@root> osgi:list|grep -i hise-test-example-osgi
osgi:list|grep -i hise-test-example-osgi
[ 156] [Active     ] [            ] [Failed ] [   60] Unnamed - org.apache.hise:hise-test-example-osgi:bundle:1.0.0-SNAPSHOT
(1.0.0.SNAPSHOT)
karaf@root> osgi:list|grep -i hise-test-example-osgi
osgi:list|grep -i hise-test-example-osgi
[ 156] [Active     ] [            ] [Failed ] [   60] Unnamed - org.apache.hise:hise-test-example-osgi:bundle:1.0.0-SNAPSHOT
(1.0.0.SNAPSHOT)
karaf@root> osgi:list|grep -i hise-test-example-osgi
osgi:list|grep -i hise-test-example-osgi
[ 156] [Active     ] [            ] [Failed ] [   60] Unnamed - org.apache.hise:hise-test-example-osgi:bundle:1.0.0-SNAPSHOT
(1.0.0.SNAPSHOT)
karaf@root> osgi:list|grep -i hise-test-example-osgi
osgi:list|grep -i hise-test-example-osgi
[ 156] [Active     ] [            ] [Failed ] [   60] Unnamed - org.apache.hise:hise-test-example-osgi:bundle:1.0.0-SNAPSHOT
(1.0.0.SNAPSHOT)
karaf@root> osgi:list|grep -i hise-test-example-osgi
osgi:list|grep -i hise-test-example-osgi
[ 156] [Active     ] [            ] [Failed ] [   60] Unnamed - org.apache.hise:hise-test-example-osgi:bundle:1.0.0-SNAPSHOT
(1.0.0.SNAPSHOT)
karaf@root> osgi:list|grep -i hise-test-example-osgi
osgi:list|grep -i hise-test-example-osgi
[ 156] [Active     ] [            ] [Failed ] [   60] Unnamed - org.apache.hise:hise-test-example-osgi:bundle:1.0.0-SNAPSHOT
(1.0.0.SNAPSHOT)
karaf@root> osgi:list|grep -i hise-test-example-osgi
osgi:list|grep -i hise-test-example-osgi
[ 156] [Active     ] [            ] [Failed ] [   60] Unnamed - org.apache.hise:hise-test-example-osgi:bundle:1.0.0-SNAPSHOT
(1.0.0.SNAPSHOT)
karaf@root> osgi:list|grep -i hise-test-example-osgi
osgi:list|grep -i hise-test-example-osgi
[ 156] [Active     ] [            ] [Failed ] [   60] Unnamed - org.apache.hise:hise-test-example-osgi:bundle:1.0.0-SNAPSHOT
(1.0.0.SNAPSHOT)
karaf@root> osgi:list|grep -i hise-test-example-osgi
osgi:list|grep -i hise-test-example-osgi
[ 156] [Active     ] [            ] [Failed ] [   60] Unnamed - org.apache.hise:hise-test-example-osgi:bundle:1.0.0-SNAPSHOT
(1.0.0.SNAPSHOT)
karaf@root> Traceback (most recent call last):
  File "./itest", line 58, in <module>
    raise Exception("Bundle not installed")
Exception: Bundle not installed
Exception pexpect.ExceptionPexpect: ExceptionPexpect() in <bound method spawn.__del__ of
<pexpect.spawn object at 0xda7150>> ignored
Archiving artifacts
Recording test results

Mime
View raw message