incubator-hise-dev mailing list archives

Site index · List index
Message view « Date » · « Thread »
Top « Date » · « Thread »
From hud...@touk.pl
Subject Build failed in Hudson: hise-trunk-full #127
Date Mon, 30 Aug 2010 07:51:59 GMT
See <https://touk.pl/hudson/job/hise-trunk-full/127/changes>

Changes:

[rr] HISE-73: Implement "3.2.3 Assigning People Using Expressions" (Thanks to Piotr Zagórski)

[rr] HISE-83:  Improve definition of tasks for the tests integration and examples. They should
be consistent with the schema. (Thanks to Michał Więcław)

------------------------------------------
[...truncated 3097 lines...]
08:51:46,645 INFO  [SoapUITestCaseRunner] Assertion [Schema Compliance] has status VALID
08:51:46,645 INFO  [SoapUITestCaseRunner] Assertion [Not SOAP Fault] has status VALID
08:51:46,645 INFO  [SoapUITestCaseRunner] running step [add attachment 3]
08:51:46,747 INFO  [SoapUITestCaseRunner] Assertion [SOAP Response] has status VALID
08:51:46,748 INFO  [SoapUITestCaseRunner] Assertion [Schema Compliance] has status VALID
08:51:46,748 INFO  [SoapUITestCaseRunner] Assertion [Not SOAP Fault] has status VALID
08:51:46,748 INFO  [SoapUITestCaseRunner] running step [Delay]
08:51:52,748 INFO  [SoapUITestCaseRunner] running step [get Attachments]
08:51:52,871 INFO  [SoapUITestCaseRunner] Assertion [SOAP Response] has status VALID
08:51:52,871 INFO  [SoapUITestCaseRunner] Assertion [Not SOAP Fault] has status VALID
08:51:52,871 INFO  [SoapUITestCaseRunner] Assertion [XQuery Match] has status VALID
08:51:52,871 INFO  [SoapUITestCaseRunner] running step [get Attachments infos - Request 2]
08:51:52,937 INFO  [SoapUITestCaseRunner] Assertion [SOAP Response] has status VALID
08:51:52,938 INFO  [SoapUITestCaseRunner] Assertion [Not SOAP Fault] has status VALID
08:51:52,938 INFO  [SoapUITestCaseRunner] Assertion [XQuery Match] has status VALID
08:51:52,938 INFO  [SoapUITestCaseRunner] running step [get Attachments - Request 2]
08:51:53,042 INFO  [SoapUITestCaseRunner] Assertion [SOAP Response] has status VALID
08:51:53,042 INFO  [SoapUITestCaseRunner] Assertion [Not SOAP Fault] has status VALID
08:51:53,042 INFO  [SoapUITestCaseRunner] running step [get Attachments infos - Request 3]
08:51:53,158 INFO  [SoapUITestCaseRunner] Assertion [SOAP Response] has status VALID
08:51:53,158 INFO  [SoapUITestCaseRunner] Assertion [Not SOAP Fault] has status VALID
08:51:53,158 INFO  [SoapUITestCaseRunner] Assertion [XQuery Match] has status VALID
08:51:53,158 INFO  [SoapUITestCaseRunner] Finished running soapUI testcase [attachments],
time taken: 7340ms, status: FINISHED
08:51:53,159 INFO  [SoapUITestCaseRunner] Running soapUI testcase [set priority and skip]
08:51:53,159 INFO  [SoapUITestCaseRunner] running step [approve - Request 1]
08:51:53,249 INFO  [SoapUITestCaseRunner] Assertion [SOAP Response] has status VALID
08:51:53,250 INFO  [SoapUITestCaseRunner] Assertion [Not SOAP Fault] has status VALID
08:51:53,250 INFO  [SoapUITestCaseRunner] running step [Properties]
08:51:53,251 INFO  [SoapUITestCaseRunner] running step [Property Transfer]
08:51:53,278 INFO  [SoapUITestCaseRunner] running step [start]
08:51:53,399 INFO  [SoapUITestCaseRunner] Assertion [SOAP Response] has status VALID
08:51:53,399 INFO  [SoapUITestCaseRunner] Assertion [Not SOAP Fault] has status VALID
08:51:53,399 INFO  [SoapUITestCaseRunner] running step [getTaskInfo - Request 1]
08:51:53,521 INFO  [SoapUITestCaseRunner] Assertion [SOAP Response] has status VALID
08:51:53,521 INFO  [SoapUITestCaseRunner] Assertion [XQuery Match] has status VALID
08:51:53,760 INFO  [SoapUITestCaseRunner] Assertion [Schema Compliance] has status VALID
08:51:53,760 INFO  [SoapUITestCaseRunner] running step [change priority]
08:51:53,902 INFO  [SoapUITestCaseRunner] Assertion [SOAP Response] has status VALID
08:51:53,902 INFO  [SoapUITestCaseRunner] Assertion [Schema Compliance] has status VALID
08:51:53,902 INFO  [SoapUITestCaseRunner] Assertion [Not SOAP Fault] has status VALID
08:51:53,902 INFO  [SoapUITestCaseRunner] running step [getTaskInfo - Request 2]
08:51:54,033 INFO  [SoapUITestCaseRunner] Assertion [SOAP Response] has status VALID
08:51:54,033 INFO  [SoapUITestCaseRunner] Assertion [XQuery Match] has status VALID
08:51:54,033 INFO  [SoapUITestCaseRunner] Assertion [Schema Compliance] has status VALID
08:51:54,033 INFO  [SoapUITestCaseRunner] running step [skip]
08:51:54,155 INFO  [SoapUITestCaseRunner] Assertion [SOAP Response] has status VALID
08:51:54,156 INFO  [SoapUITestCaseRunner] running step [getTaskInfo - Request 3]
08:51:54,292 INFO  [SoapUITestCaseRunner] Assertion [SOAP Response] has status VALID
08:51:54,292 INFO  [SoapUITestCaseRunner] Assertion [XQuery Match] has status VALID
08:51:54,292 INFO  [SoapUITestCaseRunner] Assertion [Not SOAP Fault] has status VALID
08:51:54,292 INFO  [SoapUITestCaseRunner] Finished running soapUI testcase [set priority and
skip], time taken: 883ms, status: FINISHED
08:51:54,293 INFO  [SoapUITestCaseRunner] Running soapUI testcase [comments]
08:51:54,293 INFO  [SoapUITestCaseRunner] running step [approve]
08:51:54,389 INFO  [SoapUITestCaseRunner] Assertion [SOAP Response] has status VALID
08:51:54,389 INFO  [SoapUITestCaseRunner] Assertion [Not SOAP Fault] has status VALID
08:51:54,389 INFO  [SoapUITestCaseRunner] running step [Properties]
08:51:54,390 INFO  [SoapUITestCaseRunner] running step [Property Transfer]
08:51:54,396 INFO  [SoapUITestCaseRunner] running step [start]
08:51:54,514 INFO  [SoapUITestCaseRunner] Assertion [SOAP Response] has status VALID
08:51:54,514 INFO  [SoapUITestCaseRunner] Assertion [Not SOAP Fault] has status VALID
08:51:54,514 INFO  [SoapUITestCaseRunner] running step [getTaskInfo - Request 1]
08:51:54,651 INFO  [SoapUITestCaseRunner] Assertion [SOAP Response] has status VALID
08:51:54,652 INFO  [SoapUITestCaseRunner] Assertion [XQuery Match] has status VALID
08:51:54,652 INFO  [SoapUITestCaseRunner] running step [get Comment]
08:51:54,781 INFO  [SoapUITestCaseRunner] Assertion [SOAP Response] has status VALID
08:51:54,781 INFO  [SoapUITestCaseRunner] Assertion [Schema Compliance] has status VALID
08:51:54,781 INFO  [SoapUITestCaseRunner] Assertion [Not SOAP Fault] has status VALID
08:51:54,781 INFO  [SoapUITestCaseRunner] running step [addComment]
08:51:54,883 INFO  [SoapUITestCaseRunner] Assertion [SOAP Response] has status VALID
08:51:54,884 INFO  [SoapUITestCaseRunner] Assertion [Schema Compliance] has status VALID
08:51:55,200 INFO  [SoapUITestCaseRunner] Assertion [Not SOAP Fault] has status VALID
08:51:55,200 INFO  [SoapUITestCaseRunner] running step [addComment 2]
08:51:55,307 INFO  [SoapUITestCaseRunner] Assertion [SOAP Response] has status VALID
08:51:55,308 INFO  [SoapUITestCaseRunner] Assertion [Schema Compliance] has status VALID
08:51:55,308 INFO  [SoapUITestCaseRunner] Assertion [Not SOAP Fault] has status VALID
08:51:55,308 INFO  [SoapUITestCaseRunner] running step [get Comment - request 2]
08:51:55,411 INFO  [SoapUITestCaseRunner] Assertion [SOAP Response] has status VALID
08:51:55,411 INFO  [SoapUITestCaseRunner] Assertion [Schema Compliance] has status VALID
08:51:55,686 INFO  [SoapUITestCaseRunner] Assertion [Not SOAP Fault] has status VALID
08:51:55,686 INFO  [SoapUITestCaseRunner] Assertion [XQuery Match] has status VALID
08:51:55,686 INFO  [SoapUITestCaseRunner] Finished running soapUI testcase [comments], time
taken: 793ms, status: FINISHED
08:51:55,687 INFO  [SoapUITestCaseRunner] Project [hise-example-osgi-tests] finished with
status [FAILED] in 17509ms
08:51:55,704 ERROR [SoapUITestCaseRunner] java.lang.Exception: Not SOAP Fault in [complete]
failed;
[Response is a SOAP Fault]
Status: FAILED
Time Taken: 125
Size: 218
Timestamp: Mon Aug 30 08:51:43 GMT+01:00 2010
TestStep: complete

----------------- Messages ------------------------------
[Not SOAP Fault] Response is a SOAP Fault

----------------- Properties ------------------------------
Password: user1pass
Encoding: UTF-8
Endpoint: http://localhost:8181/cxf/taskOperations/
Username: user1

---------------- Request ---------------------------
Request Headers: {Content-Length=1076, Host=localhost:8181, User-Agent=Jakarta Commons-HttpClient/3.1,
Accept-Encoding=gzip,deflate, SOAPAction="http://www.example.org/WS-HT/api/wsdl/complete",
Content-Type=text/xml;charset=UTF-8}

<soapenv:Envelope xmlns:soapenv="http://schemas.xmlsoap.org/soap/envelope/" xmlns:xsd="http://www.example.org/WS-HT/api/xsd">
   <soapenv:Header>
      <wsse:Security soapenv:mustUnderstand="1" xmlns:wsse="http://docs.oasis-open.org/wss/2004/01/oasis-200401-wss-wssecurity-secext-1.0.xsd">
         <wsse:UsernameToken wsu:Id="UsernameToken-12" xmlns:wsu="http://docs.oasis-open.org/wss/2004/01/oasis-200401-wss-wssecurity-utility-1.0.xsd">
            <wsse:Username>user1</wsse:Username>
            <wsse:Password Type="http://docs.oasis-open.org/wss/2004/01/oasis-200401-wss-username-token-profile-1.0#PasswordDigest">X1iLL7PKZtUxwFB2TAbjbSpq5ko=</wsse:Password>
            <wsse:Nonce EncodingType="http://docs.oasis-open.org/wss/2004/01/oasis-200401-wss-soap-message-security-1.0#Base64Binary">gqCsia8AZ72yEN8PAuT6tQ==</wsse:Nonce>
            <wsu:Created>2010-08-30T07:51:43.275Z</wsu:Created>
         </wsse:UsernameToken>
      </wsse:Security>
   </soapenv:Header>
   <soapenv:Body>
      <xsd:complete>
         <xsd:identifier>712</xsd:identifier>
         <xsd:taskData>asdb</xsd:taskData>
      </xsd:complete>
   </soapenv:Body>
</soapenv:Envelope>

---------------- Response --------------------------
Response Headers: {Content-Length=218, #status#=HTTP/1.1 500 Internal Server Error, Server=Jetty(6.1.x),
Content-Type=text/xml; charset=utf-8}

<soap:Envelope xmlns:soap="http://schemas.xmlsoap.org/soap/envelope/">
   <soap:Body>
      <soap:Fault>
         <faultcode>soap:Server</faultcode>
         <faultstring>Could not send Message.</faultstring>
      </soap:Fault>
   </soap:Body>
</soap:Envelope>

08:51:55,710 ERROR [SoapUI] An error occured [Not SOAP Fault in [complete] failed;
[Response is a SOAP Fault]
Status: FAILED
Time Taken: 125
Size: 218
Timestamp: Mon Aug 30 08:51:43 GMT+01:00 2010
TestStep: complete

----------------- Messages ------------------------------
[Not SOAP Fault] Response is a SOAP Fault

----------------- Properties ------------------------------
Password: user1pass
Encoding: UTF-8
Endpoint: http://localhost:8181/cxf/taskOperations/
Username: user1

---------------- Request ---------------------------
Request Headers: {Content-Length=1076, Host=localhost:8181, User-Agent=Jakarta Commons-HttpClient/3.1,
Accept-Encoding=gzip,deflate, SOAPAction="http://www.example.org/WS-HT/api/wsdl/complete",
Content-Type=text/xml;charset=UTF-8}

<soapenv:Envelope xmlns:soapenv="http://schemas.xmlsoap.org/soap/envelope/" xmlns:xsd="http://www.example.org/WS-HT/api/xsd">
   <soapenv:Header>
      <wsse:Security soapenv:mustUnderstand="1" xmlns:wsse="http://docs.oasis-open.org/wss/2004/01/oasis-200401-wss-wssecurity-secext-1.0.xsd">
         <wsse:UsernameToken wsu:Id="UsernameToken-12" xmlns:wsu="http://docs.oasis-open.org/wss/2004/01/oasis-200401-wss-wssecurity-utility-1.0.xsd">
            <wsse:Username>user1</wsse:Username>
            <wsse:Password Type="http://docs.oasis-open.org/wss/2004/01/oasis-200401-wss-username-token-profile-1.0#PasswordDigest">X1iLL7PKZtUxwFB2TAbjbSpq5ko=</wsse:Password>
            <wsse:Nonce EncodingType="http://docs.oasis-open.org/wss/2004/01/oasis-200401-wss-soap-message-security-1.0#Base64Binary">gqCsia8AZ72yEN8PAuT6tQ==</wsse:Nonce>
            <wsu:Created>2010-08-30T07:51:43.275Z</wsu:Created>
         </wsse:UsernameToken>
      </wsse:Security>
   </soapenv:Header>
   <soapenv:Body>
      <xsd:complete>
         <xsd:identifier>712</xsd:identifier>
         <xsd:taskData>asdb</xsd:taskData>
      </xsd:complete>
   </soapenv:Body>
</soapenv:Envelope>

---------------- Response --------------------------
Response Headers: {Content-Length=218, #status#=HTTP/1.1 500 Internal Server Error, Server=Jetty(6.1.x),
Content-Type=text/xml; charset=utf-8}

<soap:Envelope xmlns:soap="http://schemas.xmlsoap.org/soap/envelope/">
   <soap:Body>
      <soap:Fault>
         <faultcode>soap:Server</faultcode>
         <faultstring>Could not send Message.</faultstring>
      </soap:Fault>
   </soap:Body>
</soap:Envelope>
], see error log for details
java.lang.Exception: Not SOAP Fault in [complete] failed;
[Response is a SOAP Fault]
Status: FAILED
Time Taken: 125
Size: 218
Timestamp: Mon Aug 30 08:51:43 GMT+01:00 2010
TestStep: complete

----------------- Messages ------------------------------
[Not SOAP Fault] Response is a SOAP Fault

----------------- Properties ------------------------------
Password: user1pass
Encoding: UTF-8
Endpoint: http://localhost:8181/cxf/taskOperations/
Username: user1

---------------- Request ---------------------------
Request Headers: {Content-Length=1076, Host=localhost:8181, User-Agent=Jakarta Commons-HttpClient/3.1,
Accept-Encoding=gzip,deflate, SOAPAction="http://www.example.org/WS-HT/api/wsdl/complete",
Content-Type=text/xml;charset=UTF-8}

<soapenv:Envelope xmlns:soapenv="http://schemas.xmlsoap.org/soap/envelope/" xmlns:xsd="http://www.example.org/WS-HT/api/xsd">
   <soapenv:Header>
      <wsse:Security soapenv:mustUnderstand="1" xmlns:wsse="http://docs.oasis-open.org/wss/2004/01/oasis-200401-wss-wssecurity-secext-1.0.xsd">
         <wsse:UsernameToken wsu:Id="UsernameToken-12" xmlns:wsu="http://docs.oasis-open.org/wss/2004/01/oasis-200401-wss-wssecurity-utility-1.0.xsd">
            <wsse:Username>user1</wsse:Username>
            <wsse:Password Type="http://docs.oasis-open.org/wss/2004/01/oasis-200401-wss-username-token-profile-1.0#PasswordDigest">X1iLL7PKZtUxwFB2TAbjbSpq5ko=</wsse:Password>
            <wsse:Nonce EncodingType="http://docs.oasis-open.org/wss/2004/01/oasis-200401-wss-soap-message-security-1.0#Base64Binary">gqCsia8AZ72yEN8PAuT6tQ==</wsse:Nonce>
            <wsu:Created>2010-08-30T07:51:43.275Z</wsu:Created>
         </wsse:UsernameToken>
      </wsse:Security>
   </soapenv:Header>
   <soapenv:Body>
      <xsd:complete>
         <xsd:identifier>712</xsd:identifier>
         <xsd:taskData>asdb</xsd:taskData>
      </xsd:complete>
   </soapenv:Body>
</soapenv:Envelope>

---------------- Response --------------------------
Response Headers: {Content-Length=218, #status#=HTTP/1.1 500 Internal Server Error, Server=Jetty(6.1.x),
Content-Type=text/xml; charset=utf-8}

<soap:Envelope xmlns:soap="http://schemas.xmlsoap.org/soap/envelope/">
   <soap:Body>
      <soap:Fault>
         <faultcode>soap:Server</faultcode>
         <faultstring>Could not send Message.</faultstring>
      </soap:Fault>
   </soap:Body>
</soap:Envelope>

	at com.eviware.soapui.tools.SoapUITestCaseRunner.throwFailureException(SoapUITestCaseRunner.java:427)
	at com.eviware.soapui.tools.SoapUITestCaseRunner.runRunner(SoapUITestCaseRunner.java:352)
	at com.eviware.soapui.tools.AbstractSoapUIRunner.run(AbstractSoapUIRunner.java:138)
	at com.eviware.soapui.tools.AbstractSoapUIRunner.runFromCommandLine(AbstractSoapUIRunner.java:80)
	at com.eviware.soapui.tools.SoapUITestCaseRunner.main(SoapUITestCaseRunner.java:112)
Traceback (most recent call last):
  File "./itest", line 63, in <module>
    syscall(SOAPUI_DIR + "/bin/testrunner.sh -j -f results " + i)
  File "./itest", line 26, in syscall
    raise Exception("Sys call failed: " + c)
Exception: Sys call failed: /var/lib/tomcat/hise-tools/soapui-3.5.1/bin/testrunner.sh -j -f
results hise-example-osgi.xml
Exception pexpect.ExceptionPexpect: ExceptionPexpect() in <bound method spawn.__del__ of
<pexpect.spawn object at 0x2678150>> ignored
Archiving artifacts
Recording test results

Mime
View raw message