incubator-hama-dev mailing list archives

Site index · List index
Message view « Date » · « Thread »
Top « Date » · « Thread »
From Apache Jenkins Server <jenk...@builds.apache.org>
Subject Build failed in Jenkins: Hama-Nightly #499
Date Tue, 27 Mar 2012 23:05:53 GMT
See <https://builds.apache.org/job/Hama-Nightly/499/>

------------------------------------------
[...truncated 1517 lines...]
12/03/27 23:04:04 INFO ipc.Server: IPC Server handler 4 on 45780: exiting

12/03/27 23:04:04 INFO ipc.Server: IPC Server handler 5 on 45780: exiting

12/03/27 23:04:04 INFO ipc.Server: IPC Server handler 9 on 45780: exiting

12/03/27 23:04:04 INFO ipc.Server: IPC Server handler 7 on 45780: exiting

12/03/27 23:04:04 INFO ipc.Server: IPC Server handler 8 on 45780: exiting

12/03/27 23:04:04 INFO ipc.Server: IPC Server handler 6 on 45780: exiting

12/03/27 23:04:04 INFO ipc.Server: Stopping IPC Server Responder

12/03/27 23:04:04 INFO ipc.Server: IPC Server handler 3 on 45780: exiting

12/03/27 23:04:04 INFO ipc.Server: Stopping IPC Server listener on 45780

12/03/27 23:04:04 INFO ipc.Server: IPC Server handler 1 on 45780: exiting

12/03/27 23:04:04 INFO ipc.Server: IPC Server handler 4 on 39861: exiting

12/03/27 23:04:04 INFO ipc.Server: Starting SocketReader

12/03/27 23:04:04 INFO ipc.Server: IPC Server Responder: starting

12/03/27 23:04:04 INFO ipc.Server: IPC Server listener on 44262: starting

12/03/27 23:04:04 INFO ipc.Server: IPC Server handler 0 on 44262: starting

12/03/27 23:04:04 INFO ipc.Server: IPC Server handler 1 on 44262: starting

12/03/27 23:04:04 INFO ipc.Server: IPC Server handler 2 on 44262: starting

12/03/27 23:04:04 INFO ipc.Server: IPC Server handler 3 on 44262: starting

12/03/27 23:04:04 INFO ipc.Server: IPC Server handler 4 on 44262: starting

12/03/27 23:04:04 INFO ipc.Server: IPC Server handler 5 on 44262: starting

12/03/27 23:04:04 INFO ipc.Server: IPC Server handler 7 on 44262: starting

12/03/27 23:04:04 INFO ipc.Server: IPC Server handler 9 on 44262: starting

12/03/27 23:04:04 INFO ipc.Server: IPC Server handler 8 on 44262: starting

12/03/27 23:04:04 INFO ipc.Server: IPC Server handler 6 on 44262: starting

12/03/27 23:04:04 INFO ipc.Server: Starting SocketReader

12/03/27 23:04:04 INFO ipc.Server: IPC Server Responder: starting

12/03/27 23:04:04 INFO ipc.Server: IPC Server listener on 57231: starting

12/03/27 23:04:04 INFO ipc.Server: IPC Server handler 0 on 57231: starting

12/03/27 23:04:04 INFO ipc.Server: IPC Server handler 2 on 57231: starting

12/03/27 23:04:04 INFO ipc.Server: IPC Server handler 4 on 57231: starting

12/03/27 23:04:04 INFO ipc.Server: IPC Server handler 5 on 57231: starting

12/03/27 23:04:04 INFO ipc.Server: IPC Server handler 6 on 57231: starting

12/03/27 23:04:04 INFO ipc.Server: IPC Server handler 7 on 57231: starting

12/03/27 23:04:04 INFO ipc.Server: IPC Server handler 9 on 57231: starting

12/03/27 23:04:04 INFO ipc.Server: IPC Server handler 8 on 57231: starting

12/03/27 23:04:04 INFO ipc.Server: IPC Server handler 3 on 57231: starting

12/03/27 23:04:04 INFO ipc.Server: IPC Server handler 1 on 57231: starting

12/03/27 23:04:04 INFO ipc.Server: Stopping server on 44262

12/03/27 23:04:04 INFO ipc.Server: IPC Server handler 0 on 44262: exiting

12/03/27 23:04:04 INFO metrics.RpcInstrumentation: shut down

12/03/27 23:04:04 INFO ipc.Server: Stopping IPC Server Responder

12/03/27 23:04:04 INFO ipc.Server: Stopping IPC Server listener on 44262

12/03/27 23:04:04 INFO ipc.Server: IPC Server handler 1 on 44262: exiting

12/03/27 23:04:04 INFO ipc.Server: Stopping server on 57231

12/03/27 23:04:04 INFO ipc.Server: IPC Server handler 8 on 44262: exiting

12/03/27 23:04:04 INFO ipc.Server: IPC Server handler 5 on 44262: exiting

12/03/27 23:04:04 INFO ipc.Server: IPC Server handler 9 on 44262: exiting

12/03/27 23:04:04 INFO ipc.Server: IPC Server handler 4 on 57231: exiting

12/03/27 23:04:04 INFO ipc.Server: IPC Server handler 4 on 44262: exiting

12/03/27 23:04:04 INFO ipc.Server: IPC Server handler 6 on 57231: exiting

12/03/27 23:04:04 INFO ipc.Server: IPC Server handler 7 on 57231: exiting

12/03/27 23:04:04 INFO ipc.Server: IPC Server handler 2 on 44262: exiting

12/03/27 23:04:04 INFO ipc.Server: IPC Server handler 3 on 44262: exiting

12/03/27 23:04:04 INFO ipc.Server: IPC Server handler 9 on 57231: exiting

12/03/27 23:04:04 INFO ipc.Server: IPC Server handler 3 on 57231: exiting

12/03/27 23:04:04 INFO ipc.Server: IPC Server handler 8 on 57231: exiting

12/03/27 23:04:04 INFO ipc.Server: IPC Server handler 6 on 44262: exiting

12/03/27 23:04:04 INFO ipc.Server: Stopping IPC Server Responder

12/03/27 23:04:04 INFO ipc.Server: IPC Server handler 5 on 57231: exiting

12/03/27 23:04:04 INFO ipc.Server: IPC Server handler 7 on 44262: exiting

12/03/27 23:04:04 INFO metrics.RpcInstrumentation: shut down

12/03/27 23:04:04 INFO ipc.Server: IPC Server handler 2 on 57231: exiting

12/03/27 23:04:04 INFO ipc.Server: Stopping IPC Server listener on 57231

12/03/27 23:04:04 INFO ipc.Server: IPC Server handler 1 on 57231: exiting

12/03/27 23:04:04 INFO ipc.Server: IPC Server handler 0 on 57231: exiting

12/03/27 23:04:05 INFO ipc.Client: Retrying connect to server: localhost/127.0.0.1:10. Already
tried 0 time(s).

12/03/27 23:04:06 INFO ipc.Client: Retrying connect to server: localhost/127.0.0.1:10. Already
tried 1 time(s).

12/03/27 23:04:07 INFO ipc.Client: Retrying connect to server: localhost/127.0.0.1:10. Already
tried 2 time(s).

12/03/27 23:04:08 INFO ipc.Client: Retrying connect to server: localhost/127.0.0.1:10. Already
tried 3 time(s).

12/03/27 23:04:09 INFO ipc.Client: Retrying connect to server: localhost/127.0.0.1:10. Already
tried 4 time(s).

12/03/27 23:04:10 INFO ipc.Client: Retrying connect to server: localhost/127.0.0.1:10. Already
tried 5 time(s).

12/03/27 23:04:11 INFO ipc.Client: Retrying connect to server: localhost/127.0.0.1:10. Already
tried 6 time(s).

12/03/27 23:04:12 INFO ipc.Client: Retrying connect to server: localhost/127.0.0.1:10. Already
tried 7 time(s).

12/03/27 23:04:13 INFO ipc.Client: Retrying connect to server: localhost/127.0.0.1:10. Already
tried 8 time(s).

12/03/27 23:04:14 INFO ipc.Client: Retrying connect to server: localhost/127.0.0.1:10. Already
tried 9 time(s).

Tests run: 3, Failures: 0, Errors: 0, Skipped: 0, Time elapsed: 0.01 sec
Running org.apache.hama.ipc.TestRPC
12/03/27 23:04:15 INFO ipc.Server: Starting SocketReader

12/03/27 23:04:15 INFO ipc.Server: IPC Server Responder: starting

12/03/27 23:04:15 INFO ipc.Server: IPC Server listener on 1234: starting

12/03/27 23:04:15 INFO ipc.Server: IPC Server handler 0 on 1234: starting

12/03/27 23:04:15 ERROR security.UserGroupInformation: PriviledgedActionException as:jenkins
cause:java.io.IOException: bobo

12/03/27 23:04:15 INFO ipc.Server: IPC Server handler 0 on 1234, call error() from 67.195.138.8:48392:
error: java.io.IOException: bobo
java.io.IOException: bobo
	at org.apache.hama.ipc.TestRPC$TestImpl.error(TestRPC.java:102)
	at sun.reflect.NativeMethodAccessorImpl.invoke0(Native Method)
	at sun.reflect.NativeMethodAccessorImpl.invoke(NativeMethodAccessorImpl.java:39)
	at sun.reflect.DelegatingMethodAccessorImpl.invoke(DelegatingMethodAccessorImpl.java:25)
	at java.lang.reflect.Method.invoke(Method.java:597)
	at org.apache.hadoop.ipc.RPC$Server.call(RPC.java:563)
	at org.apache.hadoop.ipc.Server$Handler$1.run(Server.java:1388)
	at org.apache.hadoop.ipc.Server$Handler$1.run(Server.java:1384)
	at java.security.AccessController.doPrivileged(Native Method)
	at javax.security.auth.Subject.doAs(Subject.java:396)
	at org.apache.hadoop.security.UserGroupInformation.doAs(UserGroupInformation.java:1083)
	at org.apache.hadoop.ipc.Server$Handler.run(Server.java:1382)

12/03/27 23:04:15 INFO ipc.Server: Stopping server on 1234

12/03/27 23:04:15 INFO ipc.Server: IPC Server handler 0 on 1234: exiting

12/03/27 23:04:15 INFO ipc.Server: Stopping IPC Server listener on 1234

12/03/27 23:04:15 INFO metrics.RpcInstrumentation: shut down

12/03/27 23:04:15 INFO ipc.Server: Stopping IPC Server Responder

Tests run: 1, Failures: 0, Errors: 0, Skipped: 0, Time elapsed: 0.009 sec
Running org.apache.hama.zookeeper.TestZKTools
Tests run: 1, Failures: 0, Errors: 0, Skipped: 0, Time elapsed: 0.035 sec
Running org.apache.hama.bsp.message.TestAvroMessageManager
12/03/27 23:04:17 INFO ipc.NettyTransceiver: Connecting to minerva.apache.org/67.195.138.8:14000

12/03/27 23:04:17 INFO ipc.NettyTransceiver: [id: 0x01d0d124] OPEN

12/03/27 23:04:17 INFO ipc.NettyServer: [id: 0x015d3388, /67.195.138.8:47784 => /67.195.138.8:14000]
OPEN

12/03/27 23:04:17 INFO ipc.NettyServer: [id: 0x015d3388, /67.195.138.8:47784 => /67.195.138.8:14000]
BOUND: /67.195.138.8:14000

12/03/27 23:04:17 INFO ipc.NettyServer: [id: 0x015d3388, /67.195.138.8:47784 => /67.195.138.8:14000]
CONNECTED: /67.195.138.8:47784

12/03/27 23:04:17 INFO ipc.NettyTransceiver: [id: 0x01d0d124, /67.195.138.8:47784 => minerva.apache.org/67.195.138.8:14000]
BOUND: /67.195.138.8:47784

12/03/27 23:04:17 INFO ipc.NettyTransceiver: [id: 0x01d0d124, /67.195.138.8:47784 => minerva.apache.org/67.195.138.8:14000]
CONNECTED: minerva.apache.org/67.195.138.8:14000

12/03/27 23:04:18 INFO ipc.NettyTransceiver: [id: 0x01d0d124, /67.195.138.8:47784 => minerva.apache.org/67.195.138.8:14000]
INTEREST_CHANGED

12/03/27 23:04:18 INFO ipc.NettyTransceiver: [id: 0x01d0d124, /67.195.138.8:47784 => minerva.apache.org/67.195.138.8:14000]
INTEREST_CHANGED

Tests run: 1, Failures: 0, Errors: 0, Skipped: 0, Time elapsed: 0.01 sec

Results :

Tests in error: 

Tests run: 47, Failures: 0, Errors: 1, Skipped: 0

[INFO] ------------------------------------------------------------------------
[INFO] Reactor Summary:
[INFO] 
[INFO] Apache Hama parent POM ............................ SUCCESS [3.376s]
[INFO] core .............................................. FAILURE [1:27.093s]
[INFO] graph ............................................. SKIPPED
[INFO] examples .......................................... SKIPPED
[INFO] yarn .............................................. SKIPPED
[INFO] dist .............................................. SKIPPED
[INFO] ------------------------------------------------------------------------
[INFO] BUILD FAILURE
[INFO] ------------------------------------------------------------------------
[INFO] Total time: 1:31.019s
[INFO] Finished at: Tue Mar 27 23:04:18 UTC 2012
[INFO] Final Memory: 25M/136M
[INFO] ------------------------------------------------------------------------
[ERROR] Failed to execute goal org.apache.maven.plugins:maven-surefire-plugin:2.6:test (default-test)
on project hama-core: There are test failures.
[ERROR] 
[ERROR] Please refer to <https://builds.apache.org/job/Hama-Nightly/ws/trunk/core/target/surefire-reports>
for the individual test results.
[ERROR] -> [Help 1]
[ERROR] 
[ERROR] To see the full stack trace of the errors, re-run Maven with the -e switch.
[ERROR] Re-run Maven using the -X switch to enable full debug logging.
[ERROR] 
[ERROR] For more information about the errors and possible solutions, please read the following
articles:
[ERROR] [Help 1] http://cwiki.apache.org/confluence/display/MAVEN/MojoFailureException
[ERROR] 
[ERROR] After correcting the problems, you can resume the build with the command
[ERROR]   mvn <goals> -rf :hama-core
Build step 'Invoke top-level Maven targets' marked build as failure
Archiving artifacts
Recording test results

Mime
View raw message