incubator-hama-dev mailing list archives

Site index · List index
Message view « Date » · « Thread »
Top « Date » · « Thread »
From Apache Jenkins Server <jenk...@builds.apache.org>
Subject Build failed in Jenkins: Hama-Nightly #392
Date Sun, 18 Dec 2011 23:09:06 GMT
See <https://builds.apache.org/job/Hama-Nightly/392/>

------------------------------------------
[...truncated 500 lines...]
11/12/18 23:09:06 INFO ipc.Server: IPC Server handler 0 on 64516: exiting

11/12/18 23:09:06 INFO ipc.Server: IPC Server handler 3 on 64516: exiting

11/12/18 23:09:06 INFO ipc.Server: IPC Server handler 6 on 64516: exiting

11/12/18 23:09:06 INFO ipc.Server: IPC Server handler 5 on 64516: exiting

11/12/18 23:09:06 INFO ipc.Server: IPC Server handler 9 on 64516: exiting

11/12/18 23:09:06 INFO ipc.Server: IPC Server handler 7 on 64516: exiting

11/12/18 23:09:06 INFO ipc.Server: IPC Server handler 8 on 64516: exiting

11/12/18 23:09:06 INFO ipc.Server: IPC Server handler 4 on 64516: exiting

11/12/18 23:09:06 INFO ipc.Server: IPC Server handler 2 on 64516: exiting

11/12/18 23:09:06 INFO ipc.Server: Stopping IPC Server Responder

11/12/18 23:09:06 INFO ipc.Server: Stopping server on 64517

11/12/18 23:09:06 INFO ipc.Server: Stopping IPC Server listener on 64516

11/12/18 23:09:06 INFO ipc.Server: IPC Server handler 4 on 64517: exiting

11/12/18 23:09:06 INFO ipc.Server: IPC Server handler 5 on 64517: exiting

11/12/18 23:09:06 INFO ipc.Server: IPC Server handler 8 on 64517: exiting

11/12/18 23:09:06 INFO ipc.Server: IPC Server handler 7 on 64517: exiting

11/12/18 23:09:06 INFO ipc.Server: IPC Server handler 1 on 64516: exiting

11/12/18 23:09:06 INFO ipc.Server: IPC Server handler 9 on 64517: exiting

11/12/18 23:09:06 INFO ipc.Server: Stopping IPC Server listener on 64517

11/12/18 23:09:06 INFO ipc.Server: IPC Server handler 6 on 64517: exiting

11/12/18 23:09:06 INFO ipc.Server: Stopping IPC Server Responder

11/12/18 23:09:06 INFO ipc.Server: IPC Server handler 3 on 64517: exiting

11/12/18 23:09:06 INFO ipc.Server: IPC Server handler 2 on 64517: exiting

11/12/18 23:09:06 INFO ipc.Server: IPC Server handler 0 on 64517: exiting

11/12/18 23:09:06 INFO ipc.Server: IPC Server handler 1 on 64517: exiting

11/12/18 23:09:06 INFO metrics.RpcMetrics: Initializing RPC Metrics with hostName=0, port=64522

11/12/18 23:09:06 INFO ipc.Server: IPC Server Responder: starting

11/12/18 23:09:06 INFO ipc.Server: IPC Server handler 2 on 64522: starting

11/12/18 23:09:06 INFO ipc.Server: IPC Server handler 4 on 64522: starting

11/12/18 23:09:06 INFO ipc.Server: IPC Server handler 5 on 64522: starting

11/12/18 23:09:06 INFO ipc.Server: IPC Server handler 8 on 64522: starting

11/12/18 23:09:06 INFO ipc.Server: IPC Server handler 9 on 64522: starting

11/12/18 23:09:06 INFO ipc.Server: IPC Server handler 7 on 64522: starting

11/12/18 23:09:06 INFO ipc.Server: IPC Server handler 6 on 64522: starting

11/12/18 23:09:06 INFO metrics.RpcMetrics: Initializing RPC Metrics with hostName=0, port=64523

11/12/18 23:09:06 INFO ipc.Server: IPC Server handler 3 on 64522: starting

11/12/18 23:09:06 INFO ipc.Server: IPC Server handler 1 on 64522: starting

11/12/18 23:09:06 INFO ipc.Server: IPC Server handler 0 on 64522: starting

11/12/18 23:09:06 INFO ipc.Server: IPC Server listener on 64522: starting

11/12/18 23:09:06 INFO ipc.Server: IPC Server Responder: starting

11/12/18 23:09:06 INFO ipc.Server: IPC Server listener on 64523: starting

11/12/18 23:09:06 INFO ipc.Server: IPC Server handler 0 on 64523: starting

11/12/18 23:09:06 INFO ipc.Server: IPC Server handler 3 on 64523: starting

11/12/18 23:09:06 INFO ipc.Server: IPC Server handler 2 on 64523: starting

11/12/18 23:09:06 INFO ipc.Server: IPC Server handler 6 on 64523: starting

11/12/18 23:09:06 INFO ipc.Server: IPC Server handler 7 on 64523: starting

11/12/18 23:09:06 INFO ipc.Server: IPC Server handler 9 on 64523: starting

11/12/18 23:09:06 INFO ipc.Server: IPC Server handler 1 on 64523: starting

11/12/18 23:09:06 INFO ipc.Server: IPC Server handler 8 on 64523: starting

11/12/18 23:09:06 INFO ipc.Server: IPC Server handler 5 on 64523: starting

11/12/18 23:09:06 INFO ipc.Server: IPC Server handler 4 on 64523: starting

11/12/18 23:09:06 INFO ipc.Server: Stopping server on 64522

11/12/18 23:09:06 INFO ipc.Server: IPC Server handler 2 on 64522: exiting

11/12/18 23:09:06 INFO ipc.Server: Stopping IPC Server listener on 64522

11/12/18 23:09:06 INFO ipc.Server: IPC Server handler 8 on 64522: exiting

11/12/18 23:09:06 INFO ipc.Server: IPC Server handler 7 on 64522: exiting

11/12/18 23:09:06 INFO ipc.Server: IPC Server handler 9 on 64522: exiting

11/12/18 23:09:06 INFO ipc.Server: IPC Server handler 3 on 64522: exiting

11/12/18 23:09:06 INFO ipc.Server: IPC Server handler 6 on 64522: exiting

11/12/18 23:09:06 INFO ipc.Server: IPC Server handler 4 on 64522: exiting

11/12/18 23:09:06 INFO ipc.Server: Stopping server on 64523

11/12/18 23:09:06 INFO ipc.Server: Stopping IPC Server Responder

11/12/18 23:09:06 INFO ipc.Server: IPC Server handler 0 on 64523: exiting

11/12/18 23:09:06 INFO ipc.Server: IPC Server handler 2 on 64523: exiting

11/12/18 23:09:06 INFO ipc.Server: IPC Server handler 5 on 64522: exiting

11/12/18 23:09:06 INFO ipc.Server: IPC Server handler 9 on 64523: exiting

11/12/18 23:09:06 INFO ipc.Server: IPC Server handler 1 on 64522: exiting

11/12/18 23:09:06 INFO ipc.Server: IPC Server handler 0 on 64522: exiting

11/12/18 23:09:06 INFO ipc.Server: IPC Server handler 8 on 64523: exiting

11/12/18 23:09:06 INFO ipc.Server: IPC Server handler 5 on 64523: exiting

11/12/18 23:09:06 INFO ipc.Server: IPC Server handler 7 on 64523: exiting

11/12/18 23:09:06 INFO ipc.Server: IPC Server handler 6 on 64523: exiting

11/12/18 23:09:06 INFO ipc.Server: IPC Server handler 3 on 64523: exiting

11/12/18 23:09:06 INFO ipc.Server: IPC Server handler 4 on 64523: exiting

11/12/18 23:09:06 INFO ipc.Server: Stopping IPC Server listener on 64523

11/12/18 23:09:06 INFO ipc.Server: Stopping IPC Server Responder

11/12/18 23:09:06 INFO ipc.Server: IPC Server handler 1 on 64523: exiting

11/12/18 23:09:07 INFO ipc.Client: Retrying connect to server: /127.0.0.1:10. Already tried
0 time(s).

11/12/18 23:09:08 INFO ipc.Client: Retrying connect to server: /127.0.0.1:10. Already tried
1 time(s).

11/12/18 23:09:09 INFO ipc.Client: Retrying connect to server: /127.0.0.1:10. Already tried
2 time(s).

11/12/18 23:09:10 INFO ipc.Client: Retrying connect to server: /127.0.0.1:10. Already tried
3 time(s).

11/12/18 23:09:11 INFO ipc.Client: Retrying connect to server: /127.0.0.1:10. Already tried
4 time(s).

11/12/18 23:09:12 INFO ipc.Client: Retrying connect to server: /127.0.0.1:10. Already tried
5 time(s).

11/12/18 23:09:13 INFO ipc.Client: Retrying connect to server: /127.0.0.1:10. Already tried
6 time(s).

11/12/18 23:09:14 INFO ipc.Client: Retrying connect to server: /127.0.0.1:10. Already tried
7 time(s).

11/12/18 23:09:15 INFO ipc.Client: Retrying connect to server: /127.0.0.1:10. Already tried
8 time(s).

11/12/18 23:09:16 INFO ipc.Client: Retrying connect to server: /127.0.0.1:10. Already tried
9 time(s).

Tests run: 3, Failures: 0, Errors: 0, Skipped: 0, Time elapsed: 0.012 sec
Running org.apache.hama.bsp.TestLocalRunner
11/12/18 23:09:17 WARN bsp.BSPJobClient: No job jar file set.  User classes may not be found.
See BSPJob#setJar(String) or check Your jar file.

Tests run: 1, Failures: 0, Errors: 1, Skipped: 0, Time elapsed: 0.018 sec <<< FAILURE!
Running org.apache.hama.ipc.TestRPC
11/12/18 23:09:18 INFO metrics.RpcMetrics: Initializing RPC Metrics with hostName=TestRPC$TestImpl,
port=1234

11/12/18 23:09:18 INFO ipc.Server: IPC Server listener on 1234: starting

11/12/18 23:09:18 INFO ipc.Server: IPC Server Responder: starting

11/12/18 23:09:18 INFO ipc.Server: IPC Server handler 0 on 1234: starting

11/12/18 23:09:18 INFO ipc.Server: IPC Server handler 0 on 1234, call error() from 192.87.106.251:64542:
error: java.io.IOException: bobo
java.io.IOException: bobo
	at org.apache.hama.ipc.TestRPC$TestImpl.error(TestRPC.java:102)
	at sun.reflect.NativeMethodAccessorImpl.invoke0(Native Method)
	at sun.reflect.NativeMethodAccessorImpl.invoke(NativeMethodAccessorImpl.java:39)
	at sun.reflect.DelegatingMethodAccessorImpl.invoke(DelegatingMethodAccessorImpl.java:25)
	at java.lang.reflect.Method.invoke(Method.java:597)
	at org.apache.hadoop.ipc.RPC$Server.call(RPC.java:508)
	at org.apache.hadoop.ipc.Server$Handler$1.run(Server.java:959)
	at org.apache.hadoop.ipc.Server$Handler$1.run(Server.java:955)
	at java.security.AccessController.doPrivileged(Native Method)
	at javax.security.auth.Subject.doAs(Subject.java:396)
	at org.apache.hadoop.ipc.Server$Handler.run(Server.java:953)

11/12/18 23:09:18 INFO ipc.Server: Stopping server on 1234

11/12/18 23:09:18 INFO ipc.Server: IPC Server handler 0 on 1234: exiting

11/12/18 23:09:18 INFO ipc.Server: Stopping IPC Server listener on 1234

11/12/18 23:09:18 INFO ipc.Server: Stopping IPC Server Responder

Tests run: 1, Failures: 0, Errors: 0, Skipped: 0, Time elapsed: 0.01 sec
Running org.apache.hama.zookeeper.TestZKTools
Tests run: 1, Failures: 0, Errors: 0, Skipped: 0, Time elapsed: 0.009 sec

Results :

Tests in error: 

Tests run: 38, Failures: 0, Errors: 4, Skipped: 0

[INFO] ------------------------------------------------------------------------
[INFO] Reactor Summary:
[INFO] 
[INFO] Apache Hama parent POM ............................ SUCCESS [10.527s]
[INFO] Apache Hama Core .................................. FAILURE [51.358s]
[INFO] Apache Hama Graph Package ......................... SKIPPED
[INFO] Apache Hama Examples .............................. SKIPPED
[INFO] Apache Hama YARN .................................. SKIPPED
[INFO] ------------------------------------------------------------------------
[INFO] BUILD FAILURE
[INFO] ------------------------------------------------------------------------
[INFO] Total time: 1:04.579s
[INFO] Finished at: Sun Dec 18 23:09:19 GMT+00:00 2011
[INFO] Final Memory: 21M/268M
[INFO] ------------------------------------------------------------------------
[ERROR] Failed to execute goal org.apache.maven.plugins:maven-surefire-plugin:2.6:test (default-test)
on project hama-core: There are test failures.
[ERROR] 
[ERROR] Please refer to /zonestorage/hudson_solaris/home/hudson/hudson-slave/workspace/Hama-Nightly/trunk/core/target/surefire-reports
for the individual test results.
[ERROR] -> [Help 1]
[ERROR] 
[ERROR] To see the full stack trace of the errors, re-run Maven with the -e switch.
[ERROR] Re-run Maven using the -X switch to enable full debug logging.
[ERROR] 
[ERROR] For more information about the errors and possible solutions, please read the following
articles:
[ERROR] [Help 1] http://cwiki.apache.org/confluence/display/MAVEN/MojoFailureException
[ERROR] 
[ERROR] After correcting the problems, you can resume the build with the command
[ERROR]   mvn <goals> -rf :hama-core
Build step 'Invoke top-level Maven targets' marked build as failure


Mime
View raw message