incubator-hama-dev mailing list archives

Site index · List index
Message view « Date » · « Thread »
Top « Date » · « Thread »
From Apache Jenkins Server <jenk...@builds.apache.org>
Subject Build failed in Jenkins: Hama-Nightly #330
Date Fri, 21 Oct 2011 23:04:50 GMT
See <https://builds.apache.org/job/Hama-Nightly/330/changes>

Changes:

[edwardyoon] GroomServerStatus.countTask() always returns 1

------------------------------------------
[...truncated 12493 lines...]
1584 KB   
1585 KB   
1589 KB   
1593 KB   
1597 KB   
1600 KB   
1604 KB   
1607 KB   
1611 KB   
1615 KB   
1617 KB   
1621 KB   
1621 KB   
1625 KB   
1628 KB   
1632 KB   
1634 KB   
1638 KB   
1642 KB   
1646 KB   
1648 KB   
1652 KB   
1655 KB   
1658 KB   
1662 KB   
1665 KB   
1669 KB   
1670 KB   
1674 KB   
1675 KB   
          
Downloaded: http://repository.apache.org/snapshots/org/apache/hadoop/hadoop-common/0.23.0-SNAPSHOT/hadoop-common-0.23.0-20111021.225258-387.jar
(1675 KB at 173.2 KB/sec)
[INFO] 
[INFO] --- maven-clean-plugin:2.4.1:clean (default-clean) @ hama-yarn ---
[INFO] Deleting /zonestorage/hudson_solaris/home/hudson/hudson-slave/workspace/Hama-Nightly/trunk/yarn/target
[INFO] 
[INFO] --- maven-remote-resources-plugin:1.1:process (default) @ hama-yarn ---
Downloading: https://repository.apache.org/content/repositories/snapshots/org/apache/hadoop/hadoop-project/0.23.0-SNAPSHOT/maven-metadata.xml
612 B     
        
Downloaded: https://repository.apache.org/content/repositories/snapshots/org/apache/hadoop/hadoop-project/0.23.0-SNAPSHOT/maven-metadata.xml
(612 B at 0.7 KB/sec)
[INFO] 
[INFO] --- maven-resources-plugin:2.4:resources (default-resources) @ hama-yarn ---
[INFO] Using 'UTF-8' encoding to copy filtered resources.
[INFO] Copying 1 resource
[INFO] Copying 3 resources
[INFO] 
[INFO] --- maven-compiler-plugin:2.3.2:compile (default-compile) @ hama-yarn ---
[INFO] Compiling 12 source files to /zonestorage/hudson_solaris/home/hudson/hudson-slave/workspace/Hama-Nightly/trunk/yarn/target/classes
[INFO] -------------------------------------------------------------
[ERROR] COMPILATION ERROR : 
[INFO] -------------------------------------------------------------
[ERROR] /zonestorage/hudson_solaris/home/hudson/hudson-slave/workspace/Hama-Nightly/trunk/yarn/src/main/java/org/apache/hama/bsp/YARNBSPJob.java:[41,49]
cannot find symbol
symbol  : class GetNewApplicationRequest
location: package org.apache.hadoop.yarn.api.protocolrecords
[ERROR] /zonestorage/hudson_solaris/home/hudson/hudson-slave/workspace/Hama-Nightly/trunk/yarn/src/main/java/org/apache/hama/bsp/YARNBSPJob.java:[42,49]
cannot find symbol
symbol  : class GetNewApplicationResponse
location: package org.apache.hadoop.yarn.api.protocolrecords
[ERROR] /zonestorage/hudson_solaris/home/hudson/hudson-slave/workspace/Hama-Nightly/trunk/yarn/src/main/java/org/apache/hama/bsp/YARNBSPJob.java:[43,49]
cannot find symbol
symbol  : class KillApplicationRequest
location: package org.apache.hadoop.yarn.api.protocolrecords
[ERROR] /zonestorage/hudson_solaris/home/hudson/hudson-slave/workspace/Hama-Nightly/trunk/yarn/src/main/java/org/apache/hama/bsp/YARNBSPJob.java:[49,41]
cannot find symbol
symbol  : class FinalApplicationStatus
location: package org.apache.hadoop.yarn.api.records
[ERROR] /zonestorage/hudson_solaris/home/hudson/hudson-slave/workspace/Hama-Nightly/trunk/yarn/src/main/java/org/apache/hama/bsp/BSPApplicationMaster.java:[48,41]
cannot find symbol
symbol  : class FinalApplicationStatus
location: package org.apache.hadoop.yarn.api.records
[ERROR] /zonestorage/hudson_solaris/home/hudson/hudson-slave/workspace/Hama-Nightly/trunk/yarn/src/main/java/org/apache/hama/bsp/JobImpl.java:[145,40]
cannot find symbol
symbol  : method newAllocateRequest(org.apache.hadoop.yarn.api.records.ApplicationAttemptId,int,float,java.util.List<org.apache.hadoop.yarn.api.records.ResourceRequest>,java.util.List<org.apache.hadoop.yarn.api.records.ContainerId>)
location: class org.apache.hadoop.yarn.util.BuilderUtils
[ERROR] /zonestorage/hudson_solaris/home/hudson/hudson-slave/workspace/Hama-Nightly/trunk/yarn/src/main/java/org/apache/hama/bsp/YARNBSPJob.java:[87,4]
cannot find symbol
symbol  : class KillApplicationRequest
location: class org.apache.hama.bsp.YARNBSPJob
[ERROR] /zonestorage/hudson_solaris/home/hudson/hudson-slave/workspace/Hama-Nightly/trunk/yarn/src/main/java/org/apache/hama/bsp/YARNBSPJob.java:[88,19]
cannot find symbol
symbol  : class KillApplicationRequest
location: class org.apache.hama.bsp.YARNBSPJob
[ERROR] /zonestorage/hudson_solaris/home/hudson/hudson-slave/workspace/Hama-Nightly/trunk/yarn/src/main/java/org/apache/hama/bsp/YARNBSPJob.java:[126,4]
cannot find symbol
symbol  : class GetNewApplicationRequest
location: class org.apache.hama.bsp.YARNBSPJob
[ERROR] /zonestorage/hudson_solaris/home/hudson/hudson-slave/workspace/Hama-Nightly/trunk/yarn/src/main/java/org/apache/hama/bsp/YARNBSPJob.java:[127,19]
cannot find symbol
symbol  : class GetNewApplicationRequest
location: class org.apache.hama.bsp.YARNBSPJob
[ERROR] /zonestorage/hudson_solaris/home/hudson/hudson-slave/workspace/Hama-Nightly/trunk/yarn/src/main/java/org/apache/hama/bsp/YARNBSPJob.java:[128,4]
cannot find symbol
symbol  : class GetNewApplicationResponse
location: class org.apache.hama.bsp.YARNBSPJob
[ERROR] /zonestorage/hudson_solaris/home/hudson/hudson-slave/workspace/Hama-Nightly/trunk/yarn/src/main/java/org/apache/hama/bsp/YARNBSPJob.java:[255,22]
cannot find symbol
symbol  : method getFinalApplicationStatus()
location: interface org.apache.hadoop.yarn.api.records.ApplicationReport
[ERROR] /zonestorage/hudson_solaris/home/hudson/hudson-slave/workspace/Hama-Nightly/trunk/yarn/src/main/java/org/apache/hama/bsp/YARNBSPJob.java:[256,22]
cannot find symbol
symbol  : method getFinalApplicationStatus()
location: interface org.apache.hadoop.yarn.api.records.ApplicationReport
[ERROR] /zonestorage/hudson_solaris/home/hudson/hudson-slave/workspace/Hama-Nightly/trunk/yarn/src/main/java/org/apache/hama/bsp/YARNBSPJob.java:[256,54]
cannot find symbol
symbol  : variable FinalApplicationStatus
location: class org.apache.hama.bsp.YARNBSPJob
[ERROR] /zonestorage/hudson_solaris/home/hudson/hudson-slave/workspace/Hama-Nightly/trunk/yarn/src/main/java/org/apache/hama/bsp/YARNBSPJob.java:[257,22]
cannot find symbol
symbol  : method getFinalApplicationStatus()
location: interface org.apache.hadoop.yarn.api.records.ApplicationReport
[ERROR] /zonestorage/hudson_solaris/home/hudson/hudson-slave/workspace/Hama-Nightly/trunk/yarn/src/main/java/org/apache/hama/bsp/YARNBSPJob.java:[257,54]
cannot find symbol
symbol  : variable FinalApplicationStatus
location: class org.apache.hama.bsp.YARNBSPJob
[ERROR] /zonestorage/hudson_solaris/home/hudson/hudson-slave/workspace/Hama-Nightly/trunk/yarn/src/main/java/org/apache/hama/bsp/YARNBSPJob.java:[258,22]
cannot find symbol
symbol  : method getFinalApplicationStatus()
location: interface org.apache.hadoop.yarn.api.records.ApplicationReport
[ERROR] /zonestorage/hudson_solaris/home/hudson/hudson-slave/workspace/Hama-Nightly/trunk/yarn/src/main/java/org/apache/hama/bsp/YARNBSPJob.java:[258,54]
cannot find symbol
symbol  : variable FinalApplicationStatus
location: class org.apache.hama.bsp.YARNBSPJob
[ERROR] /zonestorage/hudson_solaris/home/hudson/hudson-slave/workspace/Hama-Nightly/trunk/yarn/src/main/java/org/apache/hama/bsp/YARNBSPJob.java:[259,51]
cannot find symbol
symbol  : method getFinalApplicationStatus()
location: interface org.apache.hadoop.yarn.api.records.ApplicationReport
[ERROR] /zonestorage/hudson_solaris/home/hudson/hudson-slave/workspace/Hama-Nightly/trunk/yarn/src/main/java/org/apache/hama/bsp/YARNBSPJob.java:[276,19]
cannot find symbol
symbol  : method getFinalApplicationStatus()
location: interface org.apache.hadoop.yarn.api.records.ApplicationReport
[ERROR] /zonestorage/hudson_solaris/home/hudson/hudson-slave/workspace/Hama-Nightly/trunk/yarn/src/main/java/org/apache/hama/bsp/YARNBSPJob.java:[276,51]
cannot find symbol
symbol  : variable FinalApplicationStatus
location: class org.apache.hama.bsp.YARNBSPJob
[ERROR] /zonestorage/hudson_solaris/home/hudson/hudson-slave/workspace/Hama-Nightly/trunk/yarn/src/main/java/org/apache/hama/bsp/YARNBSPJob.java:[281,23]
cannot find symbol
symbol  : method getFinalApplicationStatus()
location: interface org.apache.hadoop.yarn.api.records.ApplicationReport
[ERROR] /zonestorage/hudson_solaris/home/hudson/hudson-slave/workspace/Hama-Nightly/trunk/yarn/src/main/java/org/apache/hama/bsp/BSPApplicationMaster.java:[203,46]
cannot find symbol
symbol  : variable APPLICATION_ATTEMPT_ID_ENV
location: interface org.apache.hadoop.yarn.api.ApplicationConstants
[ERROR] /zonestorage/hudson_solaris/home/hudson/hudson-slave/workspace/Hama-Nightly/trunk/yarn/src/main/java/org/apache/hama/bsp/BSPApplicationMaster.java:[208,33]
cannot find symbol
symbol  : variable APPLICATION_ATTEMPT_ID_ENV
location: interface org.apache.hadoop.yarn.api.ApplicationConstants
[ERROR] /zonestorage/hudson_solaris/home/hudson/hudson-slave/workspace/Hama-Nightly/trunk/yarn/src/main/java/org/apache/hama/bsp/BSPApplicationMaster.java:[240,45]
cannot find symbol
symbol  : variable FinalApplicationStatus
location: class org.apache.hama.bsp.BSPApplicationMaster
[ERROR] /zonestorage/hudson_solaris/home/hudson/hudson-slave/workspace/Hama-Nightly/trunk/yarn/src/main/java/org/apache/hama/bsp/BSPApplicationMaster.java:[243,45]
cannot find symbol
symbol  : variable FinalApplicationStatus
location: class org.apache.hama.bsp.BSPApplicationMaster
[ERROR] /zonestorage/hudson_solaris/home/hudson/hudson-slave/workspace/Hama-Nightly/trunk/yarn/src/main/java/org/apache/hama/bsp/BSPApplicationMaster.java:[246,45]
cannot find symbol
symbol  : variable FinalApplicationStatus
location: class org.apache.hama.bsp.BSPApplicationMaster
[ERROR] /zonestorage/hudson_solaris/home/hudson/hudson-slave/workspace/Hama-Nightly/trunk/yarn/src/main/java/org/apache/hama/bsp/BSPApplicationMaster.java:[249,45]
cannot find symbol
symbol  : variable FinalApplicationStatus
location: class org.apache.hama.bsp.BSPApplicationMaster
[INFO] 28 errors 
[INFO] -------------------------------------------------------------
[INFO] ------------------------------------------------------------------------
[INFO] Reactor Summary:
[INFO] 
[INFO] Apache Hama parent POM ............................ SUCCESS [2.549s]
[INFO] Apache Hama Core .................................. SUCCESS [2:18.197s]
[INFO] Apache Hama Graph Package ......................... SUCCESS [2.390s]
[INFO] Apache Hama Examples .............................. SUCCESS [50.399s]
[INFO] Apache Hama YARN .................................. FAILURE [30.434s]
[INFO] ------------------------------------------------------------------------
[INFO] BUILD FAILURE
[INFO] ------------------------------------------------------------------------
[INFO] Total time: 3:44.972s
[INFO] Finished at: Sat Oct 22 00:07:48 GMT+00:00 2011
[INFO] Final Memory: 42M/372M
[INFO] ------------------------------------------------------------------------
[ERROR] Failed to execute goal org.apache.maven.plugins:maven-compiler-plugin:2.3.2:compile
(default-compile) on project hama-yarn: Compilation failure: Compilation failure:
[ERROR] /zonestorage/hudson_solaris/home/hudson/hudson-slave/workspace/Hama-Nightly/trunk/yarn/src/main/java/org/apache/hama/bsp/YARNBSPJob.java:[41,49]
cannot find symbol
[ERROR] symbol  : class GetNewApplicationRequest
[ERROR] location: package org.apache.hadoop.yarn.api.protocolrecords
[ERROR] /zonestorage/hudson_solaris/home/hudson/hudson-slave/workspace/Hama-Nightly/trunk/yarn/src/main/java/org/apache/hama/bsp/YARNBSPJob.java:[42,49]
cannot find symbol
[ERROR] symbol  : class GetNewApplicationResponse
[ERROR] location: package org.apache.hadoop.yarn.api.protocolrecords
[ERROR] /zonestorage/hudson_solaris/home/hudson/hudson-slave/workspace/Hama-Nightly/trunk/yarn/src/main/java/org/apache/hama/bsp/YARNBSPJob.java:[43,49]
cannot find symbol
[ERROR] symbol  : class KillApplicationRequest
[ERROR] location: package org.apache.hadoop.yarn.api.protocolrecords
[ERROR] /zonestorage/hudson_solaris/home/hudson/hudson-slave/workspace/Hama-Nightly/trunk/yarn/src/main/java/org/apache/hama/bsp/YARNBSPJob.java:[49,41]
cannot find symbol
[ERROR] symbol  : class FinalApplicationStatus
[ERROR] location: package org.apache.hadoop.yarn.api.records
[ERROR] /zonestorage/hudson_solaris/home/hudson/hudson-slave/workspace/Hama-Nightly/trunk/yarn/src/main/java/org/apache/hama/bsp/BSPApplicationMaster.java:[48,41]
cannot find symbol
[ERROR] symbol  : class FinalApplicationStatus
[ERROR] location: package org.apache.hadoop.yarn.api.records
[ERROR] /zonestorage/hudson_solaris/home/hudson/hudson-slave/workspace/Hama-Nightly/trunk/yarn/src/main/java/org/apache/hama/bsp/JobImpl.java:[145,40]
cannot find symbol
[ERROR] symbol  : method newAllocateRequest(org.apache.hadoop.yarn.api.records.ApplicationAttemptId,int,float,java.util.List<org.apache.hadoop.yarn.api.records.ResourceRequest>,java.util.List<org.apache.hadoop.yarn.api.records.ContainerId>)
[ERROR] location: class org.apache.hadoop.yarn.util.BuilderUtils
[ERROR] /zonestorage/hudson_solaris/home/hudson/hudson-slave/workspace/Hama-Nightly/trunk/yarn/src/main/java/org/apache/hama/bsp/YARNBSPJob.java:[87,4]
cannot find symbol
[ERROR] symbol  : class KillApplicationRequest
[ERROR] location: class org.apache.hama.bsp.YARNBSPJob
[ERROR] /zonestorage/hudson_solaris/home/hudson/hudson-slave/workspace/Hama-Nightly/trunk/yarn/src/main/java/org/apache/hama/bsp/YARNBSPJob.java:[88,19]
cannot find symbol
[ERROR] symbol  : class KillApplicationRequest
[ERROR] location: class org.apache.hama.bsp.YARNBSPJob
[ERROR] /zonestorage/hudson_solaris/home/hudson/hudson-slave/workspace/Hama-Nightly/trunk/yarn/src/main/java/org/apache/hama/bsp/YARNBSPJob.java:[126,4]
cannot find symbol
[ERROR] symbol  : class GetNewApplicationRequest
[ERROR] location: class org.apache.hama.bsp.YARNBSPJob
[ERROR] /zonestorage/hudson_solaris/home/hudson/hudson-slave/workspace/Hama-Nightly/trunk/yarn/src/main/java/org/apache/hama/bsp/YARNBSPJob.java:[127,19]
cannot find symbol
[ERROR] symbol  : class GetNewApplicationRequest
[ERROR] location: class org.apache.hama.bsp.YARNBSPJob
[ERROR] /zonestorage/hudson_solaris/home/hudson/hudson-slave/workspace/Hama-Nightly/trunk/yarn/src/main/java/org/apache/hama/bsp/YARNBSPJob.java:[128,4]
cannot find symbol
[ERROR] symbol  : class GetNewApplicationResponse
[ERROR] location: class org.apache.hama.bsp.YARNBSPJob
[ERROR] /zonestorage/hudson_solaris/home/hudson/hudson-slave/workspace/Hama-Nightly/trunk/yarn/src/main/java/org/apache/hama/bsp/YARNBSPJob.java:[255,22]
cannot find symbol
[ERROR] symbol  : method getFinalApplicationStatus()
[ERROR] location: interface org.apache.hadoop.yarn.api.records.ApplicationReport
[ERROR] /zonestorage/hudson_solaris/home/hudson/hudson-slave/workspace/Hama-Nightly/trunk/yarn/src/main/java/org/apache/hama/bsp/YARNBSPJob.java:[256,22]
cannot find symbol
[ERROR] symbol  : method getFinalApplicationStatus()
[ERROR] location: interface org.apache.hadoop.yarn.api.records.ApplicationReport
[ERROR] /zonestorage/hudson_solaris/home/hudson/hudson-slave/workspace/Hama-Nightly/trunk/yarn/src/main/java/org/apache/hama/bsp/YARNBSPJob.java:[256,54]
cannot find symbol
[ERROR] symbol  : variable FinalApplicationStatus
[ERROR] location: class org.apache.hama.bsp.YARNBSPJob
[ERROR] /zonestorage/hudson_solaris/home/hudson/hudson-slave/workspace/Hama-Nightly/trunk/yarn/src/main/java/org/apache/hama/bsp/YARNBSPJob.java:[257,22]
cannot find symbol
[ERROR] symbol  : method getFinalApplicationStatus()
[ERROR] location: interface org.apache.hadoop.yarn.api.records.ApplicationReport
[ERROR] /zonestorage/hudson_solaris/home/hudson/hudson-slave/workspace/Hama-Nightly/trunk/yarn/src/main/java/org/apache/hama/bsp/YARNBSPJob.java:[257,54]
cannot find symbol
[ERROR] symbol  : variable FinalApplicationStatus
[ERROR] location: class org.apache.hama.bsp.YARNBSPJob
[ERROR] /zonestorage/hudson_solaris/home/hudson/hudson-slave/workspace/Hama-Nightly/trunk/yarn/src/main/java/org/apache/hama/bsp/YARNBSPJob.java:[258,22]
cannot find symbol
[ERROR] symbol  : method getFinalApplicationStatus()
[ERROR] location: interface org.apache.hadoop.yarn.api.records.ApplicationReport
[ERROR] /zonestorage/hudson_solaris/home/hudson/hudson-slave/workspace/Hama-Nightly/trunk/yarn/src/main/java/org/apache/hama/bsp/YARNBSPJob.java:[258,54]
cannot find symbol
[ERROR] symbol  : variable FinalApplicationStatus
[ERROR] location: class org.apache.hama.bsp.YARNBSPJob
[ERROR] /zonestorage/hudson_solaris/home/hudson/hudson-slave/workspace/Hama-Nightly/trunk/yarn/src/main/java/org/apache/hama/bsp/YARNBSPJob.java:[259,51]
cannot find symbol
[ERROR] symbol  : method getFinalApplicationStatus()
[ERROR] location: interface org.apache.hadoop.yarn.api.records.ApplicationReport
[ERROR] /zonestorage/hudson_solaris/home/hudson/hudson-slave/workspace/Hama-Nightly/trunk/yarn/src/main/java/org/apache/hama/bsp/YARNBSPJob.java:[276,19]
cannot find symbol
[ERROR] symbol  : method getFinalApplicationStatus()
[ERROR] location: interface org.apache.hadoop.yarn.api.records.ApplicationReport
[ERROR] /zonestorage/hudson_solaris/home/hudson/hudson-slave/workspace/Hama-Nightly/trunk/yarn/src/main/java/org/apache/hama/bsp/YARNBSPJob.java:[276,51]
cannot find symbol
[ERROR] symbol  : variable FinalApplicationStatus
[ERROR] location: class org.apache.hama.bsp.YARNBSPJob
[ERROR] /zonestorage/hudson_solaris/home/hudson/hudson-slave/workspace/Hama-Nightly/trunk/yarn/src/main/java/org/apache/hama/bsp/YARNBSPJob.java:[281,23]
cannot find symbol
[ERROR] symbol  : method getFinalApplicationStatus()
[ERROR] location: interface org.apache.hadoop.yarn.api.records.ApplicationReport
[ERROR] /zonestorage/hudson_solaris/home/hudson/hudson-slave/workspace/Hama-Nightly/trunk/yarn/src/main/java/org/apache/hama/bsp/BSPApplicationMaster.java:[203,46]
cannot find symbol
[ERROR] symbol  : variable APPLICATION_ATTEMPT_ID_ENV
[ERROR] location: interface org.apache.hadoop.yarn.api.ApplicationConstants
[ERROR] /zonestorage/hudson_solaris/home/hudson/hudson-slave/workspace/Hama-Nightly/trunk/yarn/src/main/java/org/apache/hama/bsp/BSPApplicationMaster.java:[208,33]
cannot find symbol
[ERROR] symbol  : variable APPLICATION_ATTEMPT_ID_ENV
[ERROR] location: interface org.apache.hadoop.yarn.api.ApplicationConstants
[ERROR] /zonestorage/hudson_solaris/home/hudson/hudson-slave/workspace/Hama-Nightly/trunk/yarn/src/main/java/org/apache/hama/bsp/BSPApplicationMaster.java:[240,45]
cannot find symbol
[ERROR] symbol  : variable FinalApplicationStatus
[ERROR] location: class org.apache.hama.bsp.BSPApplicationMaster
[ERROR] /zonestorage/hudson_solaris/home/hudson/hudson-slave/workspace/Hama-Nightly/trunk/yarn/src/main/java/org/apache/hama/bsp/BSPApplicationMaster.java:[243,45]
cannot find symbol
[ERROR] symbol  : variable FinalApplicationStatus
[ERROR] location: class org.apache.hama.bsp.BSPApplicationMaster
[ERROR] /zonestorage/hudson_solaris/home/hudson/hudson-slave/workspace/Hama-Nightly/trunk/yarn/src/main/java/org/apache/hama/bsp/BSPApplicationMaster.java:[246,45]
cannot find symbol
[ERROR] symbol  : variable FinalApplicationStatus
[ERROR] location: class org.apache.hama.bsp.BSPApplicationMaster
[ERROR] /zonestorage/hudson_solaris/home/hudson/hudson-slave/workspace/Hama-Nightly/trunk/yarn/src/main/java/org/apache/hama/bsp/BSPApplicationMaster.java:[249,45]
cannot find symbol
[ERROR] symbol  : variable FinalApplicationStatus
[ERROR] location: class org.apache.hama.bsp.BSPApplicationMaster
[ERROR] -> [Help 1]
[ERROR] 
[ERROR] To see the full stack trace of the errors, re-run Maven with the -e switch.
[ERROR] Re-run Maven using the -X switch to enable full debug logging.
[ERROR] 
[ERROR] For more information about the errors and possible solutions, please read the following
articles:
[ERROR] [Help 1] http://cwiki.apache.org/confluence/display/MAVEN/MojoFailureException
[ERROR] 
[ERROR] After correcting the problems, you can resume the build with the command
[ERROR]   mvn <goals> -rf :hama-yarn
Build step 'Invoke top-level Maven targets' marked build as failure


Mime
View raw message