incubator-hama-dev mailing list archives

Site index · List index
Message view « Date » · « Thread »
Top « Date » · « Thread »
From Apache Jenkins Server <jenk...@builds.apache.org>
Subject Build failed in Jenkins: Hama-Nightly #329
Date Thu, 20 Oct 2011 23:34:16 GMT
See <https://builds.apache.org/job/Hama-Nightly/329/changes>

Changes:

[tjungblut] [HAMA-457]:wq Refactoring of BSPPeerImpl

------------------------------------------
[...truncated 12526 lines...]
1594 KB   1538 KB   
1598 KB   1538 KB   
1602 KB   1538 KB   
1604 KB   1538 KB   
1604 KB   1539 KB   
1604 KB   1539 KB   
1608 KB   1539 KB   
1612 KB   1539 KB   
1616 KB   1539 KB   
1618 KB   1539 KB   
1622 KB   1539 KB   
1625 KB   1539 KB   
1629 KB   1539 KB   
1633 KB   1539 KB   
1633 KB   1539 KB   
1637 KB   1539 KB   
1641 KB   1539 KB   
1645 KB   1539 KB   
1648 KB   1539 KB   
1652 KB   1539 KB   
1652 KB   1539 KB   
1656 KB   1539 KB   
1660 KB   1539 KB   
1664 KB   1539 KB   
1668 KB   1539 KB   
1672 KB   1539 KB   
1675 KB   1539 KB   
                    
Downloaded: http://repository.apache.org/snapshots/org/apache/hadoop/hadoop-hdfs/0.23.0-SNAPSHOT/hadoop-hdfs-0.23.0-20111020.230029-440.jar
(1539 KB at 164.8 KB/sec)
                    
Downloaded: http://repository.apache.org/snapshots/org/apache/hadoop/hadoop-common/0.23.0-SNAPSHOT/hadoop-common-0.23.0-20111020.230059-377.jar
(1675 KB at 172.8 KB/sec)
[INFO] 
[INFO] --- maven-clean-plugin:2.4.1:clean (default-clean) @ hama-yarn ---
[INFO] Deleting /zonestorage/hudson_solaris/home/hudson/hudson-slave/workspace/Hama-Nightly/trunk/yarn/target
[INFO] 
[INFO] --- maven-remote-resources-plugin:1.1:process (default) @ hama-yarn ---
Downloading: https://repository.apache.org/content/repositories/snapshots/org/apache/hadoop/hadoop-project/0.23.0-SNAPSHOT/maven-metadata.xml
612 B               
        
Downloaded: https://repository.apache.org/content/repositories/snapshots/org/apache/hadoop/hadoop-project/0.23.0-SNAPSHOT/maven-metadata.xml
(612 B at 0.6 KB/sec)
[INFO] 
[INFO] --- maven-resources-plugin:2.4:resources (default-resources) @ hama-yarn ---
[INFO] Using 'UTF-8' encoding to copy filtered resources.
[INFO] Copying 1 resource
[INFO] Copying 3 resources
[INFO] 
[INFO] --- maven-compiler-plugin:2.3.2:compile (default-compile) @ hama-yarn ---
[INFO] Compiling 12 source files to /zonestorage/hudson_solaris/home/hudson/hudson-slave/workspace/Hama-Nightly/trunk/yarn/target/classes
[INFO] -------------------------------------------------------------
[ERROR] COMPILATION ERROR : 
[INFO] -------------------------------------------------------------
[ERROR] /zonestorage/hudson_solaris/home/hudson/hudson-slave/workspace/Hama-Nightly/trunk/yarn/src/main/java/org/apache/hama/bsp/YARNBSPJob.java:[41,49]
cannot find symbol
symbol  : class GetNewApplicationRequest
location: package org.apache.hadoop.yarn.api.protocolrecords
[ERROR] /zonestorage/hudson_solaris/home/hudson/hudson-slave/workspace/Hama-Nightly/trunk/yarn/src/main/java/org/apache/hama/bsp/YARNBSPJob.java:[42,49]
cannot find symbol
symbol  : class GetNewApplicationResponse
location: package org.apache.hadoop.yarn.api.protocolrecords
[ERROR] /zonestorage/hudson_solaris/home/hudson/hudson-slave/workspace/Hama-Nightly/trunk/yarn/src/main/java/org/apache/hama/bsp/YARNBSPJob.java:[43,49]
cannot find symbol
symbol  : class KillApplicationRequest
location: package org.apache.hadoop.yarn.api.protocolrecords
[ERROR] /zonestorage/hudson_solaris/home/hudson/hudson-slave/workspace/Hama-Nightly/trunk/yarn/src/main/java/org/apache/hama/bsp/YARNBSPJob.java:[49,41]
cannot find symbol
symbol  : class FinalApplicationStatus
location: package org.apache.hadoop.yarn.api.records
[ERROR] /zonestorage/hudson_solaris/home/hudson/hudson-slave/workspace/Hama-Nightly/trunk/yarn/src/main/java/org/apache/hama/bsp/BSPApplicationMaster.java:[48,41]
cannot find symbol
symbol  : class FinalApplicationStatus
location: package org.apache.hadoop.yarn.api.records
[ERROR] /zonestorage/hudson_solaris/home/hudson/hudson-slave/workspace/Hama-Nightly/trunk/yarn/src/main/java/org/apache/hama/bsp/JobImpl.java:[145,40]
cannot find symbol
symbol  : method newAllocateRequest(org.apache.hadoop.yarn.api.records.ApplicationAttemptId,int,float,java.util.List<org.apache.hadoop.yarn.api.records.ResourceRequest>,java.util.List<org.apache.hadoop.yarn.api.records.ContainerId>)
location: class org.apache.hadoop.yarn.util.BuilderUtils
[ERROR] /zonestorage/hudson_solaris/home/hudson/hudson-slave/workspace/Hama-Nightly/trunk/yarn/src/main/java/org/apache/hama/bsp/YARNBSPJob.java:[87,4]
cannot find symbol
symbol  : class KillApplicationRequest
location: class org.apache.hama.bsp.YARNBSPJob
[ERROR] /zonestorage/hudson_solaris/home/hudson/hudson-slave/workspace/Hama-Nightly/trunk/yarn/src/main/java/org/apache/hama/bsp/YARNBSPJob.java:[88,19]
cannot find symbol
symbol  : class KillApplicationRequest
location: class org.apache.hama.bsp.YARNBSPJob
[ERROR] /zonestorage/hudson_solaris/home/hudson/hudson-slave/workspace/Hama-Nightly/trunk/yarn/src/main/java/org/apache/hama/bsp/YARNBSPJob.java:[126,4]
cannot find symbol
symbol  : class GetNewApplicationRequest
location: class org.apache.hama.bsp.YARNBSPJob
[ERROR] /zonestorage/hudson_solaris/home/hudson/hudson-slave/workspace/Hama-Nightly/trunk/yarn/src/main/java/org/apache/hama/bsp/YARNBSPJob.java:[127,19]
cannot find symbol
symbol  : class GetNewApplicationRequest
location: class org.apache.hama.bsp.YARNBSPJob
[ERROR] /zonestorage/hudson_solaris/home/hudson/hudson-slave/workspace/Hama-Nightly/trunk/yarn/src/main/java/org/apache/hama/bsp/YARNBSPJob.java:[128,4]
cannot find symbol
symbol  : class GetNewApplicationResponse
location: class org.apache.hama.bsp.YARNBSPJob
[ERROR] /zonestorage/hudson_solaris/home/hudson/hudson-slave/workspace/Hama-Nightly/trunk/yarn/src/main/java/org/apache/hama/bsp/YARNBSPJob.java:[255,22]
cannot find symbol
symbol  : method getFinalApplicationStatus()
location: interface org.apache.hadoop.yarn.api.records.ApplicationReport
[ERROR] /zonestorage/hudson_solaris/home/hudson/hudson-slave/workspace/Hama-Nightly/trunk/yarn/src/main/java/org/apache/hama/bsp/YARNBSPJob.java:[256,22]
cannot find symbol
symbol  : method getFinalApplicationStatus()
location: interface org.apache.hadoop.yarn.api.records.ApplicationReport
[ERROR] /zonestorage/hudson_solaris/home/hudson/hudson-slave/workspace/Hama-Nightly/trunk/yarn/src/main/java/org/apache/hama/bsp/YARNBSPJob.java:[256,54]
cannot find symbol
symbol  : variable FinalApplicationStatus
location: class org.apache.hama.bsp.YARNBSPJob
[ERROR] /zonestorage/hudson_solaris/home/hudson/hudson-slave/workspace/Hama-Nightly/trunk/yarn/src/main/java/org/apache/hama/bsp/YARNBSPJob.java:[257,22]
cannot find symbol
symbol  : method getFinalApplicationStatus()
location: interface org.apache.hadoop.yarn.api.records.ApplicationReport
[ERROR] /zonestorage/hudson_solaris/home/hudson/hudson-slave/workspace/Hama-Nightly/trunk/yarn/src/main/java/org/apache/hama/bsp/YARNBSPJob.java:[257,54]
cannot find symbol
symbol  : variable FinalApplicationStatus
location: class org.apache.hama.bsp.YARNBSPJob
[ERROR] /zonestorage/hudson_solaris/home/hudson/hudson-slave/workspace/Hama-Nightly/trunk/yarn/src/main/java/org/apache/hama/bsp/YARNBSPJob.java:[258,22]
cannot find symbol
symbol  : method getFinalApplicationStatus()
location: interface org.apache.hadoop.yarn.api.records.ApplicationReport
[ERROR] /zonestorage/hudson_solaris/home/hudson/hudson-slave/workspace/Hama-Nightly/trunk/yarn/src/main/java/org/apache/hama/bsp/YARNBSPJob.java:[258,54]
cannot find symbol
symbol  : variable FinalApplicationStatus
location: class org.apache.hama.bsp.YARNBSPJob
[ERROR] /zonestorage/hudson_solaris/home/hudson/hudson-slave/workspace/Hama-Nightly/trunk/yarn/src/main/java/org/apache/hama/bsp/YARNBSPJob.java:[259,51]
cannot find symbol
symbol  : method getFinalApplicationStatus()
location: interface org.apache.hadoop.yarn.api.records.ApplicationReport
[ERROR] /zonestorage/hudson_solaris/home/hudson/hudson-slave/workspace/Hama-Nightly/trunk/yarn/src/main/java/org/apache/hama/bsp/YARNBSPJob.java:[276,19]
cannot find symbol
symbol  : method getFinalApplicationStatus()
location: interface org.apache.hadoop.yarn.api.records.ApplicationReport
[ERROR] /zonestorage/hudson_solaris/home/hudson/hudson-slave/workspace/Hama-Nightly/trunk/yarn/src/main/java/org/apache/hama/bsp/YARNBSPJob.java:[276,51]
cannot find symbol
symbol  : variable FinalApplicationStatus
location: class org.apache.hama.bsp.YARNBSPJob
[ERROR] /zonestorage/hudson_solaris/home/hudson/hudson-slave/workspace/Hama-Nightly/trunk/yarn/src/main/java/org/apache/hama/bsp/YARNBSPJob.java:[281,23]
cannot find symbol
symbol  : method getFinalApplicationStatus()
location: interface org.apache.hadoop.yarn.api.records.ApplicationReport
[ERROR] /zonestorage/hudson_solaris/home/hudson/hudson-slave/workspace/Hama-Nightly/trunk/yarn/src/main/java/org/apache/hama/bsp/BSPApplicationMaster.java:[203,46]
cannot find symbol
symbol  : variable APPLICATION_ATTEMPT_ID_ENV
location: interface org.apache.hadoop.yarn.api.ApplicationConstants
[ERROR] /zonestorage/hudson_solaris/home/hudson/hudson-slave/workspace/Hama-Nightly/trunk/yarn/src/main/java/org/apache/hama/bsp/BSPApplicationMaster.java:[208,33]
cannot find symbol
symbol  : variable APPLICATION_ATTEMPT_ID_ENV
location: interface org.apache.hadoop.yarn.api.ApplicationConstants
[ERROR] /zonestorage/hudson_solaris/home/hudson/hudson-slave/workspace/Hama-Nightly/trunk/yarn/src/main/java/org/apache/hama/bsp/BSPApplicationMaster.java:[240,45]
cannot find symbol
symbol  : variable FinalApplicationStatus
location: class org.apache.hama.bsp.BSPApplicationMaster
[ERROR] /zonestorage/hudson_solaris/home/hudson/hudson-slave/workspace/Hama-Nightly/trunk/yarn/src/main/java/org/apache/hama/bsp/BSPApplicationMaster.java:[243,45]
cannot find symbol
symbol  : variable FinalApplicationStatus
location: class org.apache.hama.bsp.BSPApplicationMaster
[ERROR] /zonestorage/hudson_solaris/home/hudson/hudson-slave/workspace/Hama-Nightly/trunk/yarn/src/main/java/org/apache/hama/bsp/BSPApplicationMaster.java:[246,45]
cannot find symbol
symbol  : variable FinalApplicationStatus
location: class org.apache.hama.bsp.BSPApplicationMaster
[ERROR] /zonestorage/hudson_solaris/home/hudson/hudson-slave/workspace/Hama-Nightly/trunk/yarn/src/main/java/org/apache/hama/bsp/BSPApplicationMaster.java:[249,45]
cannot find symbol
symbol  : variable FinalApplicationStatus
location: class org.apache.hama.bsp.BSPApplicationMaster
[INFO] 28 errors 
[INFO] -------------------------------------------------------------
[INFO] ------------------------------------------------------------------------
[INFO] Reactor Summary:
[INFO] 
[INFO] Apache Hama parent POM ............................ SUCCESS [3.076s]
[INFO] Apache Hama Core .................................. SUCCESS [2:42.934s]
[INFO] Apache Hama Graph Package ......................... SUCCESS [3.555s]
[INFO] Apache Hama Examples .............................. SUCCESS [6:12.387s]
[INFO] Apache Hama YARN .................................. FAILURE [58.055s]
[INFO] ------------------------------------------------------------------------
[INFO] BUILD FAILURE
[INFO] ------------------------------------------------------------------------
[INFO] Total time: 10:00.957s
[INFO] Finished at: Fri Oct 21 00:36:31 GMT+00:00 2011
[INFO] Final Memory: 43M/373M
[INFO] ------------------------------------------------------------------------
[ERROR] Failed to execute goal org.apache.maven.plugins:maven-compiler-plugin:2.3.2:compile
(default-compile) on project hama-yarn: Compilation failure: Compilation failure:
[ERROR] /zonestorage/hudson_solaris/home/hudson/hudson-slave/workspace/Hama-Nightly/trunk/yarn/src/main/java/org/apache/hama/bsp/YARNBSPJob.java:[41,49]
cannot find symbol
[ERROR] symbol  : class GetNewApplicationRequest
[ERROR] location: package org.apache.hadoop.yarn.api.protocolrecords
[ERROR] /zonestorage/hudson_solaris/home/hudson/hudson-slave/workspace/Hama-Nightly/trunk/yarn/src/main/java/org/apache/hama/bsp/YARNBSPJob.java:[42,49]
cannot find symbol
[ERROR] symbol  : class GetNewApplicationResponse
[ERROR] location: package org.apache.hadoop.yarn.api.protocolrecords
[ERROR] /zonestorage/hudson_solaris/home/hudson/hudson-slave/workspace/Hama-Nightly/trunk/yarn/src/main/java/org/apache/hama/bsp/YARNBSPJob.java:[43,49]
cannot find symbol
[ERROR] symbol  : class KillApplicationRequest
[ERROR] location: package org.apache.hadoop.yarn.api.protocolrecords
[ERROR] /zonestorage/hudson_solaris/home/hudson/hudson-slave/workspace/Hama-Nightly/trunk/yarn/src/main/java/org/apache/hama/bsp/YARNBSPJob.java:[49,41]
cannot find symbol
[ERROR] symbol  : class FinalApplicationStatus
[ERROR] location: package org.apache.hadoop.yarn.api.records
[ERROR] /zonestorage/hudson_solaris/home/hudson/hudson-slave/workspace/Hama-Nightly/trunk/yarn/src/main/java/org/apache/hama/bsp/BSPApplicationMaster.java:[48,41]
cannot find symbol
[ERROR] symbol  : class FinalApplicationStatus
[ERROR] location: package org.apache.hadoop.yarn.api.records
[ERROR] /zonestorage/hudson_solaris/home/hudson/hudson-slave/workspace/Hama-Nightly/trunk/yarn/src/main/java/org/apache/hama/bsp/JobImpl.java:[145,40]
cannot find symbol
[ERROR] symbol  : method newAllocateRequest(org.apache.hadoop.yarn.api.records.ApplicationAttemptId,int,float,java.util.List<org.apache.hadoop.yarn.api.records.ResourceRequest>,java.util.List<org.apache.hadoop.yarn.api.records.ContainerId>)
[ERROR] location: class org.apache.hadoop.yarn.util.BuilderUtils
[ERROR] /zonestorage/hudson_solaris/home/hudson/hudson-slave/workspace/Hama-Nightly/trunk/yarn/src/main/java/org/apache/hama/bsp/YARNBSPJob.java:[87,4]
cannot find symbol
[ERROR] symbol  : class KillApplicationRequest
[ERROR] location: class org.apache.hama.bsp.YARNBSPJob
[ERROR] /zonestorage/hudson_solaris/home/hudson/hudson-slave/workspace/Hama-Nightly/trunk/yarn/src/main/java/org/apache/hama/bsp/YARNBSPJob.java:[88,19]
cannot find symbol
[ERROR] symbol  : class KillApplicationRequest
[ERROR] location: class org.apache.hama.bsp.YARNBSPJob
[ERROR] /zonestorage/hudson_solaris/home/hudson/hudson-slave/workspace/Hama-Nightly/trunk/yarn/src/main/java/org/apache/hama/bsp/YARNBSPJob.java:[126,4]
cannot find symbol
[ERROR] symbol  : class GetNewApplicationRequest
[ERROR] location: class org.apache.hama.bsp.YARNBSPJob
[ERROR] /zonestorage/hudson_solaris/home/hudson/hudson-slave/workspace/Hama-Nightly/trunk/yarn/src/main/java/org/apache/hama/bsp/YARNBSPJob.java:[127,19]
cannot find symbol
[ERROR] symbol  : class GetNewApplicationRequest
[ERROR] location: class org.apache.hama.bsp.YARNBSPJob
[ERROR] /zonestorage/hudson_solaris/home/hudson/hudson-slave/workspace/Hama-Nightly/trunk/yarn/src/main/java/org/apache/hama/bsp/YARNBSPJob.java:[128,4]
cannot find symbol
[ERROR] symbol  : class GetNewApplicationResponse
[ERROR] location: class org.apache.hama.bsp.YARNBSPJob
[ERROR] /zonestorage/hudson_solaris/home/hudson/hudson-slave/workspace/Hama-Nightly/trunk/yarn/src/main/java/org/apache/hama/bsp/YARNBSPJob.java:[255,22]
cannot find symbol
[ERROR] symbol  : method getFinalApplicationStatus()
[ERROR] location: interface org.apache.hadoop.yarn.api.records.ApplicationReport
[ERROR] /zonestorage/hudson_solaris/home/hudson/hudson-slave/workspace/Hama-Nightly/trunk/yarn/src/main/java/org/apache/hama/bsp/YARNBSPJob.java:[256,22]
cannot find symbol
[ERROR] symbol  : method getFinalApplicationStatus()
[ERROR] location: interface org.apache.hadoop.yarn.api.records.ApplicationReport
[ERROR] /zonestorage/hudson_solaris/home/hudson/hudson-slave/workspace/Hama-Nightly/trunk/yarn/src/main/java/org/apache/hama/bsp/YARNBSPJob.java:[256,54]
cannot find symbol
[ERROR] symbol  : variable FinalApplicationStatus
[ERROR] location: class org.apache.hama.bsp.YARNBSPJob
[ERROR] /zonestorage/hudson_solaris/home/hudson/hudson-slave/workspace/Hama-Nightly/trunk/yarn/src/main/java/org/apache/hama/bsp/YARNBSPJob.java:[257,22]
cannot find symbol
[ERROR] symbol  : method getFinalApplicationStatus()
[ERROR] location: interface org.apache.hadoop.yarn.api.records.ApplicationReport
[ERROR] /zonestorage/hudson_solaris/home/hudson/hudson-slave/workspace/Hama-Nightly/trunk/yarn/src/main/java/org/apache/hama/bsp/YARNBSPJob.java:[257,54]
cannot find symbol
[ERROR] symbol  : variable FinalApplicationStatus
[ERROR] location: class org.apache.hama.bsp.YARNBSPJob
[ERROR] /zonestorage/hudson_solaris/home/hudson/hudson-slave/workspace/Hama-Nightly/trunk/yarn/src/main/java/org/apache/hama/bsp/YARNBSPJob.java:[258,22]
cannot find symbol
[ERROR] symbol  : method getFinalApplicationStatus()
[ERROR] location: interface org.apache.hadoop.yarn.api.records.ApplicationReport
[ERROR] /zonestorage/hudson_solaris/home/hudson/hudson-slave/workspace/Hama-Nightly/trunk/yarn/src/main/java/org/apache/hama/bsp/YARNBSPJob.java:[258,54]
cannot find symbol
[ERROR] symbol  : variable FinalApplicationStatus
[ERROR] location: class org.apache.hama.bsp.YARNBSPJob
[ERROR] /zonestorage/hudson_solaris/home/hudson/hudson-slave/workspace/Hama-Nightly/trunk/yarn/src/main/java/org/apache/hama/bsp/YARNBSPJob.java:[259,51]
cannot find symbol
[ERROR] symbol  : method getFinalApplicationStatus()
[ERROR] location: interface org.apache.hadoop.yarn.api.records.ApplicationReport
[ERROR] /zonestorage/hudson_solaris/home/hudson/hudson-slave/workspace/Hama-Nightly/trunk/yarn/src/main/java/org/apache/hama/bsp/YARNBSPJob.java:[276,19]
cannot find symbol
[ERROR] symbol  : method getFinalApplicationStatus()
[ERROR] location: interface org.apache.hadoop.yarn.api.records.ApplicationReport
[ERROR] /zonestorage/hudson_solaris/home/hudson/hudson-slave/workspace/Hama-Nightly/trunk/yarn/src/main/java/org/apache/hama/bsp/YARNBSPJob.java:[276,51]
cannot find symbol
[ERROR] symbol  : variable FinalApplicationStatus
[ERROR] location: class org.apache.hama.bsp.YARNBSPJob
[ERROR] /zonestorage/hudson_solaris/home/hudson/hudson-slave/workspace/Hama-Nightly/trunk/yarn/src/main/java/org/apache/hama/bsp/YARNBSPJob.java:[281,23]
cannot find symbol
[ERROR] symbol  : method getFinalApplicationStatus()
[ERROR] location: interface org.apache.hadoop.yarn.api.records.ApplicationReport
[ERROR] /zonestorage/hudson_solaris/home/hudson/hudson-slave/workspace/Hama-Nightly/trunk/yarn/src/main/java/org/apache/hama/bsp/BSPApplicationMaster.java:[203,46]
cannot find symbol
[ERROR] symbol  : variable APPLICATION_ATTEMPT_ID_ENV
[ERROR] location: interface org.apache.hadoop.yarn.api.ApplicationConstants
[ERROR] /zonestorage/hudson_solaris/home/hudson/hudson-slave/workspace/Hama-Nightly/trunk/yarn/src/main/java/org/apache/hama/bsp/BSPApplicationMaster.java:[208,33]
cannot find symbol
[ERROR] symbol  : variable APPLICATION_ATTEMPT_ID_ENV
[ERROR] location: interface org.apache.hadoop.yarn.api.ApplicationConstants
[ERROR] /zonestorage/hudson_solaris/home/hudson/hudson-slave/workspace/Hama-Nightly/trunk/yarn/src/main/java/org/apache/hama/bsp/BSPApplicationMaster.java:[240,45]
cannot find symbol
[ERROR] symbol  : variable FinalApplicationStatus
[ERROR] location: class org.apache.hama.bsp.BSPApplicationMaster
[ERROR] /zonestorage/hudson_solaris/home/hudson/hudson-slave/workspace/Hama-Nightly/trunk/yarn/src/main/java/org/apache/hama/bsp/BSPApplicationMaster.java:[243,45]
cannot find symbol
[ERROR] symbol  : variable FinalApplicationStatus
[ERROR] location: class org.apache.hama.bsp.BSPApplicationMaster
[ERROR] /zonestorage/hudson_solaris/home/hudson/hudson-slave/workspace/Hama-Nightly/trunk/yarn/src/main/java/org/apache/hama/bsp/BSPApplicationMaster.java:[246,45]
cannot find symbol
[ERROR] symbol  : variable FinalApplicationStatus
[ERROR] location: class org.apache.hama.bsp.BSPApplicationMaster
[ERROR] /zonestorage/hudson_solaris/home/hudson/hudson-slave/workspace/Hama-Nightly/trunk/yarn/src/main/java/org/apache/hama/bsp/BSPApplicationMaster.java:[249,45]
cannot find symbol
[ERROR] symbol  : variable FinalApplicationStatus
[ERROR] location: class org.apache.hama.bsp.BSPApplicationMaster
[ERROR] -> [Help 1]
[ERROR] 
[ERROR] To see the full stack trace of the errors, re-run Maven with the -e switch.
[ERROR] Re-run Maven using the -X switch to enable full debug logging.
[ERROR] 
[ERROR] For more information about the errors and possible solutions, please read the following
articles:
[ERROR] [Help 1] http://cwiki.apache.org/confluence/display/MAVEN/MojoFailureException
[ERROR] 
[ERROR] After correcting the problems, you can resume the build with the command
[ERROR]   mvn <goals> -rf :hama-yarn
Build step 'Invoke top-level Maven targets' marked build as failure
Updating HAMA-457


Mime
View raw message