incubator-hama-dev mailing list archives

Site index · List index
Message view « Date » · « Thread »
Top « Date » · « Thread »
From Apache Jenkins Server <jenk...@builds.apache.org>
Subject Build failed in Jenkins: Hama-Patch #350
Date Mon, 29 Aug 2011 02:42:29 GMT
See <https://builds.apache.org/job/Hama-Patch/350/>

------------------------------------------
Started by user edwardyoon
Building remotely on solaris2
Updating https://svn.apache.org/repos/asf/incubator/hama/trunk
ERROR: Failed to update https://svn.apache.org/repos/asf/incubator/hama/trunk
org.tmatesoft.svn.core.SVNException: svn: REPORT /repos/asf/!svn/vcc/default failed
	at org.tmatesoft.svn.core.internal.io.dav.http.HTTPConnection.request(HTTPConnection.java:291)
	at org.tmatesoft.svn.core.internal.io.dav.http.HTTPConnection.request(HTTPConnection.java:276)
	at org.tmatesoft.svn.core.internal.io.dav.http.HTTPConnection.request(HTTPConnection.java:264)
	at org.tmatesoft.svn.core.internal.io.dav.DAVConnection.doReport(DAVConnection.java:266)
	at org.tmatesoft.svn.core.internal.io.dav.DAVRepository.runReport(DAVRepository.java:1263)
	at org.tmatesoft.svn.core.internal.io.dav.DAVRepository.update(DAVRepository.java:820)
	at org.tmatesoft.svn.core.wc.SVNUpdateClient.update(SVNUpdateClient.java:564)
	at org.tmatesoft.svn.core.wc.SVNUpdateClient.doUpdate(SVNUpdateClient.java:401)
	at hudson.scm.subversion.UpdateUpdater$TaskImpl.perform(UpdateUpdater.java:136)
	at hudson.scm.subversion.WorkspaceUpdater$UpdateTask.delegateTo(WorkspaceUpdater.java:136)
	at hudson.scm.SubversionSCM$CheckOutTask.perform(SubversionSCM.java:773)
	at hudson.scm.SubversionSCM$CheckOutTask.invoke(SubversionSCM.java:754)
	at hudson.scm.SubversionSCM$CheckOutTask.invoke(SubversionSCM.java:738)
	at hudson.FilePath$FileCallableWrapper.call(FilePath.java:1994)
	at hudson.remoting.UserRequest.perform(UserRequest.java:118)
	at hudson.remoting.UserRequest.perform(UserRequest.java:48)
	at hudson.remoting.Request$2.run(Request.java:287)
	at java.util.concurrent.Executors$RunnableAdapter.call(Executors.java:417)
	at java.util.concurrent.FutureTask$Sync.innerRun(FutureTask.java:269)
	at java.util.concurrent.FutureTask.run(FutureTask.java:123)
	at java.util.concurrent.ThreadPoolExecutor$Worker.runTask(ThreadPoolExecutor.java:650)
	at java.util.concurrent.ThreadPoolExecutor$Worker.run(ThreadPoolExecutor.java:675)
	at java.lang.Thread.run(Thread.java:595)
Caused by: org.tmatesoft.svn.core.SVNErrorMessage: svn: REPORT /repos/asf/!svn/vcc/default
failed
	at org.tmatesoft.svn.core.SVNErrorMessage.create(SVNErrorMessage.java:200)
	at org.tmatesoft.svn.core.SVNErrorMessage.create(SVNErrorMessage.java:146)
	at org.tmatesoft.svn.core.SVNErrorMessage.create(SVNErrorMessage.java:89)
	... 23 more
Caused by: org.tmatesoft.svn.core.SVNException: svn: REPORT request failed on '/repos/asf/!svn/vcc/default'
svn: Directory '/zonestorage/hudson<https://builds.apache.org/job/Hama-Patch/ws/trunk/src/site'>
is missing
svn: Directory '/zonestorage/hudson<https://builds.apache.org/job/Hama-Patch/ws/trunk/src/site'>
is missing
	at org.tmatesoft.svn.core.internal.wc.SVNErrorManager.error(SVNErrorManager.java:64)
	at org.tmatesoft.svn.core.internal.wc.SVNErrorManager.error(SVNErrorManager.java:51)
	at org.tmatesoft.svn.core.internal.io.dav.http.HTTPConnection._request(HTTPConnection.java:638)
	at org.tmatesoft.svn.core.internal.io.dav.http.HTTPConnection.request(HTTPConnection.java:285)
	... 22 more
Caused by: org.tmatesoft.svn.core.SVNErrorMessage: svn: REPORT request failed on '/repos/asf/!svn/vcc/default'
	at org.tmatesoft.svn.core.SVNErrorMessage.create(SVNErrorMessage.java:200)
	at org.tmatesoft.svn.core.SVNErrorMessage.create(SVNErrorMessage.java:146)
	at org.tmatesoft.svn.core.SVNErrorMessage.create(SVNErrorMessage.java:89)
	at org.tmatesoft.svn.core.SVNErrorMessage.wrap(SVNErrorMessage.java:366)
	... 24 more
Caused by: org.tmatesoft.svn.core.SVNErrorMessage: svn: Directory '/zonestorage/hudson<https://builds.apache.org/job/Hama-Patch/ws/trunk/src/site'>
is missing
	at org.tmatesoft.svn.core.SVNErrorMessage.create(SVNErrorMessage.java:163)
	at org.tmatesoft.svn.core.SVNErrorMessage.create(SVNErrorMessage.java:118)
	at org.tmatesoft.svn.core.internal.wc.admin.SVNWCAccess.retrieve(SVNWCAccess.java:714)
	at org.tmatesoft.svn.core.internal.wc.SVNUpdateEditor$SVNDirectoryInfo.getAdminArea(SVNUpdateEditor.java:2305)
	at org.tmatesoft.svn.core.internal.wc.SVNUpdateEditor.createFileInfo(SVNUpdateEditor.java:2101)
	at org.tmatesoft.svn.core.internal.wc.SVNUpdateEditor.addFile(SVNUpdateEditor.java:1379)
	at org.tmatesoft.svn.core.internal.wc.SVNUpdateEditor.addFile(SVNUpdateEditor.java:1134)
	at org.tmatesoft.svn.core.internal.wc.SVNAmbientDepthFilterEditor.addFile(SVNAmbientDepthFilterEditor.java:103)
	at org.tmatesoft.svn.core.internal.wc.SVNCancellableEditor.addFile(SVNCancellableEditor.java:107)
	at org.tmatesoft.svn.core.internal.io.dav.handlers.DAVEditorHandler.startElement(DAVEditorHandler.java:398)
	at org.tmatesoft.svn.core.internal.io.dav.handlers.BasicDAVHandler.startElement(BasicDAVHandler.java:85)
	at org.apache.xerces.parsers.AbstractSAXParser.startElement(Unknown Source)
	at org.apache.xerces.impl.XMLNSDocumentScannerImpl.scanStartElement(Unknown Source)
	at org.apache.xerces.impl.XMLDocumentFragmentScannerImpl$FragmentContentDispatcher.dispatch(Unknown
Source)
	at org.apache.xerces.impl.XMLDocumentFragmentScannerImpl.scanDocument(Unknown Source)
	at org.apache.xerces.parsers.XML11Configuration.parse(Unknown Source)
	at org.apache.xerces.parsers.XML11Configuration.parse(Unknown Source)
	at org.apache.xerces.parsers.XMLParser.parse(Unknown Source)
	at org.apache.xerces.parsers.AbstractSAXParser.parse(Unknown Source)
	at org.apache.xerces.jaxp.SAXParserImpl$JAXPSAXParser.parse(Unknown Source)
	at org.tmatesoft.svn.core.internal.io.dav.http.HTTPConnection.readData(HTTPConnection.java:754)
	at org.tmatesoft.svn.core.internal.io.dav.http.HTTPConnection.readData(HTTPConnection.java:719)
	at org.tmatesoft.svn.core.internal.io.dav.http.HTTPRequest.dispatch(HTTPRequest.java:216)
	at org.tmatesoft.svn.core.internal.io.dav.http.HTTPConnection._request(HTTPConnection.java:364)
	... 23 more
Caused by: org.tmatesoft.svn.core.SVNErrorMessage: svn: Directory '/zonestorage/hudson<https://builds.apache.org/job/Hama-Patch/ws/trunk/src/site'>
is missing
	at org.tmatesoft.svn.core.SVNErrorMessage.create(SVNErrorMessage.java:163)
	at org.tmatesoft.svn.core.SVNErrorMessage.create(SVNErrorMessage.java:118)
	at org.tmatesoft.svn.core.internal.wc.admin.SVNWCAccess.retrieve(SVNWCAccess.java:713)
	... 44 more
[FINDBUGS] Skipping publisher since build result is FAILURE
Archiving artifacts
[description-setter] Could not determine description.


Mime
View raw message