incubator-hama-dev mailing list archives

Site index · List index
Message view « Date » · « Thread »
Top « Date » · « Thread »
From Apache Jenkins Server <hud...@hudson.apache.org>
Subject Build failed in Jenkins: Hama-Patch #324
Date Thu, 28 Apr 2011 07:10:28 GMT
See <https://builds.apache.org/hudson/job/Hama-Patch/324/>

------------------------------------------
Started by remote host 127.0.0.1
Building remotely on solaris2
Updating https://svn.apache.org/repos/asf/incubator/hama/trunk
At revision 1097336
no change for https://svn.apache.org/repos/asf/incubator/hama/trunk since the previous build
[Hama-Patch] $ /bin/bash -xe /var/tmp/hudson19831.sh
+ set +x


======================================================================
======================================================================
    Testing patch for HAMA-381.
======================================================================
======================================================================


Reverted 'src/test/org/apache/hama/bsp/TestBSPMasterGroomServer.java'
At revision 1097336.
HAMA-381 patch is being downloaded at Thu Apr 28 03:10:16 EDT 2011 from
http://issues.apache.org/jira/secure/attachment/12477620/test2.patch


======================================================================
======================================================================
    Pre-building trunk to determine trunk number
    of release audit, javac, and Findbugs warnings.
======================================================================
======================================================================




======================================================================
======================================================================
    Checking there are no @author tags in the patch.
======================================================================
======================================================================


There appear to be 0 @author tags in the patch.


======================================================================
======================================================================
    Checking there are new or changed tests in the patch.
======================================================================
======================================================================


There appear to be 3 test files referenced in the patch.


======================================================================
======================================================================
    Applying patch.
======================================================================
======================================================================


(Stripping trailing CRs from patch.)
patching file src/test/org/apache/hama/bsp/TestBSPMasterGroomServer.java


======================================================================
======================================================================
    Running Hama tests.
======================================================================
======================================================================


/usr/bin/kill -9 8068
kill: 8068: no such process
[INFO] Scanning for projects...
[INFO] ------------------------------------------------------------------------
[ERROR] BUILD FAILURE
[INFO] ------------------------------------------------------------------------
[INFO] Unable to build project '/zonestorage/hudson<https://builds.apache.org/hudson/job/Hama-Patch/ws/trunk/pom.xml;>
it requires Maven version 3.0
[INFO] ------------------------------------------------------------------------
[INFO] For more information, run Maven with the -e switch
[INFO] ------------------------------------------------------------------------
[INFO] Total time: < 1 second
[INFO] Finished at: Thu Apr 28 03:10:18 EDT 2011
[INFO] Final Memory: 2M/79M
[INFO] ------------------------------------------------------------------------


======================================================================
======================================================================
    Adding comment to Jira.
======================================================================
======================================================================


-1 overall.  Here are the results of testing the latest attachment 
http://issues.apache.org/jira/secure/attachment/12477620/test2.patch
against trunk revision 1097331.

    @author +1.  The patch does not contain any @author tags.

    tests included +1.  The patch appears to include 3 new or modified tests.

    core tests -1.  The patch failed core unit tests.

Changes : http://hudson.zones.apache.org/hudson/job/Hama-Patch/324/changes/
Console output: http://builds.apache.org/hudson/job/Hama-Patch/324/console

This message is automatically generated.


======================================================================
======================================================================
    Finished build.
======================================================================
======================================================================


[FINDBUGS] Skipping publisher since build result is FAILURE
Archiving artifacts
Recording test results
Description set: HAMA-381


Mime
View raw message