incubator-hama-dev mailing list archives

Site index · List index
Message view « Date » · « Thread »
Top « Date » · « Thread »
From Apache Jenkins Server <hud...@hudson.apache.org>
Subject Build failed in Jenkins: Hama-Nightly #187
Date Sat, 30 Apr 2011 23:05:19 GMT
See <https://builds.apache.org/hudson/job/Hama-Nightly/187/>

------------------------------------------
[...truncated 1242 lines...]
java.lang.InterruptedException
	at java.lang.Object.wait(Native Method)
	at java.lang.Object.wait(Object.java:485)
	at org.apache.zookeeper.ClientCnxn.submitRequest(ClientCnxn.java:1278)
	at org.apache.zookeeper.ZooKeeper.delete(ZooKeeper.java:726)
	at org.apache.hama.bsp.BSPPeer.leaveBarrier(BSPPeer.java:261)
	at org.apache.hama.bsp.BSPPeer.sync(BSPPeer.java:202)
	at org.apache.hama.bsp.TestBSPPeer$BSPPeerThread.runTest(TestBSPPeer.java:132)
	at net.sourceforge.groboutils.junit.v1.TestRunnable.run(TestRunnable.java:154)
	at java.lang.Thread.run(Thread.java:662)
11/04/30 19:05:17 INFO v1.TestRunnable: [localhost:30009] verifying 0 messages at 0 round
org.apache.zookeeper.KeeperException$ConnectionLossException: KeeperErrorCode = ConnectionLoss
for /bsp/localhost:30008








java.lang.InterruptedException
	at java.lang.Object.wait(Native Method)
	at java.lang.Object.wait(Object.java:485)
	at org.apache.zookeeper.ClientCnxn.submitRequest(ClientCnxn.java:1278)
	at org.apache.zookeeper.ZooKeeper.delete(ZooKeeper.java:726)
	at org.apache.hama.bsp.BSPPeer.leaveBarrier(BSPPeer.java:261)
	at org.apache.hama.bsp.BSPPeer.sync(BSPPeer.java:202)
	at org.apache.hama.bsp.TestBSPPeer$BSPPeerThread.runTest(TestBSPPeer.java:132)
	at net.sourceforge.groboutils.junit.v1.TestRunnable.run(TestRunnable.java:154)
	at java.lang.Thread.run(Thread.java:662)
11/04/30 19:05:17 INFO v1.TestRunnable: [localhost:30006] verifying 0 messages at 0 round
org.apache.zookeeper.KeeperException$ConnectionLossException: KeeperErrorCode = ConnectionLoss
for /bsp/localhost:30005








11/04/30 19:05:17 WARN v1.MultiThreadedTestRunner: A test thread caused an exception.
junit.framework.AssertionFailedError: expected:<10> but was:<0>
	at junit.framework.Assert.fail(Assert.java:47)
	at junit.framework.Assert.failNotEquals(Assert.java:282)
	at junit.framework.Assert.assertEquals(Assert.java:64)
	at junit.framework.Assert.assertEquals(Assert.java:201)
	at junit.framework.Assert.assertEquals(Assert.java:207)
	at org.apache.hama.bsp.TestBSPPeer$BSPPeerThread.verifyPayload(TestBSPPeer.java:153)
	at org.apache.hama.bsp.TestBSPPeer$BSPPeerThread.runTest(TestBSPPeer.java:141)
	at net.sourceforge.groboutils.junit.v1.TestRunnable.run(TestRunnable.java:154)
	at java.lang.Thread.run(Thread.java:662)
11/04/30 19:05:17 INFO v1.TestRunnable: Ended test thread 7
11/04/30 19:05:17 INFO v1.TestRunnable: [localhost:30005] verifying 0 messages at 0 round
java.lang.InterruptedException
	at java.lang.Object.wait(Native Method)
	at java.lang.Object.wait(Object.java:485)
	at org.apache.zookeeper.ClientCnxn.submitRequest(ClientCnxn.java:1278)
	at org.apache.zookeeper.ZooKeeper.delete(ZooKeeper.java:726)
	at org.apache.hama.bsp.BSPPeer.leaveBarrier(BSPPeer.java:261)
	at org.apache.hama.bsp.BSPPeer.sync(BSPPeer.java:202)
	at org.apache.hama.bsp.TestBSPPeer$BSPPeerThread.runTest(TestBSPPeer.java:132)
	at net.sourceforge.groboutils.junit.v1.TestRunnable.run(TestRunnable.java:154)
	at java.lang.Thread.run(Thread.java:662)
11/04/30 19:05:17 WARN v1.MultiThreadedTestRunner: A test thread caused an exception.
junit.framework.AssertionFailedError: expected:<10> but was:<0>
	at junit.framework.Assert.fail(Assert.java:47)
	at junit.framework.Assert.failNotEquals(Assert.java:282)
	at junit.framework.Assert.assertEquals(Assert.java:64)
	at junit.framework.Assert.assertEquals(Assert.java:201)
	at junit.framework.Assert.assertEquals(Assert.java:207)
	at org.apache.hama.bsp.TestBSPPeer$BSPPeerThread.verifyPayload(TestBSPPeer.java:153)
	at org.apache.hama.bsp.TestBSPPeer$BSPPeerThread.runTest(TestBSPPeer.java:141)
	at net.sourceforge.groboutils.junit.v1.TestRunnable.run(TestRunnable.java:154)
	at java.lang.Thread.run(Thread.java:662)
11/04/30 19:05:17 INFO v1.TestRunnable: [localhost:30003] verifying 0 messages at 0 round
11/04/30 19:05:17 WARN v1.MultiThreadedTestRunner: A test thread caused an exception.
junit.framework.AssertionFailedError: expected:<10> but was:<0>
	at junit.framework.Assert.fail(Assert.java:47)
	at junit.framework.Assert.failNotEquals(Assert.java:282)
	at junit.framework.Assert.assertEquals(Assert.java:64)
	at junit.framework.Assert.assertEquals(Assert.java:201)
	at junit.framework.Assert.assertEquals(Assert.java:207)
	at org.apache.hama.bsp.TestBSPPeer$BSPPeerThread.verifyPayload(TestBSPPeer.java:153)
	at org.apache.hama.bsp.TestBSPPeer$BSPPeerThread.runTest(TestBSPPeer.java:141)
	at net.sourceforge.groboutils.junit.v1.TestRunnable.run(TestRunnable.java:154)
	at java.lang.Thread.run(Thread.java:662)
11/04/30 19:05:17 INFO v1.TestRunnable: Ended test thread 6
11/04/30 19:05:17 WARN v1.MultiThreadedTestRunner: A test thread caused an exception.
junit.framework.AssertionFailedError: expected:<10> but was:<0>
	at junit.framework.Assert.fail(Assert.java:47)
	at junit.framework.Assert.failNotEquals(Assert.java:282)
	at junit.framework.Assert.assertEquals(Assert.java:64)
	at junit.framework.Assert.assertEquals(Assert.java:201)
	at junit.framework.Assert.assertEquals(Assert.java:207)
	at org.apache.hama.bsp.TestBSPPeer$BSPPeerThread.verifyPayload(TestBSPPeer.java:153)
	at org.apache.hama.bsp.TestBSPPeer$BSPPeerThread.runTest(TestBSPPeer.java:141)
	at net.sourceforge.groboutils.junit.v1.TestRunnable.run(TestRunnable.java:154)
	at java.lang.Thread.run(Thread.java:662)
11/04/30 19:05:17 INFO v1.TestRunnable: Ended test thread 8
11/04/30 19:05:17 WARN v1.MultiThreadedTestRunner: A test thread caused an exception.
junit.framework.AssertionFailedError: expected:<10> but was:<0>
	at junit.framework.Assert.fail(Assert.java:47)
	at junit.framework.Assert.failNotEquals(Assert.java:282)
	at junit.framework.Assert.assertEquals(Assert.java:64)
	at junit.framework.Assert.assertEquals(Assert.java:201)
	at junit.framework.Assert.assertEquals(Assert.java:207)
	at org.apache.hama.bsp.TestBSPPeer$BSPPeerThread.verifyPayload(TestBSPPeer.java:153)
	at org.apache.hama.bsp.TestBSPPeer$BSPPeerThread.runTest(TestBSPPeer.java:141)
	at net.sourceforge.groboutils.junit.v1.TestRunnable.run(TestRunnable.java:154)
	at java.lang.Thread.run(Thread.java:662)
11/04/30 19:05:17 INFO v1.TestRunnable: Ended test thread 9
11/04/30 19:05:17 WARN v1.MultiThreadedTestRunner: A test thread caused an exception.
junit.framework.AssertionFailedError: expected:<10> but was:<0>
	at junit.framework.Assert.fail(Assert.java:47)
	at junit.framework.Assert.failNotEquals(Assert.java:282)
	at junit.framework.Assert.assertEquals(Assert.java:64)
	at junit.framework.Assert.assertEquals(Assert.java:201)
	at junit.framework.Assert.assertEquals(Assert.java:207)
	at org.apache.hama.bsp.TestBSPPeer$BSPPeerThread.verifyPayload(TestBSPPeer.java:153)
	at org.apache.hama.bsp.TestBSPPeer$BSPPeerThread.runTest(TestBSPPeer.java:141)
	at net.sourceforge.groboutils.junit.v1.TestRunnable.run(TestRunnable.java:154)
	at java.lang.Thread.run(Thread.java:662)
11/04/30 19:05:17 INFO v1.TestRunnable: Ended test thread 1
java.lang.InterruptedException
	at java.lang.Object.wait(Native Method)
	at java.lang.Object.wait(Object.java:485)
	at org.apache.zookeeper.ClientCnxn.submitRequest(ClientCnxn.java:1278)
	at org.apache.zookeeper.ZooKeeper.delete(ZooKeeper.java:726)
	at org.apache.hama.bsp.BSPPeer.leaveBarrier(BSPPeer.java:261)
	at org.apache.hama.bsp.BSPPeer.sync(BSPPeer.java:202)
	at org.apache.hama.bsp.TestBSPPeer$BSPPeerThread.runTest(TestBSPPeer.java:132)
	at net.sourceforge.groboutils.junit.v1.TestRunnable.run(TestRunnable.java:154)
	at java.lang.Thread.run(Thread.java:662)
11/04/30 19:05:17 INFO v1.TestRunnable: [localhost:30002] verifying 0 messages at 0 round
11/04/30 19:05:17 WARN v1.MultiThreadedTestRunner: A test thread caused an exception.
junit.framework.AssertionFailedError: expected:<10> but was:<0>
	at junit.framework.Assert.fail(Assert.java:47)
	at junit.framework.Assert.failNotEquals(Assert.java:282)
	at junit.framework.Assert.assertEquals(Assert.java:64)
	at junit.framework.Assert.assertEquals(Assert.java:201)
	at junit.framework.Assert.assertEquals(Assert.java:207)
	at org.apache.hama.bsp.TestBSPPeer$BSPPeerThread.verifyPayload(TestBSPPeer.java:153)
	at org.apache.hama.bsp.TestBSPPeer$BSPPeerThread.runTest(TestBSPPeer.java:141)
	at net.sourceforge.groboutils.junit.v1.TestRunnable.run(TestRunnable.java:154)
	at java.lang.Thread.run(Thread.java:662)
11/04/30 19:05:17 INFO v1.TestRunnable: Ended test thread 2
org.apache.zookeeper.KeeperException$ConnectionLossException: KeeperErrorCode = ConnectionLoss
for /bsp/localhost:30004








11/04/30 19:05:17 WARN v1.MultiThreadedTestRunner: A test thread caused an exception.
junit.framework.AssertionFailedError: expected:<10> but was:<0>
	at junit.framework.Assert.fail(Assert.java:47)
	at junit.framework.Assert.failNotEquals(Assert.java:282)
	at junit.framework.Assert.assertEquals(Assert.java:64)
	at junit.framework.Assert.assertEquals(Assert.java:201)
	at junit.framework.Assert.assertEquals(Assert.java:207)
	at org.apache.hama.bsp.TestBSPPeer$BSPPeerThread.verifyPayload(TestBSPPeer.java:153)
	at org.apache.hama.bsp.TestBSPPeer$BSPPeerThread.runTest(TestBSPPeer.java:141)
	at net.sourceforge.groboutils.junit.v1.TestRunnable.run(TestRunnable.java:154)
	at java.lang.Thread.run(Thread.java:662)
11/04/30 19:05:17 INFO v1.TestRunnable: Ended test thread 4
11/04/30 19:05:17 WARN v1.MultiThreadedTestRunner: A test thread caused an exception.
junit.framework.AssertionFailedError: expected:<10> but was:<0>
	at junit.framework.Assert.fail(Assert.java:47)
	at junit.framework.Assert.failNotEquals(Assert.java:282)
	at junit.framework.Assert.assertEquals(Assert.java:64)
	at junit.framework.Assert.assertEquals(Assert.java:201)
	at junit.framework.Assert.assertEquals(Assert.java:207)
	at org.apache.hama.bsp.TestBSPPeer$BSPPeerThread.verifyPayload(TestBSPPeer.java:153)
	at org.apache.hama.bsp.TestBSPPeer$BSPPeerThread.runTest(TestBSPPeer.java:141)
	at net.sourceforge.groboutils.junit.v1.TestRunnable.run(TestRunnable.java:154)
	at java.lang.Thread.run(Thread.java:662)
11/04/30 19:05:17 INFO v1.TestRunnable: Ended test thread 3
11/04/30 19:05:17 INFO v1.TestRunnable: Ended test thread 5
11/04/30 19:05:17 INFO ipc.Server: Stopping server on 40000
11/04/30 19:05:17 INFO ipc.Server: Stopping IPC Server listener on 40000
11/04/30 19:05:17 INFO ipc.Server: Stopping server on 59713
11/04/30 19:05:17 INFO ipc.Server: Stopping server on 59813
11/04/30 19:05:17 INFO ipc.Server: Stopping server on 59715
11/04/30 19:05:17 INFO ipc.Server: Stopping server on 59719
11/04/30 19:05:17 INFO ipc.Server: Stopping server on 59819
11/04/30 19:05:17 INFO ipc.Server: Stopping server on 59721
11/04/30 19:05:17 INFO ipc.Server: IPC Server handler 0 on 40000: exiting
11/04/30 19:05:17 INFO ipc.Server: Stopping IPC Server listener on 59713
11/04/30 19:05:17 INFO ipc.Server: IPC Server handler 1 on 59715: exiting
11/04/30 19:05:17 INFO ipc.Server: IPC Server handler 3 on 59715: exiting
11/04/30 19:05:17 INFO ipc.Server: Stopping IPC Server listener on 59721
11/04/30 19:05:17 INFO ipc.Server: IPC Server handler 0 on 59713: exiting
11/04/30 19:05:17 INFO bsp.BSPMaster: Stopped RPC Master server.
11/04/30 19:05:17 INFO ipc.Server: Stopping IPC Server Responder
11/04/30 19:05:17 INFO ipc.Server: IPC Server handler 8 on 59721: exiting
11/04/30 19:05:17 INFO ipc.Server: IPC Server handler 6 on 59721: exiting
11/04/30 19:05:17 INFO ipc.Server: IPC Server handler 4 on 59721: exiting
11/04/30 19:05:17 INFO ipc.Server: IPC Server handler 2 on 59721: exiting
11/04/30 19:05:17 INFO ipc.Server: Stopping IPC Server Responder
11/04/30 19:05:17 INFO ipc.Server: IPC Server handler 0 on 59819: exiting
11/04/30 19:05:17 INFO ipc.Server: Stopping IPC Server listener on 59719
11/04/30 19:05:17 INFO ipc.Server: IPC Server handler 9 on 59721: exiting
11/04/30 19:05:17 INFO ipc.Server: IPC Server handler 7 on 59721: exiting
11/04/30 19:05:17 INFO ipc.Server: IPC Server handler 0 on 59719: exiting
11/04/30 19:05:17 INFO ipc.Server: Stopping IPC Server Responder
11/04/30 19:05:17 INFO ipc.Server: IPC Server handler 5 on 59721: exiting
11/04/30 19:05:17 INFO ipc.Server: IPC Server handler 8 on 59715: exiting
11/04/30 19:05:17 INFO ipc.Server: IPC Server handler 3 on 59721: exiting
11/04/30 19:05:17 INFO ipc.Server: IPC Server handler 6 on 59715: exiting
11/04/30 19:05:17 INFO ipc.Server: IPC Server handler 4 on 59715: exiting
11/04/30 19:05:17 INFO ipc.Server: IPC Server handler 1 on 59721: exiting
11/04/30 19:05:17 INFO ipc.Server: IPC Server handler 2 on 59715: exiting
11/04/30 19:05:17 INFO ipc.Server: IPC Server handler 0 on 59721: exiting
11/04/30 19:05:17 INFO ipc.Server: IPC Server handler 0 on 59715: exiting
11/04/30 19:05:17 INFO ipc.Server: Stopping IPC Server listener on 59819
11/04/30 19:05:17 INFO ipc.Server: IPC Server handler 0 on 59813: exiting
11/04/30 19:05:17 INFO ipc.Server: Stopping IPC Server Responder
11/04/30 19:05:17 INFO ipc.Server: IPC Server handler 9 on 59715: exiting
11/04/30 19:05:17 INFO ipc.Server: IPC Server handler 7 on 59715: exiting
11/04/30 19:05:17 INFO ipc.Server: Stopping IPC Server Responder
11/04/30 19:05:17 INFO ipc.Server: IPC Server handler 5 on 59715: exiting
Tests run: 1, Failures: 1, Errors: 0, Skipped: 0, Time elapsed: 26.386 sec <<< FAILURE!

Results :

Failed tests: 
  testSync(org.apache.hama.bsp.TestBSPPeer)

Tests run: 22, Failures: 1, Errors: 0, Skipped: 0

[INFO] ------------------------------------------------------------------------
[INFO] BUILD FAILURE
[INFO] ------------------------------------------------------------------------
[INFO] Total time: 1:56.496s
[INFO] Finished at: Sat Apr 30 19:05:18 EDT 2011
[INFO] Final Memory: 19M/185M
[INFO] ------------------------------------------------------------------------
[ERROR] Failed to execute goal org.apache.maven.plugins:maven-surefire-plugin:2.6:test (default-test)
on project hama-core: There are test failures.
[ERROR] 
[ERROR] Please refer to /zonestorage/hudson<https://builds.apache.org/hudson/job/Hama-Nightly/ws/trunk/target/surefire-reports>
for the individual test results.
[ERROR] -> [Help 1]
[ERROR] 
[ERROR] To see the full stack trace of the errors, re-run Maven with the -e switch.
[ERROR] Re-run Maven using the -X switch to enable full debug logging.
[ERROR] 
[ERROR] For more information about the errors and possible solutions, please read the following
articles:
[ERROR] [Help 1] http://cwiki.apache.org/confluence/display/MAVEN/MojoFailureException


Mime
View raw message