incubator-hama-dev mailing list archives

Site index · List index
Message view « Date » · « Thread »
Top « Date » · « Thread »
From Apache Hudson Server <hud...@hudson.apache.org>
Subject Build failed in Hudson: Hama-Patch #287
Date Mon, 08 Nov 2010 07:37:53 GMT
See <https://hudson.apache.org/hudson/job/Hama-Patch/287/changes>

Changes:

[edwardyoon] GroomServer should wait until a job finishes

------------------------------------------
Started by remote host 127.0.0.1
Building remotely on solaris2
Updating https://svn.apache.org/repos/asf/incubator/hama/trunk
U         CHANGES.txt
G         src/java/org/apache/hama/bsp/GroomServer.java
C         src/java/org/apache/hama/bsp/BSPTaskRunner.java
C         src/examples/org/apache/hama/examples/SerializePrinting.java
At revision 1032477
[Hama-Patch] $ /bin/bash -xe /var/tmp/hudson59759.sh
+ set +x


======================================================================
======================================================================
    Testing patch for HAMA-241.
======================================================================
======================================================================


Reverted 'src/java/org/apache/hama/bsp/BSPTaskRunner.java'
Reverted 'src/examples/org/apache/hama/examples/SerializePrinting.java'
At revision 1032477.
HAMA-241 patch is being downloaded at Mon Nov  8 02:36:44 EST 2010 from
http://issues.apache.org/jira/secure/attachment/12459043/hama-241.patch


======================================================================
======================================================================
    Pre-building trunk to determine trunk number
    of release audit, javac, and Findbugs warnings.
======================================================================
======================================================================




======================================================================
======================================================================
    Checking there are no @author tags in the patch.
======================================================================
======================================================================


There appear to be 0 @author tags in the patch.


======================================================================
======================================================================
    Checking there are new or changed tests in the patch.
======================================================================
======================================================================


There appear to be 0 test files referenced in the patch.


======================================================================
======================================================================
    Applying patch.
======================================================================
======================================================================


patching file src/java/org/apache/hama/bsp/GroomServer.java
Hunk #4 FAILED at 614.
1 out of 4 hunks FAILED -- saving rejects to file src/java/org/apache/hama/bsp/GroomServer.java.rej
patching file src/java/org/apache/hama/bsp/BSPPeer.java
patching file src/java/org/apache/hama/bsp/BSPTaskRunner.java
patching file src/java/org/apache/hama/util/ZNode.java
patching file src/examples/org/apache/hama/examples/PiEstimator.java
patching file src/examples/org/apache/hama/examples/ExampleDriver.java
PATCH APPLICATION FAILED


======================================================================
======================================================================
    Adding comment to Jira.
======================================================================
======================================================================


-1 overall.  Here are the results of testing the latest attachment 
http://issues.apache.org/jira/secure/attachment/12459043/hama-241.patch
against trunk revision 1032467.

    @author +1.  The patch does not contain any @author tags.

    tests included -1.  The patch doesn't appear to include any new or modified tests.
                        Please justify why no tests are needed for this patch.

    patch -1.  The patch command could not apply the patch.

Console output: http://hudson.zones.apache.org/hudson/job/Hama-Patch/287/console

This message is automatically generated.


======================================================================
======================================================================
    Finished build.
======================================================================
======================================================================


+ sleep 10
+ exit
[FINDBUGS] Collecting findbugs analysis files...
Archiving artifacts
Recording test results
No test report files were found. Configuration error?
Description set: HAMA-241


Mime
View raw message