incubator-hama-commits mailing list archives

Site index · List index
Message view « Date » · « Thread »
Top « Date » · « Thread »
From Apache Hudson Server <hud...@hudson.zones.apache.org>
Subject Build failed in Hudson: Hama-Patch #97
Date Mon, 20 Oct 2008 14:58:06 GMT
See http://hudson.zones.apache.org/hudson/job/Hama-Patch/97/changes

------------------------------------------
started
Updating https://svn.apache.org/repos/asf/incubator/hama/trunk
At revision 706313
no change for https://svn.apache.org/repos/asf/incubator/hama/trunk since the previous build
[workspace] $ /bin/bash -xe /var/tmp/hudson285558.sh
+ set +x


======================================================================
======================================================================
    Testing patch for HAMA-77.
======================================================================
======================================================================


Reverted 'src/java/org/apache/hama/shell/execution/AlgebraOperator.java'
Reverted 'src/java/org/apache/hama/shell/HamaShellEnv.java'
Reverted 'src/java/org/apache/hama/shell/parser/expression/HamaExpressionParser.jjt'
Reverted 'src/java/org/apache/hama/shell/HamaShell.java'
Reverted 'src/java/org/apache/hama/util/RandomVariable.java'
At revision 706313.
HAMA-77 patch is being downloaded at Mon Oct 20 14:57:03 UTC 2008 from
http://issues.apache.org/jira/secure/attachment/12392490/HAMA-77_V02.patch


======================================================================
======================================================================
    Pre-building trunk to determine trunk number
    of release audit, javac, and Findbugs warnings.
======================================================================
======================================================================




======================================================================
======================================================================
    Checking there are no @author tags in the patch.
======================================================================
======================================================================


There appear to be 0 @author tags in the patch.


======================================================================
======================================================================
    Checking there are new or changed tests in the patch.
======================================================================
======================================================================


There appear to be 0 test files referenced in the patch.


======================================================================
======================================================================
    Applying patch.
======================================================================
======================================================================


patching file src/java/org/apache/hama/Constants.java
Hunk #1 FAILED at 73.
1 out of 1 hunk FAILED -- saving rejects to file src/java/org/apache/hama/Constants.java.rej
patching file src/java/org/apache/hama/shell/execution/AlgebraOperator.java
patching file src/java/org/apache/hama/shell/HamaShellEnv.java
patching file src/java/org/apache/hama/shell/parser/expression/HamaExpressionParser.jjt
patching file src/java/org/apache/hama/shell/HamaShell.java
patching file src/java/org/apache/hama/util/RandomVariable.java
PATCH APPLICATION FAILED


======================================================================
======================================================================
    Adding comment to Jira.
======================================================================
======================================================================


-1 overall.  Here are the results of testing the latest attachment 
http://issues.apache.org/jira/secure/attachment/12392490/HAMA-77_V02.patch
against trunk revision 706241.

    @author +1.  The patch does not contain any @author tags.

    tests included -1.  The patch doesn't appear to include any new or modified tests.
                        Please justify why no tests are needed for this patch.

    patch -1.  The patch command could not apply the patch.

Console output: http://hudson.zones.apache.org/hudson/job/Hama-Patch/97/console

This message is automatically generated.


======================================================================
======================================================================
    Finished build.
======================================================================
======================================================================


+ sleep 10
+ exit
Recording test results
No test report files were found. Configuration error?
Description found: HAMA-77


Mime
View raw message