incubator-hama-commits mailing list archives

Site index · List index
Message view « Date » · « Thread »
Top « Date » · « Thread »
From Apache Hudson Server <hud...@hudson.zones.apache.org>
Subject Build failed in Hudson: Hama-Patch #75
Date Mon, 22 Sep 2008 05:37:45 GMT
See http://hudson.zones.apache.org/hudson/job/Hama-Patch/75/changes

------------------------------------------
started
Updating https://svn.apache.org/repos/asf/incubator/hama/trunk
At revision 697662
no change for https://svn.apache.org/repos/asf/incubator/hama/trunk since the previous build
[workspace] $ /bin/bash -xe /var/tmp/hudson63262.sh
+ set +x


======================================================================
======================================================================
    Testing patch for HAMA-62.
======================================================================
======================================================================


Reverted 'build.xml'
At revision 697662.
HAMA-62 patch is being downloaded at Mon Sep 22 05:37:00 UTC 2008 from
http://issues.apache.org/jira/secure/attachment/12390603/HAMA-62_v02.patch


======================================================================
======================================================================
    Pre-building trunk to determine trunk number
    of release audit, javac, and Findbugs warnings.
======================================================================
======================================================================




======================================================================
======================================================================
    Checking there are no @author tags in the patch.
======================================================================
======================================================================


There appear to be 0 @author tags in the patch.


======================================================================
======================================================================
    Checking there are new or changed tests in the patch.
======================================================================
======================================================================


There appear to be 12 test files referenced in the patch.


======================================================================
======================================================================
    Applying patch.
======================================================================
======================================================================


patching file conf/hama-env.sh
patching file CHANGES.txt
patching file src/java/org/apache/hama/shell/execution/LoadOperation.java
patching file src/java/org/apache/hama/shell/execution/HamaExpression.java
patching file src/java/org/apache/hama/shell/execution/HamaOperation.java
patching file src/java/org/apache/hama/shell/execution/EvalExpression.java
patching file src/java/org/apache/hama/shell/execution/AlgebraOperator.java
patching file src/java/org/apache/hama/shell/execution/RandMatrixOperation.java
patching file src/java/org/apache/hama/shell/execution/AlgebraOpException.java
patching file src/java/org/apache/hama/shell/execution/SaveExpression.java
patching file src/java/org/apache/hama/shell/execution/AlgebraOperation.java
patching file src/java/org/apache/hama/shell/HamaShellEnv.java
patching file src/java/org/apache/hama/shell/HamaShellParser.java
patching file src/java/org/apache/hama/shell/parser/expression/grammar
patching file src/java/org/apache/hama/shell/parser/expression/HamaExpressionParser.jjt
patching file src/java/org/apache/hama/shell/parser/script/HamaScriptParser.jj
patching file src/java/org/apache/hama/shell/HamaShell.java
patching file bin/hama-config.sh
patching file bin/hama
patching file build.xml
Hunk #1 FAILED at 1.
1 out of 1 hunk FAILED -- saving rejects to file build.xml.rej
PATCH APPLICATION FAILED


======================================================================
======================================================================
    Adding comment to Jira.
======================================================================
======================================================================


-1 overall.  Here are the results of testing the latest attachment 
http://issues.apache.org/jira/secure/attachment/12390603/HAMA-62_v02.patch
against trunk revision 697646.

    @author +1.  The patch does not contain any @author tags.

    tests included +1.  The patch appears to include 12 new or modified tests.

    patch -1.  The patch command could not apply the patch.

Console output: http://hudson.zones.apache.org/hudson/job/Hama-Patch/75/console

This message is automatically generated.


======================================================================
======================================================================
    Finished build.
======================================================================
======================================================================


+ sleep 10
+ exit
Recording test results
No test report files were found. Configuration error?
Description found: HAMA-62


Mime
View raw message