incubator-hama-commits mailing list archives

Site index · List index
Message view « Date » · « Thread »
Top « Date » · « Thread »
From Apache Hudson Server <hud...@hudson.zones.apache.org>
Subject Build failed in Hudson: Hama-Patch #73
Date Mon, 22 Sep 2008 01:01:18 GMT
See http://hudson.zones.apache.org/hudson/job/Hama-Patch/73/changes

Changes:

[edwardyoon] 

[edwardyoon] 

------------------------------------------
started
Updating https://svn.apache.org/repos/asf/incubator/hama/trunk
U         zonestorage/hudson/home/hudson/hudson/jobs/Hama-Patch/workspace/trunk/CHANGES.txt
AU        zonestorage/hudson/home/hudson/hudson/jobs/Hama-Patch/workspace/trunk/lib/javacc.jar
G         zonestorage/hudson/home/hudson/hudson/jobs/Hama-Patch/workspace/trunk/src/docs/src/documentation/content/xdocs/who_we_are.xml
At revision 697649
[workspace] $ /bin/bash -xe /var/tmp/hudson62238.sh
+ set +x


======================================================================
======================================================================
    Testing patch for HAMA-62.
======================================================================
======================================================================


At revision 697649.
HAMA-62 patch is being downloaded at Mon Sep 22 01:00:37 UTC 2008 from
http://issues.apache.org/jira/secure/attachment/12390589/HAMA-62.patch


======================================================================
======================================================================
    Pre-building trunk to determine trunk number
    of release audit, javac, and Findbugs warnings.
======================================================================
======================================================================




======================================================================
======================================================================
    Checking there are no @author tags in the patch.
======================================================================
======================================================================


There appear to be 0 @author tags in the patch.


======================================================================
======================================================================
    Checking there are new or changed tests in the patch.
======================================================================
======================================================================


There appear to be 3 test files referenced in the patch.


======================================================================
======================================================================
    Applying patch.
======================================================================
======================================================================


patching file bin/hama-config.sh
patching file bin/hama
patching file build.xml
Hunk #1 FAILED at 29.
Hunk #2 FAILED at 38.
Hunk #3 FAILED at 92.
Hunk #4 FAILED at 107.
Hunk #5 FAILED at 141.
Hunk #6 FAILED at 317.
6 out of 6 hunks FAILED -- saving rejects to file build.xml.rej
patching file CHANGES.txt
patching file conf/hama-env.sh
patching file src/java/org/apache/hama/shell/HamaShellEnv.java
patching file src/java/org/apache/hama/shell/HamaShellParser.java
patching file src/java/org/apache/hama/shell/HamaShell.java
patching file src/java/org/apache/hama/shell/execution/LoadOperation.java
patching file src/java/org/apache/hama/shell/execution/HamaExpression.java
patching file src/java/org/apache/hama/shell/execution/EvalExpression.java
patching file src/java/org/apache/hama/shell/execution/HamaOperation.java
patching file src/java/org/apache/hama/shell/execution/AlgebraOperator.java
patching file src/java/org/apache/hama/shell/execution/RandMatrixOperation.java
patching file src/java/org/apache/hama/shell/execution/AlgebraOpException.java
patching file src/java/org/apache/hama/shell/execution/AlgebraOperation.java
patching file src/java/org/apache/hama/shell/execution/SaveExpression.java
patching file src/java/org/apache/hama/shell/parser/expression/grammar
patching file src/java/org/apache/hama/shell/parser/expression/HamaExpressionParser.jjt
patching file src/java/org/apache/hama/shell/parser/script/HamaScriptParser.jj
PATCH APPLICATION FAILED


======================================================================
======================================================================
    Adding comment to Jira.
======================================================================
======================================================================


-1 overall.  Here are the results of testing the latest attachment 
http://issues.apache.org/jira/secure/attachment/12390589/HAMA-62.patch
against trunk revision 697646.

    @author +1.  The patch does not contain any @author tags.

    tests included +1.  The patch appears to include 3 new or modified tests.

    patch -1.  The patch command could not apply the patch.

Console output: http://hudson.zones.apache.org/hudson/job/Hama-Patch/73/console

This message is automatically generated.


======================================================================
======================================================================
    Finished build.
======================================================================
======================================================================


+ sleep 10
+ exit
Recording test results
No test report files were found. Configuration error?
Description found: HAMA-62


Mime
View raw message