incubator-gora-dev mailing list archives

Site index · List index
Message view « Date » · « Thread »
Top « Date » · « Thread »
From Henry Saputra <henry.sapu...@gmail.com>
Subject Re: [VOTE] Apache Gora 0.1-incubating release
Date Sat, 12 Feb 2011 06:02:14 GMT
Looks like ivy somehow messed up the timestamp for local copy for
gora-core 0.1 and 0.1-incubating. Not exactly sure what happened her.

However, you can bypass this error by deleting local and cache
directories under ~/.ivy2.

After I did it, I passed the missing library error and saw test fail
and error in org.apache.gora.memory.store.TestMemStore:

compile-test:

test:
   [delete] Deleting directory
/Users/hsaputra/gora/branches/0.1-incubating/gora-core/build/test/data
    [mkdir] Created dir:
/Users/hsaputra/gora/branches/0.1-incubating/gora-core/build/test/data
   [delete] Deleting directory
/Users/hsaputra/gora/branches/0.1-incubating/gora-core/build/test/logs
    [mkdir] Created dir:
/Users/hsaputra/gora/branches/0.1-incubating/gora-core/build/test/logs
    [junit] WARNING: multiple versions of ant detected in path for junit
    [junit]
jar:file:/usr/share/ant/lib/ant.jar!/org/apache/tools/ant/Project.class
    [junit]      and
jar:file:/Users/hsaputra/gora/branches/0.1-incubating/gora-core/lib/ant-1.6.5.jar!/org/apache/tools/ant/Project.class
    [junit] Running org.apache.gora.avro.TestPersistentDatumReader
    [junit] Tests run: 4, Failures: 0, Errors: 0, Time elapsed: 0.484 sec
    [junit] Running
org.apache.gora.avro.mapreduce.TestDataFileAvroStoreMapReduce
    [junit] Tests run: 2, Failures: 2, Errors: 0, Time elapsed: 79.674 sec
    [junit] Test
org.apache.gora.avro.mapreduce.TestDataFileAvroStoreMapReduce FAILED
    [junit] Running org.apache.gora.avro.store.TestAvroStore
    [junit] Tests run: 6, Failures: 0, Errors: 0, Time elapsed: 1.325 sec
    [junit] Running org.apache.gora.avro.store.TestDataFileAvroStore
    [junit] Tests run: 6, Failures: 0, Errors: 0, Time elapsed: 1.557 sec
    [junit] Running org.apache.gora.mapreduce.TestGoraInputFormat
    [junit] Tests run: 1, Failures: 0, Errors: 0, Time elapsed: 0.719 sec
    [junit] Running org.apache.gora.mapreduce.TestGoraInputSplit
    [junit] Tests run: 2, Failures: 0, Errors: 0, Time elapsed: 0.548 sec
    [junit] Running org.apache.gora.mapreduce.TestPersistentSerialization
    [junit] Tests run: 5, Failures: 0, Errors: 0, Time elapsed: 0.649 sec
    [junit] Running org.apache.gora.memory.store.TestMemStore
    [junit] Tests run: 28, Failures: 1, Errors: 6, Time elapsed: 0.493 sec
    [junit] Test org.apache.gora.memory.store.TestMemStore FAILED
    [junit] Running org.apache.gora.persistency.impl.TestPersistentBase
    [junit] Tests run: 6, Failures: 0, Errors: 0, Time elapsed: 0.453 sec
    [junit] Running org.apache.gora.persistency.impl.TestStateManagerImpl
    [junit] Tests run: 9, Failures: 0, Errors: 0, Time elapsed: 0.394 sec
    [junit] Running org.apache.gora.query.impl.TestPartitionQueryImpl
    [junit] Tests run: 1, Failures: 0, Errors: 0, Time elapsed: 0.522 sec
    [junit] Running org.apache.gora.query.impl.TestQueryBase
    [junit] Tests run: 2, Failures: 0, Errors: 0, Time elapsed: 0.599 sec
    [junit] Running org.apache.gora.store.TestDataStoreFactory
    [junit] Tests run: 6, Failures: 0, Errors: 0, Time elapsed: 0.461 sec
    [junit] Running org.apache.gora.util.TestIOUtils
    [junit] Tests run: 6, Failures: 0, Errors: 0, Time elapsed: 0.397 sec

Trying to figure out which test cases cause the fail and errors.

- Henry

On Mon, Feb 7, 2011 at 7:43 AM, Andrzej Bialecki <ab@getopt.org> wrote:
> On 2/7/11 1:05 PM, Julien Nioche wrote:
>>
>> OK, I've changed my mind :-) Better to release 0.1 now and do GORA-22 in
>> 0.2
>> We'll maybe hear more details about the limitations / bugs of the current
>> implementation from Enis/Dogacan in the meantime + add more features to
>> GORA-22. Having 0.1 released and published is very important for Nutch so
>> +1
>> from me
>
> I'm getting these during build:
>
> [ivy:resolve] :: problems summary ::
> [ivy:resolve] :::: ERRORS
> [ivy:resolve]   unknown resolver public
> [ivy:resolve]   unknown resolver main
>
> The default target (publish-local-all) appears to finish ok, but test
> doesn't work - it bombs out with the following:
>
> ivy:resolve] :: problems summary ::
> [ivy:resolve] :::: WARNINGS
> [ivy:resolve]           ::::::::::::::::::::::::::::::::::::::::::::::
> [ivy:resolve]           ::          UNRESOLVED DEPENDENCIES         ::
> [ivy:resolve]           ::::::::::::::::::::::::::::::::::::::::::::::
> [ivy:resolve]           :: org.apache.gora#gora-core;0.1: configuration not
> found in org.apache.gora#gora-core;0.1: 'test'. It was required from
> org.apache.gora#gora-cassandra;working@abacus.local test
> [ivy:resolve]           ::::::::::::::::::::::::::::::::::::::::::::::
> [ivy:resolve]
> [ivy:resolve] :: USE VERBOSE OR DEBUG MESSAGE LEVEL FOR MORE DETAILS
>
> BUILD FAILED
> /Users/ab/work/gora/svn/branches/0.1-incubating/build.xml:278: The following
> error occurred while executing this line:
> /Users/ab/work/gora/svn/branches/0.1-incubating/build-common.xml:365:
> impossible to resolve dependencies:
>        resolve failed - see output for details
>
>
> If there is some setup needed that I missed, IMHO it should be described in
> the README. My env: Mac OSX 10.6.6, JDK 1.6.0_22 64-bit, Ant 1.8.1.
>
>
> --
> Best regards,
> Andrzej Bialecki     <><
>  ___. ___ ___ ___ _ _   __________________________________
> [__ || __|__/|__||\/|  Information Retrieval, Semantic Web
> ___|||__||  \|  ||  |  Embedded Unix, System Integration
> http://www.sigram.com  Contact: info at sigram dot com
>
>



-- 
Thanks,
Henry

Mime
View raw message