incubator-general mailing list archives

Site index · List index
Message view « Date » · « Thread »
Top « Date » · « Thread »
From Terence Yim <cht...@gmail.com>
Subject Re: [VOTE] Release Apache Twill-0.3.0-incubating [rc1]
Date Wed, 20 Aug 2014 19:38:29 GMT
Hi Justin,

Sometimes we did see test fail on slower box. The problem has been
addressed in the master branch, but not in the 0.3.0 release. Thanks
for pointing it out.

Terence

On Tue, Aug 19, 2014 at 12:23 AM, Justin Mclean
<justin@classsoftware.com> wrote:
> Hi,
>
> The Test error for reference was:
>
> Tests run: 14, Failures: 1, Errors: 0, Skipped: 1, Time elapsed: 335.084 sec <<<
FAILURE!
> testLogHandler(org.apache.twill.yarn.LogHandlerTestRun)  Time elapsed: 19.516 sec  <<<
FAILURE!
> java.lang.AssertionError: expected:<1> but was:<0>
>         at org.junit.Assert.fail(Assert.java:88)
>         at org.junit.Assert.failNotEquals(Assert.java:743)
>         at org.junit.Assert.assertEquals(Assert.java:118)
>         at org.junit.Assert.assertEquals(Assert.java:555)
>         at org.junit.Assert.assertEquals(Assert.java:542)
>         at org.apache.twill.yarn.LogHandlerTestRun.testLogHandler(LogHandlerTestRun.java:75)
>
> Justin
> ---------------------------------------------------------------------
> To unsubscribe, e-mail: general-unsubscribe@incubator.apache.org
> For additional commands, e-mail: general-help@incubator.apache.org
>

---------------------------------------------------------------------
To unsubscribe, e-mail: general-unsubscribe@incubator.apache.org
For additional commands, e-mail: general-help@incubator.apache.org


Mime
View raw message