incubator-general mailing list archives

Site index · List index
Message view « Date » · « Thread »
Top « Date » · « Thread »
From sebb <seb...@gmail.com>
Subject Re: [VOTE] Release Abdera 0.4.0-incubating Take 7
Date Mon, 07 Apr 2008 21:41:35 GMT
What about
      apache-abdera-0.4.0-incubating.pom?
Does that not need an MD5?

It would be helpful if the Java requirements were documented in some
obvious places such as in BUILDING and on the overview, building and
download sections of the website.

Two of the tests fail on IBM Java 6:
java version "1.6.0"
Java(TM) SE Runtime Environment (build pwi3260-20071123_01)
IBM J9 VM (build 2.4, J2RE 1.6.0 IBM J9 2.4 Windows XP x86-32
jvmwi3260-20071121_15015 (JIT enabled)

-------------------------------------------------------------------------------
Test set: org.apache.abdera.test.parser.stax.FOMTest
-------------------------------------------------------------------------------
Tests run: 15, Failures: 1, Errors: 0, Skipped: 0, Time elapsed: 3.218
sec <<< FAILURE!
testSourceResult(org.apache.abdera.test.parser.stax.FOMTest)  Time
elapsed: 2.687 sec  <<< FAILURE!
junit.framework.ComparisonFailure: null expected:<[]> but was:<[This
is a test urn:uuid:60a76c80-d399-11d9-b93C-0003939e0af6]>
	at junit.framework.Assert.assertEquals(Assert.java:81)
	at junit.framework.Assert.assertEquals(Assert.java:87)
	at org.apache.abdera.test.parser.stax.FOMTest.testSourceResult(FOMTest.java:713)
	at sun.reflect.NativeMethodAccessorImpl.invoke0(Native Method)
	at sun.reflect.NativeMethodAccessorImpl.invoke(NativeMethodAccessorImpl.java:45)
	at sun.reflect.DelegatingMethodAccessorImpl.invoke(DelegatingMethodAccessorImpl.java:25)
	at java.lang.reflect.Method.invoke(Method.java:612)
	at org.junit.internal.runners.TestMethodRunner.executeMethodBody(TestMethodRunner.java:99)
	at org.junit.internal.runners.TestMethodRunner.runUnprotected(TestMethodRunner.java:81)
	at org.junit.internal.runners.BeforeAndAfterRunner.runProtected(BeforeAndAfterRunner.java:34)
	at org.junit.internal.runners.TestMethodRunner.runMethod(TestMethodRunner.java:75)
	at org.junit.internal.runners.TestMethodRunner.run(TestMethodRunner.java:45)
	at org.junit.internal.runners.TestClassMethodsRunner.invokeTestMethod(TestClassMethodsRunner.java:66)
	at org.junit.internal.runners.TestClassMethodsRunner.run(TestClassMethodsRunner.java:35)
	at org.junit.internal.runners.TestClassRunner$1.runUnprotected(TestClassRunner.java:42)
	at org.junit.internal.runners.BeforeAndAfterRunner.runProtected(BeforeAndAfterRunner.java:34)
	at org.junit.internal.runners.TestClassRunner.run(TestClassRunner.java:52)
	at org.apache.maven.surefire.junit4.JUnit4TestSet.execute(JUnit4TestSet.java:62)
	at org.apache.maven.surefire.suite.AbstractDirectoryTestSuite.executeTestSet(AbstractDirectoryTestSuite.java:140)
	at org.apache.maven.surefire.suite.AbstractDirectoryTestSuite.execute(AbstractDirectoryTestSuite.java:127)
	at org.apache.maven.surefire.Surefire.run(Surefire.java:177)
	at sun.reflect.NativeMethodAccessorImpl.invoke0(Native Method)
	at sun.reflect.NativeMethodAccessorImpl.invoke(NativeMethodAccessorImpl.java:45)
	at sun.reflect.DelegatingMethodAccessorImpl.invoke(DelegatingMethodAccessorImpl.java:25)
	at java.lang.reflect.Method.invoke(Method.java:612)
	at org.apache.maven.surefire.booter.SurefireBooter.runSuitesInProcess(SurefireBooter.java:334)
	at org.apache.maven.surefire.booter.SurefireBooter.main(SurefireBooter.java:980)


-------------------------------------------------------------------------------
Test set: org.apache.abdera.test.parser.EncodingTest
-------------------------------------------------------------------------------
Tests run: 5, Failures: 0, Errors: 1, Skipped: 0, Time elapsed: 0.063
sec <<< FAILURE!
testWriterOptions(org.apache.abdera.test.parser.EncodingTest)  Time
elapsed: 0.016 sec  <<< ERROR!
org.apache.abdera.parser.ParseException:
com.ctc.wstx.exc.WstxEOFException: Unexpected EOF in prolog
 at javax.xml.stream.SerializableLocation@7b957b95
	at org.apache.abdera.parser.stax.FOMBuilder.next(FOMBuilder.java:260)
	at org.apache.abdera.parser.stax.FOMBuilder.getFomDocument(FOMBuilder.java:333)
	at org.apache.abdera.parser.stax.FOMParser.getDocument(FOMParser.java:72)
	at org.apache.abdera.parser.stax.FOMParser.parse(FOMParser.java:207)
	at org.apache.abdera.parser.stax.FOMParser.parse(FOMParser.java:121)
	at org.apache.abdera.test.parser.EncodingTest.testWriterOptions(EncodingTest.java:130)
	at sun.reflect.NativeMethodAccessorImpl.invoke0(Native Method)
	at sun.reflect.NativeMethodAccessorImpl.invoke(NativeMethodAccessorImpl.java:45)
	at sun.reflect.DelegatingMethodAccessorImpl.invoke(DelegatingMethodAccessorImpl.java:25)
	at java.lang.reflect.Method.invoke(Method.java:612)
	at org.junit.internal.runners.TestMethodRunner.executeMethodBody(TestMethodRunner.java:99)
	at org.junit.internal.runners.TestMethodRunner.runUnprotected(TestMethodRunner.java:81)
	at org.junit.internal.runners.BeforeAndAfterRunner.runProtected(BeforeAndAfterRunner.java:34)
	at org.junit.internal.runners.TestMethodRunner.runMethod(TestMethodRunner.java:75)
	at org.junit.internal.runners.TestMethodRunner.run(TestMethodRunner.java:45)
	at org.junit.internal.runners.TestClassMethodsRunner.invokeTestMethod(TestClassMethodsRunner.java:66)
	at org.junit.internal.runners.TestClassMethodsRunner.run(TestClassMethodsRunner.java:35)
	at org.junit.internal.runners.TestClassRunner$1.runUnprotected(TestClassRunner.java:42)
	at org.junit.internal.runners.BeforeAndAfterRunner.runProtected(BeforeAndAfterRunner.java:34)
	at org.junit.internal.runners.TestClassRunner.run(TestClassRunner.java:52)
	at org.apache.maven.surefire.junit4.JUnit4TestSet.execute(JUnit4TestSet.java:62)
	at org.apache.maven.surefire.suite.AbstractDirectoryTestSuite.executeTestSet(AbstractDirectoryTestSuite.java:140)
	at org.apache.maven.surefire.suite.AbstractDirectoryTestSuite.execute(AbstractDirectoryTestSuite.java:127)
	at org.apache.maven.surefire.Surefire.run(Surefire.java:177)
	at sun.reflect.NativeMethodAccessorImpl.invoke0(Native Method)
	at sun.reflect.NativeMethodAccessorImpl.invoke(NativeMethodAccessorImpl.java:45)
	at sun.reflect.DelegatingMethodAccessorImpl.invoke(DelegatingMethodAccessorImpl.java:25)
	at java.lang.reflect.Method.invoke(Method.java:612)
	at org.apache.maven.surefire.booter.SurefireBooter.runSuitesInProcess(SurefireBooter.java:334)
	at org.apache.maven.surefire.booter.SurefireBooter.main(SurefireBooter.java:980)
Caused by: com.ctc.wstx.exc.WstxEOFException: Unexpected EOF in prolog
 at javax.xml.stream.SerializableLocation@7b957b95
	at com.ctc.wstx.sr.StreamScanner.throwUnexpectedEOF(StreamScanner.java:661)
	at com.ctc.wstx.sr.BasicStreamReader.handleEOF(BasicStreamReader.java:2134)
	at com.ctc.wstx.sr.BasicStreamReader.nextFromProlog(BasicStreamReader.java:2040)
	at com.ctc.wstx.sr.BasicStreamReader.next(BasicStreamReader.java:1069)
	at org.apache.abdera.parser.stax.FOMBuilder.getNextElementToParse(FOMBuilder.java:163)
	at org.apache.abdera.parser.stax.FOMBuilder.next(FOMBuilder.java:187)
	... 29 more



On 07/04/2008, James M Snell <jasnell@gmail.com> wrote:
> Dan's added the missing md5's.
>
>  - James
>
>  Martijn Dashorst wrote:
>
> > On 4/7/08, James M Snell <jasnell@gmail.com> wrote:
> >
> > >  Not critical. We can generate the md5 files for the zip files and make
> > > those available with the final release.
> > >
> >
> > I tend to disagree here. How can we tell the file hasn't been updated
> > in the mean time? Or that the version Sebb has downloaded is the same
> > as you have published?
> >
> > IMO the .md5 files are an essential part of a release.
> >
> > Martijn
> >
> >
>
> ---------------------------------------------------------------------
>  To unsubscribe, e-mail:
> general-unsubscribe@incubator.apache.org
>  For additional commands, e-mail:
> general-help@incubator.apache.org
>
>

---------------------------------------------------------------------
To unsubscribe, e-mail: general-unsubscribe@incubator.apache.org
For additional commands, e-mail: general-help@incubator.apache.org


Mime
View raw message