incubator-flex-dev mailing list archives

Site index · List index
Message view « Date » · « Thread »
Top « Date » · « Thread »
From Frédéric THOMAS (JIRA) <j...@apache.org>
Subject [jira] [Commented] (FLEX-33290) Apache Flex Mavenized SDK Deployer Bug
Date Mon, 10 Dec 2012 18:47:22 GMT

    [ https://issues.apache.org/jira/browse/FLEX-33290?page=com.atlassian.jira.plugin.system.issuetabpanels:comment-tabpanel&focusedCommentId=13528161#comment-13528161
] 

Frédéric THOMAS commented on FLEX-33290:
----------------------------------------

Hi Jose,

I agree with the idea of ​​using ProcessBuilder, can you test from a windows and mac client
before committing ?
                
> Apache Flex Mavenized SDK Deployer Bug
> --------------------------------------
>
>                 Key: FLEX-33290
>                 URL: https://issues.apache.org/jira/browse/FLEX-33290
>             Project: Apache Flex
>          Issue Type: Bug
>          Components: Installation & Packaging
>    Affects Versions: InstalApacheFlex 1.0
>            Reporter: Jose Barragan
>            Assignee: Frédéric THOMAS
>
> When use the SDKDeployer on MacOS, the maven subprocess fails with this error:
> /usr/share/maven/bin/mvn deploy:deploy-file -DrepositoryId=fdk-release -Durl=http://maven.codeoscopic.com/content/repositories/fdk-release
-Dfile="/Users/pepebarragan/Desktop/fdk/com/adobe/air/framework/3.1/framework-3.1.pom" -DpomFile="/Users/pepebarragan/Desktop/fdk/com/adobe/air/framework/3.1/framework-3.1.pom"
> [INFO] Scanning for projects...
> [INFO]                                                                         
> [INFO] ------------------------------------------------------------------------
> [INFO] Building flex-sdk-converter 1.0
> [INFO] ------------------------------------------------------------------------
> [INFO] 
> [INFO] --- maven-deploy-plugin:2.7:deploy-file (default-cli) @ flex-sdk-converter ---
> [INFO] ------------------------------------------------------------------------
> [INFO] BUILD FAILURE
> [INFO] ------------------------------------------------------------------------
> [INFO] Total time: 1.194s
> [INFO] Finished at: Mon Dec 10 14:57:55 CET 2012
> [INFO] Final Memory: 3M/81M
> [INFO] ------------------------------------------------------------------------
> [ERROR] Failed to execute goal org.apache.maven.plugins:maven-deploy-plugin:2.7:deploy-file
(default-cli) on project flex-sdk-converter: /Users/pepebarragan/Developer/apache.org/flex/utilities/mavenizer/"/Users/pepebarragan/Desktop/fdk/com/adobe/air/framework/3.1/framework-3.1.pom
not found. -> [Help 1]
> [ERROR] 
> [ERROR] To see the full stack trace of the errors, re-run Maven with the -e switch.
> [ERROR] Re-run Maven using the -X switch to enable full debug logging.
> [ERROR] 
> [ERROR] For more information about the errors and possible solutions, please read the
following articles:
> [ERROR] [Help 1] http://cwiki.apache.org/confluence/display/MAVEN/MojoExecutionException
> Done.

--
This message is automatically generated by JIRA.
If you think it was sent incorrectly, please contact your JIRA administrators
For more information on JIRA, see: http://www.atlassian.com/software/jira

Mime
View raw message