incubator-esme-dev mailing list archives

Site index · List index
Message view « Date » · « Thread »
Top « Date » · « Thread »
From Apache Hudson Server <hud...@hudson.zones.apache.org>
Subject Build failed in Hudson: ESME #247
Date Tue, 08 Jun 2010 12:18:30 GMT
See <http://hudson.zones.apache.org/hudson/job/ESME/247/changes>

Changes:

[rhirsch] [ESME-161] Move the existing JMX interface to Ostrich
Patch by Imtiaz Ahmed Hajee Esmail

------------------------------------------
[...truncated 90 lines...]
[INFO] snapshot net.liftweb:lift-parent:2.0-SNAPSHOT: checking for updates from Configgy
[INFO] snapshot net.liftweb:lift-parent:2.0-SNAPSHOT: checking for updates from Apache Repo
29K downloaded
[INFO] snapshot net.liftweb:lift-actor:2.0-SNAPSHOT: checking for updates from Base
[INFO] snapshot net.liftweb:lift-actor:2.0-SNAPSHOT: checking for updates from scala-tools.org
[INFO] snapshot net.liftweb:lift-actor:2.0-SNAPSHOT: checking for updates from scala-tools.org.snapshots
[INFO] snapshot net.liftweb:lift-actor:2.0-SNAPSHOT: checking for updates from compass-project.org
[INFO] snapshot net.liftweb:lift-actor:2.0-SNAPSHOT: checking for updates from Configgy
[INFO] snapshot net.liftweb:lift-actor:2.0-SNAPSHOT: checking for updates from Apache Repo
2K downloaded
[INFO] snapshot net.liftweb:lift-common:2.0-SNAPSHOT: checking for updates from Base
[INFO] snapshot net.liftweb:lift-common:2.0-SNAPSHOT: checking for updates from scala-tools.org
[INFO] snapshot net.liftweb:lift-common:2.0-SNAPSHOT: checking for updates from scala-tools.org.snapshots
[INFO] snapshot net.liftweb:lift-common:2.0-SNAPSHOT: checking for updates from compass-project.org
[INFO] snapshot net.liftweb:lift-common:2.0-SNAPSHOT: checking for updates from Configgy
[INFO] snapshot net.liftweb:lift-common:2.0-SNAPSHOT: checking for updates from Apache Repo
2K downloaded
[INFO] artifact org.slf4j:slf4j-api: checking for updates from Base
[INFO] artifact org.slf4j:slf4j-api: checking for updates from scala-tools.org
[INFO] artifact org.slf4j:slf4j-api: checking for updates from scala-tools.org.snapshots
[INFO] artifact org.slf4j:slf4j-api: checking for updates from compass-project.org
[INFO] artifact org.slf4j:slf4j-api: checking for updates from Configgy
[INFO] artifact org.slf4j:slf4j-api: checking for updates from Apache Repo
[INFO] artifact org.slf4j:slf4j-api: checking for updates from central
[INFO] snapshot net.liftweb:lift-json:2.0-SNAPSHOT: checking for updates from Base
[INFO] snapshot net.liftweb:lift-json:2.0-SNAPSHOT: checking for updates from scala-tools.org
[INFO] snapshot net.liftweb:lift-json:2.0-SNAPSHOT: checking for updates from scala-tools.org.snapshots
[INFO] snapshot net.liftweb:lift-json:2.0-SNAPSHOT: checking for updates from compass-project.org
[INFO] snapshot net.liftweb:lift-json:2.0-SNAPSHOT: checking for updates from Configgy
[INFO] snapshot net.liftweb:lift-json:2.0-SNAPSHOT: checking for updates from Apache Repo
1K downloaded
[INFO] artifact javax.mail:mail: checking for updates from Base
[INFO] artifact javax.mail:mail: checking for updates from scala-tools.org
[INFO] artifact javax.mail:mail: checking for updates from scala-tools.org.snapshots
[INFO] artifact javax.mail:mail: checking for updates from compass-project.org
[INFO] artifact javax.mail:mail: checking for updates from Configgy
[INFO] artifact javax.mail:mail: checking for updates from Apache Repo
[INFO] artifact javax.mail:mail: checking for updates from central
[INFO] artifact org.slf4j:slf4j-log4j12: checking for updates from Base
[INFO] artifact org.slf4j:slf4j-log4j12: checking for updates from scala-tools.org
[INFO] artifact org.slf4j:slf4j-log4j12: checking for updates from scala-tools.org.snapshots
[INFO] artifact org.slf4j:slf4j-log4j12: checking for updates from compass-project.org
[INFO] artifact org.slf4j:slf4j-log4j12: checking for updates from Configgy
[INFO] artifact org.slf4j:slf4j-log4j12: checking for updates from Apache Repo
[INFO] artifact org.slf4j:slf4j-log4j12: checking for updates from central
[INFO] snapshot net.liftweb:lift-webkit:2.0-SNAPSHOT: checking for updates from Base
[INFO] snapshot net.liftweb:lift-webkit:2.0-SNAPSHOT: checking for updates from scala-tools.org
[INFO] snapshot net.liftweb:lift-webkit:2.0-SNAPSHOT: checking for updates from scala-tools.org.snapshots
[INFO] snapshot net.liftweb:lift-webkit:2.0-SNAPSHOT: checking for updates from compass-project.org
[INFO] snapshot net.liftweb:lift-webkit:2.0-SNAPSHOT: checking for updates from Configgy
[INFO] snapshot net.liftweb:lift-webkit:2.0-SNAPSHOT: checking for updates from Apache Repo
3K downloaded
[INFO] snapshot net.liftweb:lift-testkit:2.0-SNAPSHOT: checking for updates from Base
[INFO] snapshot net.liftweb:lift-testkit:2.0-SNAPSHOT: checking for updates from scala-tools.org
[INFO] snapshot net.liftweb:lift-testkit:2.0-SNAPSHOT: checking for updates from scala-tools.org.snapshots
[INFO] snapshot net.liftweb:lift-testkit:2.0-SNAPSHOT: checking for updates from compass-project.org
[INFO] snapshot net.liftweb:lift-testkit:2.0-SNAPSHOT: checking for updates from Configgy
[INFO] snapshot net.liftweb:lift-testkit:2.0-SNAPSHOT: checking for updates from Apache Repo
1K downloaded
[INFO] snapshot net.liftweb:lift-modules:2.0-SNAPSHOT: checking for updates from Base
[INFO] snapshot net.liftweb:lift-modules:2.0-SNAPSHOT: checking for updates from scala-tools.org
[INFO] snapshot net.liftweb:lift-modules:2.0-SNAPSHOT: checking for updates from scala-tools.org.snapshots
[INFO] snapshot net.liftweb:lift-modules:2.0-SNAPSHOT: checking for updates from compass-project.org
[INFO] snapshot net.liftweb:lift-modules:2.0-SNAPSHOT: checking for updates from Configgy
[INFO] snapshot net.liftweb:lift-modules:2.0-SNAPSHOT: checking for updates from Apache Repo
3K downloaded
[INFO] snapshot net.liftweb:lift-widgets:2.0-SNAPSHOT: checking for updates from Base
[INFO] snapshot net.liftweb:lift-widgets:2.0-SNAPSHOT: checking for updates from scala-tools.org
[INFO] snapshot net.liftweb:lift-widgets:2.0-SNAPSHOT: checking for updates from scala-tools.org.snapshots
[INFO] snapshot net.liftweb:lift-widgets:2.0-SNAPSHOT: checking for updates from compass-project.org
[INFO] snapshot net.liftweb:lift-widgets:2.0-SNAPSHOT: checking for updates from Configgy
[INFO] snapshot net.liftweb:lift-widgets:2.0-SNAPSHOT: checking for updates from Apache Repo
3K downloaded
[INFO] snapshot net.liftweb:lift-mapper:2.0-SNAPSHOT: checking for updates from Base
[INFO] snapshot net.liftweb:lift-mapper:2.0-SNAPSHOT: checking for updates from scala-tools.org
[INFO] snapshot net.liftweb:lift-mapper:2.0-SNAPSHOT: checking for updates from scala-tools.org.snapshots
[INFO] snapshot net.liftweb:lift-mapper:2.0-SNAPSHOT: checking for updates from compass-project.org
[INFO] snapshot net.liftweb:lift-mapper:2.0-SNAPSHOT: checking for updates from Configgy
[INFO] snapshot net.liftweb:lift-mapper:2.0-SNAPSHOT: checking for updates from Apache Repo
2K downloaded
[INFO] snapshot net.liftweb:lift-persistence:2.0-SNAPSHOT: checking for updates from Base
[INFO] snapshot net.liftweb:lift-persistence:2.0-SNAPSHOT: checking for updates from scala-tools.org
[INFO] snapshot net.liftweb:lift-persistence:2.0-SNAPSHOT: checking for updates from scala-tools.org.snapshots
[INFO] snapshot net.liftweb:lift-persistence:2.0-SNAPSHOT: checking for updates from compass-project.org
[INFO] snapshot net.liftweb:lift-persistence:2.0-SNAPSHOT: checking for updates from Configgy
[INFO] snapshot net.liftweb:lift-persistence:2.0-SNAPSHOT: checking for updates from Apache
Repo
3K downloaded
[INFO] snapshot net.liftweb:lift-openid:2.0-SNAPSHOT: checking for updates from Base
[INFO] snapshot net.liftweb:lift-openid:2.0-SNAPSHOT: checking for updates from scala-tools.org
[INFO] snapshot net.liftweb:lift-openid:2.0-SNAPSHOT: checking for updates from scala-tools.org.snapshots
[INFO] snapshot net.liftweb:lift-openid:2.0-SNAPSHOT: checking for updates from compass-project.org
[INFO] snapshot net.liftweb:lift-openid:2.0-SNAPSHOT: checking for updates from Configgy
[INFO] snapshot net.liftweb:lift-openid:2.0-SNAPSHOT: checking for updates from Apache Repo
1K downloaded
[INFO] artifact org.openid4java:openid4java-consumer: checking for updates from Base
[INFO] artifact org.openid4java:openid4java-consumer: checking for updates from scala-tools.org
[INFO] artifact org.openid4java:openid4java-consumer: checking for updates from scala-tools.org.snapshots
[INFO] artifact org.openid4java:openid4java-consumer: checking for updates from compass-project.org
[INFO] artifact org.openid4java:openid4java-consumer: checking for updates from Configgy
[INFO] artifact org.openid4java:openid4java-consumer: checking for updates from Apache Repo
[INFO] artifact org.openid4java:openid4java-consumer: checking for updates from central
[INFO] artifact org.slf4j:jcl-over-slf4j: checking for updates from Base
[INFO] artifact org.slf4j:jcl-over-slf4j: checking for updates from scala-tools.org
[INFO] artifact org.slf4j:jcl-over-slf4j: checking for updates from scala-tools.org.snapshots
[INFO] artifact org.slf4j:jcl-over-slf4j: checking for updates from compass-project.org
[INFO] artifact org.slf4j:jcl-over-slf4j: checking for updates from Configgy
[INFO] artifact org.slf4j:jcl-over-slf4j: checking for updates from Apache Repo
[INFO] artifact org.slf4j:jcl-over-slf4j: checking for updates from central
[INFO] artifact org.mortbay.jetty:jetty: checking for updates from Base
[INFO] artifact org.mortbay.jetty:jetty: checking for updates from scala-tools.org
[INFO] artifact org.mortbay.jetty:jetty: checking for updates from scala-tools.org.snapshots
[INFO] artifact org.mortbay.jetty:jetty: checking for updates from compass-project.org
[INFO] artifact org.mortbay.jetty:jetty: checking for updates from Configgy
[INFO] artifact org.mortbay.jetty:jetty: checking for updates from Apache Repo
[INFO] artifact org.mortbay.jetty:jetty: checking for updates from central
Downloading: http://repo2.maven.org/maven2//com/twitter/ostrich/1.1.16/ostrich-1.1.16.pom
Downloading: http://scala-tools.org/repo-releases/com/twitter/ostrich/1.1.16/ostrich-1.1.16.pom
Downloading: http://scala-tools.org/repo-snapshots/com/twitter/ostrich/1.1.16/ostrich-1.1.16.pom
Downloading: http://repo.compass-project.org/com/twitter/ostrich/1.1.16/ostrich-1.1.16.pom
Downloading: http://www.lag.net/repo/com/twitter/ostrich/1.1.16/ostrich-1.1.16.pom
5K downloaded
[WARNING] *** CHECKSUM FAILED - Error retrieving checksum file for com/twitter/ostrich/1.1.16/ostrich-1.1.16.pom
- IGNORING
Downloading: http://repo2.maven.org/maven2//commons-lang/commons-lang/2.2/commons-lang-2.2.pom
Downloading: http://repo2.maven.org/maven2//org/scala-tools/testing/specs/1.6.2.1/specs-1.6.2.1.pom
Downloading: http://repo2.maven.org/maven2//org/objenesis/objenesis/1.1/objenesis-1.1.pom
Downloading: http://repo2.maven.org/maven2//org/objenesis/objenesis-parent/1.1/objenesis-parent-1.1.pom
Downloading: http://repo2.maven.org/maven2//org/mockito/mockito-core/1.8.1/mockito-core-1.8.1.pom
Downloading: http://repo2.maven.org/maven2//com/twitter/json/1.1.2/json-1.1.2.pom
Downloading: http://scala-tools.org/repo-releases/com/twitter/json/1.1.2/json-1.1.2.pom
3K downloaded
[WARNING] *** CHECKSUM FAILED - Error retrieving checksum file for com/twitter/json/1.1.2/json-1.1.2.pom
- IGNORING
Downloading: http://repo2.maven.org/maven2//net/lag/configgy/1.5.3/configgy-1.5.3.pom
Downloading: http://scala-tools.org/repo-releases/net/lag/configgy/1.5.3/configgy-1.5.3.pom
3K downloaded
[WARNING] *** CHECKSUM FAILED - Error retrieving checksum file for net/lag/configgy/1.5.3/configgy-1.5.3.pom
- IGNORING
Downloading: http://repo2.maven.org/maven2//org/scala-tools/vscaladoc/1.1-md-3/vscaladoc-1.1-md-3.pom
Downloading: http://scala-tools.org/repo-releases/org/scala-tools/vscaladoc/1.1-md-3/vscaladoc-1.1-md-3.pom
Downloading: http://scala-tools.org/repo-snapshots/org/scala-tools/vscaladoc/1.1-md-3/vscaladoc-1.1-md-3.pom
Downloading: http://repo.compass-project.org/org/scala-tools/vscaladoc/1.1-md-3/vscaladoc-1.1-md-3.pom
Downloading: http://www.lag.net/repo/org/scala-tools/vscaladoc/1.1-md-3/vscaladoc-1.1-md-3.pom
Downloading: http://people.apache.org/repo/m1-ibiblio-rsync-repository/org.scala-tools/poms/vscaladoc-1.1-md-3.pom
Downloading: http://repo1.maven.org/maven2/org/scala-tools/vscaladoc/1.1-md-3/vscaladoc-1.1-md-3.pom
Downloading: http://repo2.maven.org/maven2//com/twitter/xrayspecs/1.0.7/xrayspecs-1.0.7.pom
Downloading: http://scala-tools.org/repo-releases/com/twitter/xrayspecs/1.0.7/xrayspecs-1.0.7.pom
Downloading: http://scala-tools.org/repo-snapshots/com/twitter/xrayspecs/1.0.7/xrayspecs-1.0.7.pom
Downloading: http://repo.compass-project.org/com/twitter/xrayspecs/1.0.7/xrayspecs-1.0.7.pom
Downloading: http://www.lag.net/repo/com/twitter/xrayspecs/1.0.7/xrayspecs-1.0.7.pom
Downloading: http://people.apache.org/repo/m1-ibiblio-rsync-repository/com.twitter/poms/xrayspecs-1.0.7.pom
Downloading: http://repo1.maven.org/maven2/com/twitter/xrayspecs/1.0.7/xrayspecs-1.0.7.pom
Downloading: http://repo2.maven.org/maven2//org/hamcrest/hamcrest-all/1.1/hamcrest-all-1.1.pom
1073K downloaded
50K downloaded
61K downloaded
316K downloaded
3721K downloaded
164K downloaded
489K downloaded
1760K downloaded
133K downloaded
Downloading: http://repo2.maven.org/maven2//com/twitter/ostrich/1.1.16/ostrich-1.1.16.jar
Downloading: http://scala-tools.org/repo-releases/com/twitter/ostrich/1.1.16/ostrich-1.1.16.jar
Downloading: http://scala-tools.org/repo-snapshots/com/twitter/ostrich/1.1.16/ostrich-1.1.16.jar
Downloading: http://repo.compass-project.org/com/twitter/ostrich/1.1.16/ostrich-1.1.16.jar
Downloading: http://www.lag.net/repo/com/twitter/ostrich/1.1.16/ostrich-1.1.16.jar
170K downloaded
[WARNING] *** CHECKSUM FAILED - Error retrieving checksum file for com/twitter/ostrich/1.1.16/ostrich-1.1.16.jar
- IGNORING
Downloading: http://repo2.maven.org/maven2//commons-lang/commons-lang/2.2/commons-lang-2.2.jar
Downloading: http://repo2.maven.org/maven2//org/objenesis/objenesis/1.1/objenesis-1.1.jar
Downloading: http://repo2.maven.org/maven2//org/mockito/mockito-core/1.8.1/mockito-core-1.8.1.jar
Downloading: http://repo2.maven.org/maven2//com/twitter/json/1.1.2/json-1.1.2.jar
Downloading: http://scala-tools.org/repo-releases/com/twitter/json/1.1.2/json-1.1.2.jar
38K downloaded
[WARNING] *** CHECKSUM FAILED - Error retrieving checksum file for com/twitter/json/1.1.2/json-1.1.2.jar
- IGNORING
Downloading: http://repo2.maven.org/maven2//net/lag/configgy/1.5.3/configgy-1.5.3.jar
Downloading: http://scala-tools.org/repo-releases/net/lag/configgy/1.5.3/configgy-1.5.3.jar
308K downloaded
[WARNING] *** CHECKSUM FAILED - Error retrieving checksum file for net/lag/configgy/1.5.3/configgy-1.5.3.jar
- IGNORING
Downloading: http://repo2.maven.org/maven2//org/scala-tools/vscaladoc/1.1-md-3/vscaladoc-1.1-md-3.jar
Downloading: http://scala-tools.org/repo-releases/org/scala-tools/vscaladoc/1.1-md-3/vscaladoc-1.1-md-3.jar
Downloading: http://scala-tools.org/repo-snapshots/org/scala-tools/vscaladoc/1.1-md-3/vscaladoc-1.1-md-3.jar
Downloading: http://repo.compass-project.org/org/scala-tools/vscaladoc/1.1-md-3/vscaladoc-1.1-md-3.jar
Downloading: http://www.lag.net/repo/org/scala-tools/vscaladoc/1.1-md-3/vscaladoc-1.1-md-3.jar
276K downloaded
Downloading: http://repo2.maven.org/maven2//com/twitter/xrayspecs/1.0.7/xrayspecs-1.0.7.jar
Downloading: http://scala-tools.org/repo-releases/com/twitter/xrayspecs/1.0.7/xrayspecs-1.0.7.jar
Downloading: http://scala-tools.org/repo-snapshots/com/twitter/xrayspecs/1.0.7/xrayspecs-1.0.7.jar
Downloading: http://repo.compass-project.org/com/twitter/xrayspecs/1.0.7/xrayspecs-1.0.7.jar
Downloading: http://www.lag.net/repo/com/twitter/xrayspecs/1.0.7/xrayspecs-1.0.7.jar
Downloading: http://people.apache.org/repo/m1-ibiblio-rsync-repository/com.twitter/jars/xrayspecs-1.0.7.jar
Downloading: http://mirrors.ibiblio.org/pub/mirrors/maven2//com/twitter/xrayspecs/1.0.7/xrayspecs-1.0.7.jar
Downloading: http://download.java.net/maven/2//com/twitter/xrayspecs/1.0.7/xrayspecs-1.0.7.jar
Downloading: https://m2proxy.atlassian.com/repository/public//com/twitter/xrayspecs/1.0.7/xrayspecs-1.0.7.jar
Downloading: http://oauth.googlecode.com/svn/code/maven//com/twitter/xrayspecs/1.0.7/xrayspecs-1.0.7.jar
Downloading: http://scala-tools.org/repo-releases//com/twitter/xrayspecs/1.0.7/xrayspecs-1.0.7.jar
Downloading: http://maven.reucon.com/public//com/twitter/xrayspecs/1.0.7/xrayspecs-1.0.7.jar
Downloading: http://powermock.googlecode.com/svn/repo//com/twitter/xrayspecs/1.0.7/xrayspecs-1.0.7.jar
Downloading: http://scala-tools.org/repo-releases/testing//com/twitter/xrayspecs/1.0.7/xrayspecs-1.0.7.jar
Downloading: http://www.lag.net/repo//com/twitter/xrayspecs/1.0.7/xrayspecs-1.0.7.jar
Downloading: http://www.lag.net/nest//com/twitter/xrayspecs/1.0.7/xrayspecs-1.0.7.jar
16K downloaded
Downloading: http://repo2.maven.org/maven2//org/hamcrest/hamcrest-all/1.1/hamcrest-all-1.1.jar
[INFO] [compiler:compile]
[INFO] Nothing to compile - all classes are up to date
[INFO] [scala:compile {execution: default}]
[INFO] suggestion: remove the scalaVersion from pom.xml
[ERROR] <http://hudson.zones.apache.org/hudson/job/ESME/ws/server/src/main/scala>
[ERROR] <http://hudson.zones.apache.org/hudson/job/ESME/ws/server/src/main/scala/../scala>
[INFO] Compiling 51 source files to <http://hudson.zones.apache.org/hudson/job/ESME/ws/server/target/classes>
[WARNING] warning: there were deprecation warnings; re-run with -deprecation for details
[WARNING] warning: there were unchecked warnings; re-run with -unchecked for details
[WARNING] two warnings found
[INFO] [resources:testResources]
[INFO] Using default encoding to copy filtered resources.
[INFO] [compiler:testCompile]
[INFO] Nothing to compile - all classes are up to date
[INFO] [scala:testCompile {execution: default}]
[INFO] suggestion: remove the scalaVersion from pom.xml
[ERROR] <http://hudson.zones.apache.org/hudson/job/ESME/ws/server/src/test/scala>
[ERROR] <http://hudson.zones.apache.org/hudson/job/ESME/ws/server/src/test/scala/../scala>
[INFO] Compiling 7 source files to <http://hudson.zones.apache.org/hudson/job/ESME/ws/server/target/test-classes>
[WARNING] <http://hudson.zones.apache.org/hudson/job/ESME/ws/server/src/test/scala/org/apache/esme/api/ApiTest.scala>:67:
error: value \ is not a member of net.liftweb.common.Box[scala.xml.Elem]
[WARNING]         (resp.xml \ "@success").text must_== "true"
[WARNING]                   ^
[WARNING] <http://hudson.zones.apache.org/hudson/job/ESME/ws/server/src/test/scala/org/apache/esme/api/ApiTest.scala>:84:
error: overloaded method value post with alternatives (String,net.liftweb.http.testing.Response)(implicit
(String, org.apache.commons.httpclient.HttpClient, org.apache.commons.httpclient.HttpMethodBase)
=> org.apache.esme.api.ApiSpecs.ResponseType,(net.liftweb.http.testing.Response) =>
org.apache.commons.httpclient.methods.RequestEntity)org.apache.esme.api.ApiSpecs.ResponseType
<and> (String,org.apache.commons.httpclient.HttpClient,List[(String, String)],net.liftweb.http.testing.Response)(implicit
(String, org.apache.commons.httpclient.HttpClient, org.apache.commons.httpclient.HttpMethodBase)
=> org.apache.esme.api.ApiSpecs.ResponseType,(net.liftweb.http.testing.Response) =>
org.apache.commons.httpclient.methods.RequestEntity)org.apache.esme.api.ApiSpecs.ResponseType
cannot be applied to (java.lang.String,net.liftweb.util.Helpers.TheStrBindParam)
[WARNING]         login <- post[Response]("/api/login", "token" -> token) !@ "Failed
to log in" if (testSuccess(login))
[WARNING]                  ^
[WARNING] <http://hudson.zones.apache.org/hudson/job/ESME/ws/server/src/test/scala/org/apache/esme/api/API2Test.scala>:51:
error: overloaded method value post with alternatives (String,net.liftweb.http.testing.Response)(implicit
(String, org.apache.commons.httpclient.HttpClient, org.apache.commons.httpclient.HttpMethodBase)
=> org.apache.esme.api.Api2Specs.ResponseType,(net.liftweb.http.testing.Response) =>
org.apache.commons.httpclient.methods.RequestEntity)org.apache.esme.api.Api2Specs.ResponseType
<and> (String,org.apache.commons.httpclient.HttpClient,List[(String, String)],net.liftweb.http.testing.Response)(implicit
(String, org.apache.commons.httpclient.HttpClient, org.apache.commons.httpclient.HttpMethodBase)
=> org.apache.esme.api.Api2Specs.ResponseType,(net.liftweb.http.testing.Response) =>
org.apache.commons.httpclient.methods.RequestEntity)org.apache.esme.api.Api2Specs.ResponseType
cannot be applied to (java.lang.String,net.liftweb.util.Helpers.TheStrBindParam)
[WARNING]   val post_session = post[Response]("session", "token" -> token)
[WARNING]                      ^
[WARNING] <http://hudson.zones.apache.org/hudson/job/ESME/ws/server/src/test/scala/org/apache/esme/api/API2Test.scala>:94:
error: overloaded method value post with alternatives (String,net.liftweb.http.testing.Response)(implicit
(String, org.apache.commons.httpclient.HttpClient, org.apache.commons.httpclient.HttpMethodBase)
=> org.apache.esme.api.Api2Specs.ResponseType,(net.liftweb.http.testing.Response) =>
org.apache.commons.httpclient.methods.RequestEntity)org.apache.esme.api.Api2Specs.ResponseType
<and> (String,org.apache.commons.httpclient.HttpClient,List[(String, String)],net.liftweb.http.testing.Response)(implicit
(String, org.apache.commons.httpclient.HttpClient, org.apache.commons.httpclient.HttpMethodBase)
=> org.apache.esme.api.Api2Specs.ResponseType,(net.liftweb.http.testing.Response) =>
org.apache.commons.httpclient.methods.RequestEntity)org.apache.esme.api.Api2Specs.ResponseType
cannot be applied to (java.lang.String,net.liftweb.util.Helpers.TheStrBindParam)
[WARNING]           session <- post[Response]("session", "token" -> "000000")
[WARNING]                      ^
[WARNING] four errors found
[HUDSON] Archiving <http://hudson.zones.apache.org/hudson/job/ESME/ws/server/pom.xml>
to /export/home/hudson/hudson/jobs/ESME/modules/org.apache.esme$esme-server/builds/2010-06-08_12-12-29/archive/org.apache.esme/esme-server/apache-esme-1.0-RC1-incubating/pom.xml
[INFO] ------------------------------------------------------------------------
[ERROR] BUILD FAILURE
[INFO] ------------------------------------------------------------------------
[INFO] command line returned non-zero value:1
[INFO] ------------------------------------------------------------------------
[INFO] For more information, run Maven with the -e switch
[INFO] ------------------------------------------------------------------------
[INFO] Total time: 4 minutes 33 seconds
[INFO] Finished at: Tue Jun 08 12:18:42 GMT+00:00 2010
[INFO] Final Memory: 33M/218M
[INFO] ------------------------------------------------------------------------
Waiting for Hudson to finish collecting data
Sending e-mails to: esme-dev@incubator.apache.org
channel stopped
[WARNINGS] Skipping publisher since build result is FAILURE


Mime
View raw message