incubator-esme-dev mailing list archives

Site index · List index
Message view « Date » · « Thread »
Top « Date » · « Thread »
From Apache Hudson Server <hud...@hudson.zones.apache.org>
Subject Build failed in Hudson: ESME » Apache Enterprise Social Messaging Experiment (ESME) #239
Date Mon, 31 May 2010 12:16:00 GMT
See <http://hudson.zones.apache.org/hudson/job/ESME/org.apache.esme$esme-server/239/>

------------------------------------------
<===[HUDSON REMOTING CAPACITY]===>channel started
   Executing Maven:  -B -f <http://hudson.zones.apache.org/hudson/job/ESME/org.apache.esme$esme-server/ws/pom.xml>
clean install[INFO] Scanning for projects...
[INFO] ------------------------------------------------------------------------
[INFO] Building Apache Enterprise Social Messaging Experiment (ESME)
[INFO]    task-segment: [clean, install]
[INFO] ------------------------------------------------------------------------

[INFO] [clean:clean]
[INFO] Deleting directory <http://hudson.zones.apache.org/hudson/job/ESME/org.apache.esme$esme-server/ws/target>
[INFO] [resources:resources]
[INFO] Using default encoding to copy filtered resources.
[INFO] [yuicompressor:compress {execution: default}]
[INFO] jquery-ui-1.7.2.custom.css (27409b) -> jquery-ui-1.7.2.custom.css (22477b)[82%]
[INFO] esme.css (1455b) -> esme.css (272b)[18%]
[INFO] tipTip.css (3264b) -> tipTip.css (2106b)[64%]
[INFO] print.css (2458b) -> print.css (921b)[37%]
[INFO] layout.css (1538b) -> layout.css (219b)[14%]
[INFO] parseTheme.css (18005b) -> parseTheme.css (14973b)[83%]
[INFO] dialog.css (1741b) -> dialog.css (617b)[35%]
[INFO] style.css (13876b) -> style.css (8972b)[64%]
[INFO] esme-ie.css (1196b) -> esme-ie.css (156b)[13%]
[INFO] ui.tabs.css (3409b) -> ui.tabs.css (1294b)[37%]
[INFO] print-ie.css (1232b) -> print-ie.css (69b)[5%]
[INFO] jquery.validate.js (37133b) -> jquery.validate.js (21077b)[56%]
[INFO] display_single_message.js (5141b) -> display_single_message.js (1679b)[32%]
[INFO] esme_table_sorter_users.js (1241b) -> esme_table_sorter_users.js (133b)[10%]
[INFO] esme_table_sorter_track.js (1229b) -> esme_table_sorter_track.js (109b)[8%]
[INFO] dialog_track.js (1854b) -> dialog_track.js (1035b)[55%]
[INFO] pretty.js (1103b) -> pretty.js (525b)[47%]
[INFO] jquery.TipTip.js (6871b) -> jquery.TipTip.js (3096b)[45%]
[INFO] esme_streams.js (1219b) -> esme_streams.js (52b)[4%]
[INFO] jquery-ui-1.7.2.custom.min.js (29978b) -> jquery-ui-1.7.2.custom.min.js (29788b)[99%]
[INFO] dialog_pool.js (2550b) -> dialog_pool.js (1614b)[63%]
[INFO] esme.js (1095b) -> esme.js (34b)[3%]
[INFO] esme_table_sorter_tag.js (1228b) -> esme_table_sorter_tag.js (109b)[8%]
[INFO] esme_table_sorter_action.js (1221b) -> esme_table_sorter_action.js (109b)[8%]
[INFO] dialog_action.js (1754b) -> dialog_action.js (1092b)[62%]
[INFO] display_messages.js (5597b) -> display_messages.js (1840b)[32%]
[INFO] esme_table_sorter.js (1206b) -> esme_table_sorter.js (108b)[8%]
[INFO] esme_table_sorter_token.js (1249b) -> esme_table_sorter_token.js (126b)[10%]
[INFO] dialog_token.js (1627b) -> dialog_token.js (1023b)[62%]
[INFO] jquery.tablesorter.pager.js (4442b) -> jquery.tablesorter.pager.js (2226b)[50%]
[INFO] esme_validate.js (1135b) -> esme_validate.js (62b)[5%]
[INFO] esme_tool_tip.js (1147b) -> esme_tool_tip.js (73b)[6%]
[INFO] total input (185603b) -> output (117986b)[63%]
[INFO] nb warnings: 0, nb errors: 0
Downloading: http://repo2.maven.org/maven2//com/twitter/xrayspecs/1.0.4/xrayspecs-1.0.4.pom
Downloading: http://scala-tools.org/repo-releases/com/twitter/xrayspecs/1.0.4/xrayspecs-1.0.4.pom
Downloading: http://scala-tools.org/repo-snapshots/com/twitter/xrayspecs/1.0.4/xrayspecs-1.0.4.pom
Downloading: http://repo.compass-project.org/com/twitter/xrayspecs/1.0.4/xrayspecs-1.0.4.pom
Downloading: http://www.lag.net/nest/com/twitter/xrayspecs/1.0.4/xrayspecs-1.0.4.pom
Downloading: http://www.lag.net/repo/com/twitter/xrayspecs/1.0.4/xrayspecs-1.0.4.pom
Downloading: http://people.apache.org/repo/m1-ibiblio-rsync-repository/com.twitter/poms/xrayspecs-1.0.4.pom
Downloading: http://repo1.maven.org/maven2/com/twitter/xrayspecs/1.0.4/xrayspecs-1.0.4.pom
[INFO] [compiler:compile]
[INFO] Nothing to compile - all classes are up to date
[INFO] [scala:compile {execution: default}]
[INFO] suggestion: remove the scalaVersion from pom.xml
[ERROR] <http://hudson.zones.apache.org/hudson/job/ESME/org.apache.esme$esme-server/ws/src/main/scala>
[ERROR] <http://hudson.zones.apache.org/hudson/job/ESME/org.apache.esme$esme-server/ws/src/main/scala/../scala>
[INFO] Compiling 51 source files to <http://hudson.zones.apache.org/hudson/job/ESME/org.apache.esme$esme-server/ws/target/classes>
[WARNING] warning: there were deprecation warnings; re-run with -deprecation for details
[WARNING] warning: there were unchecked warnings; re-run with -unchecked for details
[WARNING] two warnings found
[INFO] [resources:testResources]
[INFO] Using default encoding to copy filtered resources.
[INFO] [compiler:testCompile]
[INFO] Nothing to compile - all classes are up to date
[INFO] [scala:testCompile {execution: default}]
[INFO] suggestion: remove the scalaVersion from pom.xml
[ERROR] <http://hudson.zones.apache.org/hudson/job/ESME/org.apache.esme$esme-server/ws/src/test/scala>
[ERROR] <http://hudson.zones.apache.org/hudson/job/ESME/org.apache.esme$esme-server/ws/src/test/scala/../scala>
[INFO] Compiling 7 source files to <http://hudson.zones.apache.org/hudson/job/ESME/org.apache.esme$esme-server/ws/target/test-classes>
[WARNING] <http://hudson.zones.apache.org/hudson/job/ESME/org.apache.esme$esme-server/ws/src/test/scala/org/apache/esme/api/ApiTest.scala>:84:
error: no implicit argument matching parameter type (String, org.apache.commons.httpclient.HttpClient,
org.apache.commons.httpclient.HttpMethodBase) => T was found.
[WARNING]         login <- post("/api/login", "token" -> token) !@ "Failed to log in"
if (testSuccess(login))
[WARNING]                  ^
[WARNING] <http://hudson.zones.apache.org/hudson/job/ESME/org.apache.esme$esme-server/ws/src/test/scala/org/apache/esme/api/API2Test.scala>:51:
error: no implicit argument matching parameter type (String, org.apache.commons.httpclient.HttpClient,
org.apache.commons.httpclient.HttpMethodBase) => Nothing was found.
[WARNING]   val post_session = post("session", "token" -> token) 
[WARNING]                      ^
[WARNING] <http://hudson.zones.apache.org/hudson/job/ESME/org.apache.esme$esme-server/ws/src/test/scala/org/apache/esme/api/API2Test.scala>:94:
error: no implicit argument matching parameter type (String, org.apache.commons.httpclient.HttpClient,
org.apache.commons.httpclient.HttpMethodBase) => T was found.
[WARNING]           session <- post("session", "token" -> "000000")
[WARNING]                      ^
[WARNING] three errors found
[HUDSON] Archiving <http://hudson.zones.apache.org/hudson/job/ESME/org.apache.esme$esme-server/ws/pom.xml>
to /export/home/hudson/hudson/jobs/ESME/modules/org.apache.esme$esme-server/builds/2010-05-31_12-12-25/archive/org.apache.esme/esme-server/apache-esme-1.0-RC1-incubating/pom.xml
[INFO] ------------------------------------------------------------------------
[ERROR] BUILD FAILURE
[INFO] ------------------------------------------------------------------------
[INFO] command line returned non-zero value:1
[INFO] ------------------------------------------------------------------------
[INFO] For more information, run Maven with the -e switch
[INFO] ------------------------------------------------------------------------
[INFO] Total time: 2 minutes 10 seconds
[INFO] Finished at: Mon May 31 12:16:13 GMT+00:00 2010
[INFO] Final Memory: 31M/217M
[INFO] ------------------------------------------------------------------------
Waiting for Hudson to finish collecting data


Mime
View raw message