incubator-esme-dev mailing list archives

Site index · List index
Message view « Date » · « Thread »
Top « Date » · « Thread »
From Markus Kohler <markus.koh...@gmail.com>
Subject Compile error
Date Thu, 22 Oct 2009 20:36:32 GMT
Hi all,I can't build the latest version from svn:

[WARNING]   def retweeted(param: QueryParam[Mailbox]): Box[TwitterResponse]
=
[WARNING]                                              ^
[WARNING]
C:\java\esme\trunk\server\src\main\scala\org\apache\esme\api\TwitterAP
I.scala:290: error: not found: type Box
[WARNING]   def createFriendship(other: String): Box[TwitterResponse] = {
[WARNING]                                        ^
[WARNING]
C:\java\esme\trunk\server\src\main\scala\org\apache\esme\api\TwitterAP
I.scala:301: error: not found: type Box
[WARNING]   def destroyFriendship(other: String): Box[TwitterResponse] = {
[WARNING]                                         ^
[WARNING]
C:\java\esme\trunk\server\src\main\scala\org\apache\esme\api\TwitterAP
I.scala:312: error: not found: type Box
[WARNING]   def existsFriendship(): Box[TwitterResponse] = {
[WARNING]                           ^
[WARNING]
C:\java\esme\trunk\server\src\main\scala\org\apache\esme\api\TwitterAP
I.scala:187: error: not found: type Box
[WARNING]   def verifyCredentials(): Box[TwitterResponse] = {
[WARNING]                            ^
[WARNING]
C:\java\esme\trunk\server\src\main\scala\org\apache\esme\api\TwitterAP
I.scala:321: error: not found: type Box
[WARNING]   def endSession(): Box[TwitterResponse] = {
[WARNING]                     ^
[WARNING]
C:\java\esme\trunk\server\src\main\scala\org\apache\esme\api\TwitterAP
I.scala:341: error: not found: type Box
[WARNING]   private def calcUser(): Box[User] = {
[WARNING]                           ^
[WARNING]
C:\java\esme\trunk\server\src\main\scala\org\apache\esme\api\TwitterAP
I.scala:232: error: not found: value Full
[WARNING]     Full(Left("direct_messages" -> Nil))
[WARNING]     ^
[WARNING]
C:\java\esme\trunk\server\src\main\scala\org\apache\esme\api\TwitterAP
I.scala:240: error: not found: value Full
[WARNING]     Full(Right(Map("statuses" -> ("status", statusList) )))
[WARNING]     ^
[WARNING] 232 errors found
[INFO]
------------------------------------------------------------------------
[ERROR] BUILD FAILURE


Anyone can reproduce that?
I'm on Vista and it worked berfore.
Regards,
Markus

Mime
  • Unnamed multipart/alternative (inline, None, 0 bytes)
View raw message