incubator-empire-db-dev mailing list archives

Site index · List index
Message view « Date » · « Thread »
Top « Date » · « Thread »
From Apache Jenkins Server <jenk...@builds.apache.org>
Subject Build failed in Jenkins: Empire-DB snapshot #354
Date Sat, 03 Dec 2011 11:33:30 GMT
See <https://builds.apache.org/job/Empire-DB%20snapshot/354/changes>

Changes:

[doebele] EMPIREDB-126
additional overload for DBDatabase.queryOptionList to allow provision of an Options object.

------------------------------------------
[...truncated 642 lines...]
AU        empire-db-struts2/src/main/java/org/apache/empire/struts2/jsp/tags/FormTag.java
AU        empire-db-struts2/src/main/java/org/apache/empire/struts2/jsp/tags/MenuTag.java
AU        empire-db-struts2/src/main/java/org/apache/empire/struts2/jsp/tags/DataValueTag.java
AU        empire-db-struts2/src/main/java/org/apache/empire/struts2/jsp/tags/CalendarTag.java
AU        empire-db-struts2/src/main/java/org/apache/empire/struts2/jsp/tags/ActionErrorsTag.java
AU        empire-db-struts2/src/main/java/org/apache/empire/struts2/jsp/tags/ButtonTag.java
AU        empire-db-struts2/src/main/java/org/apache/empire/struts2/jsp/tags/EmpireValueTagSupport.java
AU        empire-db-struts2/src/main/java/org/apache/empire/struts2/jsp/tags/FloatClearTag.java
AU        empire-db-struts2/src/main/java/org/apache/empire/struts2/jsp/tags/EmpireTagSupport.java
AU        empire-db-struts2/src/main/java/org/apache/empire/struts2/jsp/tags/TableRowTag.java
AU        empire-db-struts2/src/main/java/org/apache/empire/struts2/jsp/tags/SelectTag.java
AU        empire-db-struts2/src/main/java/org/apache/empire/struts2/jsp/tags/TableDataTag.java
AU        empire-db-struts2/src/main/java/org/apache/empire/struts2/jsp/tags/package.html
AU        empire-db-struts2/src/main/java/org/apache/empire/struts2/jsp/tags/ActionMessageTag.java
AU        empire-db-struts2/src/main/java/org/apache/empire/struts2/jsp/tags/MenuItemTag.java
AU        empire-db-struts2/src/main/java/org/apache/empire/struts2/jsp/tags/ListPageInfoTag.java
AU        empire-db-struts2/src/main/java/org/apache/empire/struts2/jsp/tags/TextTag.java
AU        empire-db-struts2/src/main/java/org/apache/empire/struts2/jsp/tags/CheckboxTag.java
AU        empire-db-struts2/src/main/java/org/apache/empire/struts2/jsp/tags/FormSubmitTag.java
AU        empire-db-struts2/src/main/java/org/apache/empire/struts2/jsp/tags/TableHeadColumnTag.java
AU        empire-db-struts2/src/main/java/org/apache/empire/struts2/jsp/tags/ItemListTag.java
AU        empire-db-struts2/src/main/java/org/apache/empire/struts2/jsp/tags/FormPartTag.java
AU        empire-db-struts2/src/main/java/org/apache/empire/struts2/jsp/tags/RadioButtonTag.java
A         empire-db-struts2/src/main/java/org/apache/empire/struts2/jsp/tags/flow
AU        empire-db-struts2/src/main/java/org/apache/empire/struts2/jsp/tags/flow/ElseIfTag.java
AU        empire-db-struts2/src/main/java/org/apache/empire/struts2/jsp/tags/flow/ElseTag.java
AU        empire-db-struts2/src/main/java/org/apache/empire/struts2/jsp/tags/flow/SetTag.java
AU        empire-db-struts2/src/main/java/org/apache/empire/struts2/jsp/tags/flow/IfTag.java
AU        empire-db-struts2/src/main/java/org/apache/empire/struts2/jsp/tags/flow/package.html
AU        empire-db-struts2/src/main/java/org/apache/empire/struts2/jsp/tags/LinkTag.java
AU        empire-db-struts2/src/main/java/org/apache/empire/struts2/jsp/tags/ListPageBarTag.java
AU        empire-db-struts2/src/main/java/org/apache/empire/struts2/jsp/tags/InputControlTag.java
AU        empire-db-struts2/src/main/java/org/apache/empire/struts2/jsp/tags/ParamTag.java
AU        empire-db-struts2/src/main/java/org/apache/empire/struts2/jsp/tags/FlexDivTag.java
AU        empire-db-struts2/src/main/java/org/apache/empire/struts2/jsp/tags/TableHeadRowTag.java
A         empire-db-struts2/src/main/java/org/apache/empire/struts2/action
AU        empire-db-struts2/src/main/java/org/apache/empire/struts2/action/ActionItemProperty.java
AU        empire-db-struts2/src/main/java/org/apache/empire/struts2/action/ActionErrorProvider.java
AU        empire-db-struts2/src/main/java/org/apache/empire/struts2/action/RequestParamProvider.java
AU        empire-db-struts2/src/main/java/org/apache/empire/struts2/action/ActionAccessValidator.java
AU        empire-db-struts2/src/main/java/org/apache/empire/struts2/action/Disposable.java
AU        empire-db-struts2/src/main/java/org/apache/empire/struts2/action/ErrorInfo.java
AU        empire-db-struts2/src/main/java/org/apache/empire/struts2/action/WebAction.java
AU        empire-db-struts2/src/main/java/org/apache/empire/struts2/action/ListPagingInfo.java
AU        empire-db-struts2/src/main/java/org/apache/empire/struts2/action/ListSortingInfo.java
AU        empire-db-struts2/src/main/java/org/apache/empire/struts2/action/ExceptionAware.java
AU        empire-db-struts2/src/main/java/org/apache/empire/struts2/action/package.html
A         empire-db-struts2/src/main/java/org/apache/empire/struts2/web
AU        empire-db-struts2/src/main/java/org/apache/empire/struts2/web/UrlHelperEx.java
AU        empire-db-struts2/src/main/java/org/apache/empire/struts2/web/WebApplication.java
AU        empire-db-struts2/src/main/java/org/apache/empire/struts2/web/EmpirePortletDispatcher.java
AU        empire-db-struts2/src/main/java/org/apache/empire/struts2/web/ResponseContext.java
A         empire-db-struts2/src/main/java/org/apache/empire/struts2/web/servlet
AU        empire-db-struts2/src/main/java/org/apache/empire/struts2/web/servlet/ServletResponseWrapper.java
AU        empire-db-struts2/src/main/java/org/apache/empire/struts2/web/servlet/ServletSessionWrapper.java
AU        empire-db-struts2/src/main/java/org/apache/empire/struts2/web/servlet/ServletContextWrapper.java
AU        empire-db-struts2/src/main/java/org/apache/empire/struts2/web/servlet/ServletRequestWrapper.java
AU        empire-db-struts2/src/main/java/org/apache/empire/struts2/web/EmpireThreadManager.java
A         empire-db-struts2/src/main/java/org/apache/empire/struts2/web/portlet
AU        empire-db-struts2/src/main/java/org/apache/empire/struts2/web/portlet/PortletContextWrapper.java
AU        empire-db-struts2/src/main/java/org/apache/empire/struts2/web/portlet/PortletRequestWrapper.java
AU        empire-db-struts2/src/main/java/org/apache/empire/struts2/web/portlet/PortletResponseWrapper.java
AU        empire-db-struts2/src/main/java/org/apache/empire/struts2/web/portlet/PortletSessionWrapper.java
AU        empire-db-struts2/src/main/java/org/apache/empire/struts2/web/EmpireStrutsDispatcher.java
AU        empire-db-struts2/src/main/java/org/apache/empire/struts2/web/package.html
AU        empire-db-struts2/src/main/java/org/apache/empire/struts2/web/FieldErrors.java
AU        empire-db-struts2/src/main/java/org/apache/empire/struts2/web/WebSession.java
AU        empire-db-struts2/src/main/java/org/apache/empire/struts2/web/AppContext.java
AU        empire-db-struts2/src/main/java/org/apache/empire/struts2/web/WebRequest.java
AU        empire-db-struts2/src/main/java/org/apache/empire/struts2/web/SessionContext.java
AU        empire-db-struts2/src/main/java/org/apache/empire/struts2/web/EmpirePortletResult.java
AU        empire-db-struts2/src/main/java/org/apache/empire/struts2/web/DefaultWebRequest.java
AU        empire-db-struts2/src/main/java/org/apache/empire/struts2/web/RequestContext.java
AU        empire-db-struts2/src/main/java/org/apache/empire/struts2/web/EmpireFilterDispatcher.java
A         empire-db-struts2/src/main/resources
A         empire-db-struts2/src/main/resources/META-INF
AU        empire-db-struts2/src/main/resources/META-INF/empire-tags.tld
AU        empire-db-struts2/src/main/resources/struts-empire.xml
AU        empire-db-struts2/src/main/resources/struts-empire-portlet.xml
AU        empire-db-struts2/pom.xml
AU        DISCLAIMER.txt
AU        pom.xml
AU        README.txt
 U        .
At revision 1209891
[trunk] $ /home/hudson/tools/maven/apache-maven-2.2.1/bin/mvn -PCI -B clean install deploy
[INFO] Scanning for projects...
[INFO] Reactor build order: 
[INFO]   Apache Empire-db
[INFO]   Apache Empire-db Core
[INFO]   Apache Empire-db Struts2 Extension
[INFO]   Apache Empire-db Code Generator
[INFO]   Apache Empire-db Maven Plugin
[INFO]   Apache Empire-db Examples
[INFO]   Apache Empire-db Basic Example
[INFO]   Apache Empire-db Advanced Example
[INFO]   Apache Empire-db CXF Example
[INFO]   Apache Empire-db Spring Example
[INFO]   Apache Empire-db Struts2 Example
[INFO]   Apache Empire-db Struts2/CXF Example
[INFO]   Apache Empire-db JSF2 Example
[INFO] ------------------------------------------------------------------------
[INFO] Building Apache Empire-db
[INFO]    task-segment: [clean, install, deploy]
[INFO] ------------------------------------------------------------------------
[INFO] [clean:clean {execution: default-clean}]
[INFO] [remote-resources:process {execution: default}]
[WARNING] POM for 'biz.aQute:bndlib:pom:1.15.0:runtime' is invalid.

Its dependencies (if any) will NOT be available to the current build.
[INFO] [bundle:manifest {execution: bundle-manifest}]
[WARNING] Ignoring project type pom - supportedProjectTypes = [jar, bundle]
[INFO] [site:attach-descriptor {execution: default-attach-descriptor}]
[INFO] Preparing source:jar
[WARNING] Removing: jar from forked lifecycle, to prevent recursive invocation.
[INFO] No goals needed for project - skipping
[INFO] [source:jar {execution: attach-sources}]
[INFO] [javadoc:jar {execution: attach-javadocs}]
[INFO] Not executing Javadoc as the project is not a Java classpath-capable package
[INFO] [license:check {execution: default}]
[INFO] Checking licenses...
[WARNING] Property 'strictCheck' is not enabled. Please consider adding <strictCheck>true</strictCheck>
in your pom.xml file.
[WARNING] See http://code.google.com/p/maven-license-plugin/wiki/Configuration for more information.
[INFO] [apache-rat:check {execution: default}]
[INFO] Exclude: release.properties
[INFO] Exclude: **/target/**
[INFO] Exclude: **/dependencies.txt
[INFO] Exclude: **/.settings/**
[INFO] Exclude: **/.project
[INFO] Exclude: **/.classpath
[INFO] Exclude: **/.tomcatplugin
[INFO] Exclude: **/hsqldb/sample.*
[INFO] [install:install {execution: default-install}]
[INFO] Installing /x1/jenkins/jenkins-slave/workspace/Empire-DB snapshot/trunk/pom.xml to
/home/jenkins/.m2/repository/org/apache/empire-db/empire-db-parent/2.2.1-incubating-SNAPSHOT/empire-db-parent-2.2.1-incubating-SNAPSHOT.pom
[INFO] [remote-resources:process {execution: default}]
[INFO] [bundle:manifest {execution: bundle-manifest}]
[WARNING] Ignoring project type pom - supportedProjectTypes = [jar, bundle]
[INFO] [site:attach-descriptor {execution: default-attach-descriptor}]
[INFO] Preparing source:jar
[WARNING] Removing: jar from forked lifecycle, to prevent recursive invocation.
[INFO] No goals needed for project - skipping
[INFO] [source:jar {execution: attach-sources}]
[INFO] [javadoc:jar {execution: attach-javadocs}]
[INFO] Not executing Javadoc as the project is not a Java classpath-capable package
[INFO] [license:check {execution: default}]
[INFO] Checking licenses...
[WARNING] Property 'strictCheck' is not enabled. Please consider adding <strictCheck>true</strictCheck>
in your pom.xml file.
[WARNING] See http://code.google.com/p/maven-license-plugin/wiki/Configuration for more information.
[INFO] [apache-rat:check {execution: default}]
[INFO] Exclude: release.properties
[INFO] Exclude: **/target/**
[INFO] Exclude: **/dependencies.txt
[INFO] Exclude: **/.settings/**
[INFO] Exclude: **/.project
[INFO] Exclude: **/.classpath
[INFO] Exclude: **/.tomcatplugin
[INFO] Exclude: **/hsqldb/sample.*
[INFO] [install:install {execution: default-install}]
[INFO] Installing /x1/jenkins/jenkins-slave/workspace/Empire-DB snapshot/trunk/pom.xml to
/home/jenkins/.m2/repository/org/apache/empire-db/empire-db-parent/2.2.1-incubating-SNAPSHOT/empire-db-parent-2.2.1-incubating-SNAPSHOT.pom
[INFO] [deploy:deploy {execution: default-deploy}]
[INFO] Retrieving previous build number from apache.snapshots.https
Uploading: https://repository.apache.org/content/repositories/snapshots/org/apache/empire-db/empire-db-parent/2.2.1-incubating-SNAPSHOT/empire-db-parent-2.2.1-incubating-20111203.113319-18.pom
18K uploaded  (empire-db-parent-2.2.1-incubating-20111203.113319-18.pom)
[INFO] Retrieving previous metadata from apache.snapshots.https
[INFO] Uploading repository metadata for: 'snapshot org.apache.empire-db:empire-db-parent:2.2.1-incubating-SNAPSHOT'
[INFO] Retrieving previous metadata from apache.snapshots.https
[INFO] Uploading repository metadata for: 'artifact org.apache.empire-db:empire-db-parent'
[INFO] ------------------------------------------------------------------------
[INFO] Building Apache Empire-db Core
[INFO]    task-segment: [clean, install, deploy]
[INFO] ------------------------------------------------------------------------
[INFO] [clean:clean {execution: default-clean}]
[INFO] [remote-resources:process {execution: default}]
[debug] execute contextualize
[INFO] [resources:resources {execution: default-resources}]
[INFO] Using 'UTF-8' encoding to copy filtered resources.
[INFO] Copying 0 resource
[INFO] Copying 4 resources
[INFO] [compiler:compile {execution: default-compile}]
[INFO] Compiling 121 source files to /x1/jenkins/jenkins-slave/workspace/Empire-DB snapshot/trunk/empire-db/target/classes
[INFO] [bundle:manifest {execution: bundle-manifest}]
[WARNING] Warning in manifest for org.apache.empire-db:empire-db:jar:2.2.1-incubating-SNAPSHOT
: Superfluous export-package instructions: [org, org.apache, org.apache.empire.db.expr, org.apache.empire]
[WARNING] Warning in manifest for org.apache.empire-db:empire-db:jar:2.2.1-incubating-SNAPSHOT
: Did not find matching referal for org.apache.empire*
[debug] execute contextualize
[INFO] [resources:testResources {execution: default-testResources}]
[INFO] Using 'UTF-8' encoding to copy filtered resources.
[INFO] Copying 1 resource
[INFO] Copying 4 resources
[INFO] [compiler:testCompile {execution: default-testCompile}]
[INFO] Compiling 19 source files to /x1/jenkins/jenkins-slave/workspace/Empire-DB snapshot/trunk/empire-db/target/test-classes
[INFO] [surefire:test {execution: default-test}]
[INFO] Surefire report directory: /x1/jenkins/jenkins-slave/workspace/Empire-DB snapshot/trunk/empire-db/target/surefire-reports

-------------------------------------------------------
 T E S T S
-------------------------------------------------------
Running org.apache.empire.db.DBCommandTest
Tests run: 1, Failures: 0, Errors: 0, Skipped: 0, Time elapsed: 0.082 sec
Running org.apache.empire.db.IntegerTest
Tests run: 4, Failures: 0, Errors: 0, Skipped: 1, Time elapsed: 1.252 sec
Running org.apache.empire.db.expr.set.DBSetExprTest
Tests run: 9, Failures: 0, Errors: 0, Skipped: 0, Time elapsed: 0.01 sec
Running org.apache.empire.db.hsql.DBDatabaseDriverHSqlTest
Tests run: 1, Failures: 0, Errors: 0, Skipped: 0, Time elapsed: 0.015 sec
Running org.apache.empire.db.mssql.DBDatabaseDriverMSSqlTest
Tests run: 1, Failures: 0, Errors: 0, Skipped: 1, Time elapsed: 0.001 sec
Running org.apache.empire.db.SerializeTest
Tests run: 1, Failures: 0, Errors: 0, Skipped: 0, Time elapsed: 0.058 sec
Running org.apache.empire.db.PreparedStatementTest
Tests run: 1, Failures: 0, Errors: 0, Skipped: 0, Time elapsed: 0.012 sec
Running org.apache.empire.commons.AttributesTest
Tests run: 5, Failures: 0, Errors: 0, Skipped: 0, Time elapsed: 0.017 sec
Running org.apache.empire.commons.ErrorsTest
Tests run: 2, Failures: 0, Errors: 0, Skipped: 0, Time elapsed: 0.003 sec
Running org.apache.empire.commons.StringUtilsTest
Tests run: 14, Failures: 1, Errors: 0, Skipped: 0, Time elapsed: 0.012 sec <<< FAILURE!
Running org.apache.empire.commons.OptionsTest
Tests run: 22, Failures: 0, Errors: 0, Skipped: 0, Time elapsed: 0.017 sec
Running org.apache.empire.commons.OptionEntryTest
Tests run: 3, Failures: 0, Errors: 0, Skipped: 0, Time elapsed: 0.002 sec
Running org.apache.empire.commons.DateUtilsTest
Tests run: 16, Failures: 0, Errors: 0, Skipped: 0, Time elapsed: 0.032 sec
Running org.apache.empire.commons.ObjectUtilsTest
Tests run: 18, Failures: 0, Errors: 0, Skipped: 3, Time elapsed: 0.019 sec
Running org.apache.empire.commons.ErrorTypeTest
Tests run: 1, Failures: 0, Errors: 0, Skipped: 0, Time elapsed: 0.001 sec

Results :

Failed tests: 
  testArrayToString(org.apache.empire.commons.StringUtilsTest)

Tests run: 99, Failures: 1, Errors: 0, Skipped: 5

[INFO] ------------------------------------------------------------------------
[ERROR] BUILD FAILURE
[INFO] ------------------------------------------------------------------------
[INFO] There are test failures.

Please refer to /x1/jenkins/jenkins-slave/workspace/Empire-DB snapshot/trunk/empire-db/target/surefire-reports
for the individual test results.
[INFO] ------------------------------------------------------------------------
[INFO] For more information, run Maven with the -e switch
[INFO] ------------------------------------------------------------------------
[INFO] Total time: 16 seconds
[INFO] Finished at: Sat Dec 03 11:33:26 GMT 2011
[INFO] Final Memory: 63M/436M
[INFO] ------------------------------------------------------------------------
Build step 'Invoke top-level Maven targets' marked build as failure
Recording test results


Mime
View raw message