incubator-ctakes-notifications mailing list archives

Site index · List index
Message view « Date » · « Thread »
Top « Date » · « Thread »
From Apache Jenkins Server <jenk...@builds.apache.org>
Subject Build failed in Jenkins: ctakes-trunk-compiletest » Apache cTAKES core #178
Date Thu, 14 Feb 2013 20:40:03 GMT
See <https://builds.apache.org/job/ctakes-trunk-compiletest/org.apache.ctakes$ctakes-core/178/>

------------------------------------------
projectStarted org.apache.ctakes:ctakes-core:3.1.0-incubating-SNAPSHOT
[INFO]                                                                         
[INFO] ------------------------------------------------------------------------
[INFO] Building Apache cTAKES core 3.1.0-incubating-SNAPSHOT
[INFO] ------------------------------------------------------------------------
Downloading: http://repo.maven.apache.org/maven2/edu/mit/findstruct/findstructapi/0.0.1/findstructapi-0.0.1.pom
Downloaded: http://repo.maven.apache.org/maven2/edu/mit/findstruct/findstructapi/0.0.1/findstructapi-0.0.1.pom
(990 B at 2.1 KB/sec)
Downloading: http://repo.maven.apache.org/maven2/com/googlecode/armbrust-file-utils/sqlwrapper/0.0.1/sqlwrapper-0.0.1.pom
Downloaded: http://repo.maven.apache.org/maven2/com/googlecode/armbrust-file-utils/sqlwrapper/0.0.1/sqlwrapper-0.0.1.pom
(855 B at 1.7 KB/sec)
Downloading: http://repo.maven.apache.org/maven2/net/sourceforge/openai/openaifsm/0.0.1/openaifsm-0.0.1.pom
Downloaded: http://repo.maven.apache.org/maven2/net/sourceforge/openai/openaifsm/0.0.1/openaifsm-0.0.1.pom
(892 B at 2.0 KB/sec)
Downloading: http://repo.maven.apache.org/maven2/edu/mit/findstruct/findstructapi/0.0.1/findstructapi-0.0.1.jar
Downloading: http://repo.maven.apache.org/maven2/com/googlecode/armbrust-file-utils/sqlwrapper/0.0.1/sqlwrapper-0.0.1.jar
Downloading: http://repo.maven.apache.org/maven2/net/sourceforge/openai/openaifsm/0.0.1/openaifsm-0.0.1.jar
Downloaded: http://repo.maven.apache.org/maven2/edu/mit/findstruct/findstructapi/0.0.1/findstructapi-0.0.1.jar
(14 KB at 40.2 KB/sec)
Downloaded: http://repo.maven.apache.org/maven2/com/googlecode/armbrust-file-utils/sqlwrapper/0.0.1/sqlwrapper-0.0.1.jar
(17 KB at 46.6 KB/sec)
Downloaded: http://repo.maven.apache.org/maven2/net/sourceforge/openai/openaifsm/0.0.1/openaifsm-0.0.1.jar
(13 KB at 32.8 KB/sec)
mojoStarted org.apache.maven.plugins:maven-clean-plugin:2.4.1(default-clean)[INFO] Deleting
<https://builds.apache.org/job/ctakes-trunk-compiletest/org.apache.ctakes$ctakes-core/ws/target>

[INFO] 
[INFO] --- maven-clean-plugin:2.4.1:clean (default-clean) @ ctakes-core ---
mojoSucceeded org.apache.maven.plugins:maven-clean-plugin:2.4.1(default-clean)
mojoStarted org.apache.maven.plugins:maven-remote-resources-plugin:1.3(default)[INFO] artifact
junit:junit: checking for updates from central

[INFO] 
[INFO] --- maven-remote-resources-plugin:1.3:process (default) @ ctakes-core ---
Downloading: http://repo.maven.apache.org/maven2/jwnl/jwnl/1.3.3/jwnl-1.3.3.pom
mojoSucceeded org.apache.maven.plugins:maven-remote-resources-plugin:1.3(default)
mojoStarted org.apache.maven.plugins:maven-resources-plugin:2.5(default-resources)[debug]
execute contextualize
[INFO] Using 'UTF-8' encoding to copy filtered resources.

[INFO] 
[INFO] --- maven-resources-plugin:2.5:resources (default-resources) @ ctakes-core ---
[INFO] Copying 15 resources
[INFO] Copying 3 resources
mojoSucceeded org.apache.maven.plugins:maven-resources-plugin:2.5(default-resources)
mojoStarted org.apache.maven.plugins:maven-compiler-plugin:2.4(default-compile)
[INFO] 
[INFO] --- maven-compiler-plugin:2.4:compile (default-compile) @ ctakes-core ---
[INFO] Compiling 140 source files to <https://builds.apache.org/job/ctakes-trunk-compiletest/org.apache.ctakes$ctakes-core/ws/target/classes>
[INFO] -------------------------------------------------------------
[ERROR] COMPILATION ERROR : 
[INFO] -------------------------------------------------------------
[ERROR] <https://builds.apache.org/job/ctakes-trunk-compiletest/org.apache.ctakes$ctakes-core/ws/src/main/java/org/apache/ctakes/core/sentence/SentenceDetectorCtakes.java>:[42,25]
[deprecation] opennlp.tools.util.HashSumEventStream in opennlp.tools.util has been deprecated
[ERROR] <https://builds.apache.org/job/ctakes-trunk-compiletest/org.apache.ctakes$ctakes-core/ws/src/main/java/org/apache/ctakes/core/ae/SHARPKnowtatorXMLReader.java>:[38,47]
cannot find symbol
symbol  : class AnatomicalSiteMention
location: package org.apache.ctakes.typesystem.type.refsem
[ERROR] <https://builds.apache.org/job/ctakes-trunk-compiletest/org.apache.ctakes$ctakes-core/ws/src/main/java/org/apache/ctakes/core/ae/SHARPKnowtatorXMLReader.java>:[43,47]
cannot find symbol
symbol  : class DiseaseDisorderMention
location: package org.apache.ctakes.typesystem.type.refsem
[ERROR] <https://builds.apache.org/job/ctakes-trunk-compiletest/org.apache.ctakes$ctakes-core/ws/src/main/java/org/apache/ctakes/core/ae/SHARPKnowtatorXMLReader.java>:[56,47]
cannot find symbol
symbol  : class ProcedureMention
location: package org.apache.ctakes.typesystem.type.refsem
[ERROR] <https://builds.apache.org/job/ctakes-trunk-compiletest/org.apache.ctakes$ctakes-core/ws/src/main/java/org/apache/ctakes/core/ae/SHARPKnowtatorXMLReader.java>:[59,47]
cannot find symbol
symbol  : class SignSymptomMention
location: package org.apache.ctakes.typesystem.type.refsem
[ERROR] <https://builds.apache.org/job/ctakes-trunk-compiletest/org.apache.ctakes$ctakes-core/ws/src/main/java/org/apache/ctakes/core/ae/SHARPKnowtatorXMLReader.java>:[1299,77]
cannot find symbol
symbol  : class DiseaseDisorderMention
mojoFailed org.apache.maven.plugins:maven-compiler-plugin:2.4(default-compile)location: class
org.apache.ctakes.core.ae.SHARPKnowtatorXMLReader
[ERROR] <https://builds.apache.org/job/ctakes-trunk-compiletest/org.apache.ctakes$ctakes-core/ws/src/main/java/org/apache/ctakes/core/ae/SHARPKnowtatorXMLReader.java>:[1300,42]
cannot find symbol
symbol  : class DiseaseDisorderMention
location: class org.apache.ctakes.core.ae.SHARPKnowtatorXMLReader.AssociatedSignOrSymptomFeature
[ERROR] <https://builds.apache.org/job/ctakes-trunk-compiletest/org.apache.ctakes$ctakes-core/ws/src/main/java/org/apache/ctakes/core/cr/FilesInDirectoryCollectionReader.java>:[224,7]
[deprecation] getCasInitializer() in org.apache.uima.collection.CollectionReader_ImplBase
has been deprecated
[ERROR] <https://builds.apache.org/job/ctakes-trunk-compiletest/org.apache.ctakes$ctakes-core/ws/src/main/java/org/apache/ctakes/core/cr/FilesInDirectoryCollectionReader.java>:[226,4]
[deprecation] getCasInitializer() in org.apache.uima.collection.CollectionReader_ImplBase
has been deprecated
[ERROR] <https://builds.apache.org/job/ctakes-trunk-compiletest/org.apache.ctakes$ctakes-core/ws/src/main/java/org/apache/ctakes/core/ae/TokenizerAnnotatorPTB.java>:[165,74]
[unchecked] unchecked cast
found   : java.util.List<capture#614 of ?>
required: java.util.List<org.apache.ctakes.typesystem.type.syntax.BaseToken>
[ERROR] <https://builds.apache.org/job/ctakes-trunk-compiletest/org.apache.ctakes$ctakes-core/ws/src/main/java/org/apache/ctakes/core/ae/SHARPKnowtatorXMLReader.java>:[284,8]
cannot find symbol
symbol  : class AnatomicalSiteMention
location: class org.apache.ctakes.core.ae.SHARPKnowtatorXMLReader
[ERROR] <https://builds.apache.org/job/ctakes-trunk-compiletest/org.apache.ctakes$ctakes-core/ws/src/main/java/org/apache/ctakes/core/ae/SHARPKnowtatorXMLReader.java>:[284,50]
cannot find symbol
symbol  : class AnatomicalSiteMention
location: class org.apache.ctakes.core.ae.SHARPKnowtatorXMLReader
[ERROR] <https://builds.apache.org/job/ctakes-trunk-compiletest/org.apache.ctakes$ctakes-core/ws/src/main/java/org/apache/ctakes/core/ae/SHARPKnowtatorXMLReader.java>:[329,8]
cannot find symbol
symbol  : class DiseaseDisorderMention
location: class org.apache.ctakes.core.ae.SHARPKnowtatorXMLReader
[ERROR] <https://builds.apache.org/job/ctakes-trunk-compiletest/org.apache.ctakes$ctakes-core/ws/src/main/java/org/apache/ctakes/core/ae/SHARPKnowtatorXMLReader.java>:[329,60]
cannot find symbol
symbol  : class DiseaseDisorderMention
location: class org.apache.ctakes.core.ae.SHARPKnowtatorXMLReader
[ERROR] <https://builds.apache.org/job/ctakes-trunk-compiletest/org.apache.ctakes$ctakes-core/ws/src/main/java/org/apache/ctakes/core/ae/SHARPKnowtatorXMLReader.java>:[421,8]
cannot find symbol
symbol  : class ProcedureMention
location: class org.apache.ctakes.core.ae.SHARPKnowtatorXMLReader
[ERROR] <https://builds.apache.org/job/ctakes-trunk-compiletest/org.apache.ctakes$ctakes-core/ws/src/main/java/org/apache/ctakes/core/ae/SHARPKnowtatorXMLReader.java>:[421,48]
cannot find symbol
symbol  : class ProcedureMention
location: class org.apache.ctakes.core.ae.SHARPKnowtatorXMLReader
[ERROR] <https://builds.apache.org/job/ctakes-trunk-compiletest/org.apache.ctakes$ctakes-core/ws/src/main/java/org/apache/ctakes/core/ae/SHARPKnowtatorXMLReader.java>:[444,8]
cannot find symbol
symbol  : class SignSymptomMention
location: class org.apache.ctakes.core.ae.SHARPKnowtatorXMLReader
[ERROR] <https://builds.apache.org/job/ctakes-trunk-compiletest/org.apache.ctakes$ctakes-core/ws/src/main/java/org/apache/ctakes/core/ae/SHARPKnowtatorXMLReader.java>:[444,52]
cannot find symbol
symbol  : class SignSymptomMention
location: class org.apache.ctakes.core.ae.SHARPKnowtatorXMLReader
[ERROR] <https://builds.apache.org/job/ctakes-trunk-compiletest/org.apache.ctakes$ctakes-core/ws/src/main/java/org/apache/ctakes/core/resource/LuceneIndexReaderResourceImpl.java>:[70,44]
[deprecation] open(org.apache.lucene.store.Directory) in org.apache.lucene.index.IndexReader
has been deprecated
[ERROR] <https://builds.apache.org/job/ctakes-trunk-compiletest/org.apache.ctakes$ctakes-core/ws/src/main/java/org/apache/ctakes/core/resource/LuceneIndexReaderResourceImpl.java>:[75,44]
[deprecation] open(org.apache.lucene.store.Directory) in org.apache.lucene.index.IndexReader
has been deprecated
[ERROR] <https://builds.apache.org/job/ctakes-trunk-compiletest/org.apache.ctakes$ctakes-core/ws/src/main/java/org/apache/ctakes/core/resource/StringIntegerMapResourceImpl.java>:[101,15]
getMap() in org.apache.ctakes.core.resource.StringIntegerMapResourceImpl implements getMap()
in org.apache.ctakes.core.resource.StringIntegerMapResource; return type requires unchecked
conversion
found   : java.util.Map
required: java.util.Map<java.lang.String,java.lang.Integer>
[ERROR] <https://builds.apache.org/job/ctakes-trunk-compiletest/org.apache.ctakes$ctakes-core/ws/src/main/java/org/apache/ctakes/core/cr/JdbcCollectionReader.java>:[179,25]
[unchecked] unchecked conversion
found   : java.util.List[]
required: java.util.List<java.lang.String>[]
[ERROR] <https://builds.apache.org/job/ctakes-trunk-compiletest/org.apache.ctakes$ctakes-core/ws/src/main/java/org/apache/ctakes/core/cr/JdbcCollectionReader.java>:[276,20]
[deprecation] getCasInitializer() in org.apache.uima.collection.CollectionReader_ImplBase
has been deprecated
[ERROR] <https://builds.apache.org/job/ctakes-trunk-compiletest/org.apache.ctakes$ctakes-core/ws/src/main/java/org/apache/ctakes/core/cr/JdbcCollectionReader.java>:[279,20]
[deprecation] getCasInitializer() in org.apache.uima.collection.CollectionReader_ImplBase
has been deprecated
[ERROR] <https://builds.apache.org/job/ctakes-trunk-compiletest/org.apache.ctakes$ctakes-core/ws/src/main/java/org/apache/ctakes/core/cr/XmiCollectionReaderCtakes.java>:[81,18]
[unchecked] unchecked call to add(E) as a member of the raw type java.util.ArrayList
[ERROR] <https://builds.apache.org/job/ctakes-trunk-compiletest/org.apache.ctakes$ctakes-core/ws/src/main/java/org/apache/ctakes/core/cr/LinesFromFileCollectionReader.java>:[175,7]
[deprecation] getCasInitializer() in org.apache.uima.collection.CollectionReader_ImplBase
has been deprecated
[ERROR] <https://builds.apache.org/job/ctakes-trunk-compiletest/org.apache.ctakes$ctakes-core/ws/src/main/java/org/apache/ctakes/core/cr/LinesFromFileCollectionReader.java>:[178,4]
[deprecation] getCasInitializer() in org.apache.uima.collection.CollectionReader_ImplBase
has been deprecated
[INFO] 27 errors 
[INFO] -------------------------------------------------------------

projectFailed org.apache.ctakes:ctakes-core:3.1.0-incubating-SNAPSHOT

Mime
View raw message