incubator-ctakes-notifications mailing list archives

Site index · List index
Message view « Date » · « Thread »
Top « Date » · « Thread »
From Apache Jenkins Server <jenk...@builds.apache.org>
Subject Build failed in Jenkins: ctakes-trunk-package #32
Date Tue, 08 Jan 2013 00:44:35 GMT
See <https://builds.apache.org/job/ctakes-trunk-package/32/changes>

Changes:

[tmill] ctakes-111: Check in library changes needed for relex features.

[tmill] ctakes-111: Adds tree-based features for use in tree-kernel svms.

[tmill] ctakes-117: Adds features for doing mention similarity using statistics from wiki
articles.
Additional features multiply other features together in meaningful ways:
(shared cui X entity type) e.g., two mentions of "liver" is probably the same because
a person only has one liver.  two mentions of "pain" are less likely to be the same.
This feature captures that intuition by having type-specific synonym features.

[dligach] added a sentence counter and an entity counter

[dligach] added token counts and relation counts

[dligach] added init version of two classes for analyzing gold standard annotations

------------------------------------------
[...truncated 1510 lines...]
mojoStarted org.apache.maven.plugins:maven-resources-plugin:2.5(default-testResources)
[INFO] 
[debug] execute contextualize
[INFO] Using 'UTF-8' encoding to copy filtered resources.
[INFO] skip non existing resourceDirectory <https://builds.apache.org/job/ctakes-trunk-package/ws/ctakes-assertion/src/test/resources>
[INFO] Copying 3 resources
[INFO] --- maven-resources-plugin:2.5:testResources (default-testResources) @ ctakes-assertion
---
mojoSucceeded org.apache.maven.plugins:maven-resources-plugin:2.5(default-testResources)
mojoStarted org.apache.maven.plugins:maven-compiler-plugin:2.4(default-testCompile)
[INFO] No sources to compile
[INFO] 
[INFO] --- maven-compiler-plugin:2.4:testCompile (default-testCompile) @ ctakes-assertion
---
mojoSucceeded org.apache.maven.plugins:maven-compiler-plugin:2.4(default-testCompile)
mojoStarted org.apache.maven.plugins:maven-surefire-plugin:2.12(default-test)[INFO] Surefire
report directory: <https://builds.apache.org/job/ctakes-trunk-package/ws/ctakes-assertion/target/surefire-reports>

-------------------------------------------------------
 T E S T S
-------------------------------------------------------

[INFO] 
[INFO] --- maven-surefire-plugin:2.12:test (default-test) @ ctakes-assertion ---

Results :

Tests run: 0, Failures: 0, Errors: 0, Skipped: 0

mojoSucceeded org.apache.maven.plugins:maven-surefire-plugin:2.12(default-test)
[JENKINS] Recording test results
mojoStarted org.apache.maven.plugins:maven-jar-plugin:2.4(default-jar)
[INFO] 
[INFO] --- maven-jar-plugin:2.4:jar (default-jar) @ ctakes-assertion ---
[INFO] Building jar: <https://builds.apache.org/job/ctakes-trunk-package/ws/ctakes-assertion/target/ctakes-assertion-3.1.0-incubating-SNAPSHOT.jar>
mojoSucceeded org.apache.maven.plugins:maven-jar-plugin:2.4(default-jar)
mojoStarted org.apache.maven.plugins:maven-site-plugin:3.1(attach-descriptor)
[INFO] 
[INFO] --- maven-site-plugin:3.1:attach-descriptor (attach-descriptor) @ ctakes-assertion
---
mojoSucceeded org.apache.maven.plugins:maven-site-plugin:3.1(attach-descriptor)
mojoStarted org.apache.maven.plugins:maven-install-plugin:2.3.1(default-install)
[INFO] 
[INFO] Installing <https://builds.apache.org/job/ctakes-trunk-package/ws/ctakes-assertion/target/ctakes-assertion-3.1.0-incubating-SNAPSHOT.jar>
to /export/home/hudson/hudson-slave/maven-repositories/0/org/apache/ctakes/ctakes-assertion/3.1.0-incubating-SNAPSHOT/ctakes-assertion-3.1.0-incubating-SNAPSHOT.jar
[INFO] Installing <https://builds.apache.org/job/ctakes-trunk-package/ws/ctakes-assertion/pom.xml>
to /export/home/hudson/hudson-slave/maven-repositories/0/org/apache/ctakes/ctakes-assertion/3.1.0-incubating-SNAPSHOT/ctakes-assertion-3.1.0-incubating-SNAPSHOT.pom
[INFO] --- maven-install-plugin:2.3.1:install (default-install) @ ctakes-assertion ---
mojoSucceeded org.apache.maven.plugins:maven-install-plugin:2.3.1(default-install)
projectSucceeded org.apache.ctakes:ctakes-assertion:3.1.0-incubating-SNAPSHOT
projectStarted org.apache.ctakes:ctakes-clinical-pipeline:3.1.0-incubating-SNAPSHOT
[INFO]                                                                         
[INFO] ------------------------------------------------------------------------
[INFO] Building Apache cTAKES ctakes-clinical-pipeline 3.1.0-incubating-SNAPSHOT
[INFO] ------------------------------------------------------------------------
mojoStarted org.apache.maven.plugins:maven-remote-resources-plugin:1.3(default)
[INFO] 
[INFO] --- maven-remote-resources-plugin:1.3:process (default) @ ctakes-clinical-pipeline
---
mojoSucceeded org.apache.maven.plugins:maven-remote-resources-plugin:1.3(default)
mojoStarted org.apache.maven.plugins:maven-resources-plugin:2.5(default-resources)[debug]
execute contextualize

[INFO] Using 'UTF-8' encoding to copy filtered resources.
[INFO] [INFO] skip non existing resourceDirectory <https://builds.apache.org/job/ctakes-trunk-package/ws/ctakes-clinical-pipeline/src/main/resources>
[INFO] Copying 3 resources

[INFO] --- maven-resources-plugin:2.5:resources (default-resources) @ ctakes-clinical-pipeline
---
mojoSucceeded org.apache.maven.plugins:maven-resources-plugin:2.5(default-resources)
mojoStarted org.apache.maven.plugins:maven-compiler-plugin:2.4(default-compile)
[INFO] 
[INFO] --- maven-compiler-plugin:2.4:compile (default-compile) @ ctakes-clinical-pipeline
---
[INFO] Nothing to compile - all classes are up to date
mojoSucceeded org.apache.maven.plugins:maven-compiler-plugin:2.4(default-compile)
mojoStarted org.apache.maven.plugins:maven-resources-plugin:2.5(default-testResources)[debug]
execute contextualize
[INFO] Using 'UTF-8' encoding to copy filtered resources.

[INFO] 
[INFO] skip non existing resourceDirectory <https://builds.apache.org/job/ctakes-trunk-package/ws/ctakes-clinical-pipeline/src/test/resources>
[INFO] Copying 3 resources
[INFO] --- maven-resources-plugin:2.5:testResources (default-testResources) @ ctakes-clinical-pipeline
---
mojoSucceeded org.apache.maven.plugins:maven-resources-plugin:2.5(default-testResources)
mojoStarted org.apache.maven.plugins:maven-compiler-plugin:2.4(default-testCompile)[INFO]
No sources to compile

[INFO] 
[INFO] --- maven-compiler-plugin:2.4:testCompile (default-testCompile) @ ctakes-clinical-pipeline
---
mojoSucceeded org.apache.maven.plugins:maven-compiler-plugin:2.4(default-testCompile)
mojoStarted org.apache.maven.plugins:maven-surefire-plugin:2.12(default-test)[INFO] Surefire
report directory: <https://builds.apache.org/job/ctakes-trunk-package/ws/ctakes-clinical-pipeline/target/surefire-reports>


-------------------------------------------------------
 T E S T S
-------------------------------------------------------
[INFO] 
[INFO] --- maven-surefire-plugin:2.12:test (default-test) @ ctakes-clinical-pipeline ---
mojoSucceeded org.apache.maven.plugins:maven-surefire-plugin:2.12(default-test)
Results :

Tests run: 0, Failures: 0, Errors: 0, Skipped: 0


[JENKINS] Recording test results
mojoStarted org.apache.maven.plugins:maven-jar-plugin:2.4(default-jar)
[INFO] 
[INFO] --- maven-jar-plugin:2.4:jar (default-jar) @ ctakes-clinical-pipeline ---
[INFO] Building jar: <https://builds.apache.org/job/ctakes-trunk-package/ws/ctakes-clinical-pipeline/target/ctakes-clinical-pipeline-3.1.0-incubating-SNAPSHOT.jar>
mojoSucceeded org.apache.maven.plugins:maven-jar-plugin:2.4(default-jar)
mojoStarted org.apache.maven.plugins:maven-site-plugin:3.1(attach-descriptor)
[INFO] 
[INFO] --- maven-site-plugin:3.1:attach-descriptor (attach-descriptor) @ ctakes-clinical-pipeline
---
mojoSucceeded org.apache.maven.plugins:maven-site-plugin:3.1(attach-descriptor)
mojoStarted org.apache.maven.plugins:maven-install-plugin:2.3.1(default-install)
[INFO] 
[INFO] Installing <https://builds.apache.org/job/ctakes-trunk-package/ws/ctakes-clinical-pipeline/target/ctakes-clinical-pipeline-3.1.0-incubating-SNAPSHOT.jar>
to /export/home/hudson/hudson-slave/maven-repositories/0/org/apache/ctakes/ctakes-clinical-pipeline/3.1.0-incubating-SNAPSHOT/ctakes-clinical-pipeline-3.1.0-incubating-SNAPSHOT.jar
[INFO] Installing <https://builds.apache.org/job/ctakes-trunk-package/ws/ctakes-clinical-pipeline/pom.xml>
to /export/home/hudson/hudson-slave/maven-repositories/0/org/apache/ctakes/ctakes-clinical-pipeline/3.1.0-incubating-SNAPSHOT/ctakes-clinical-pipeline-3.1.0-incubating-SNAPSHOT.pom
[INFO] --- maven-install-plugin:2.3.1:install (default-install) @ ctakes-clinical-pipeline
---
mojoSucceeded org.apache.maven.plugins:maven-install-plugin:2.3.1(default-install)
projectSucceeded org.apache.ctakes:ctakes-clinical-pipeline:3.1.0-incubating-SNAPSHOT
projectStarted org.apache.ctakes:ctakes-relation-extractor:3.1.0-incubating-SNAPSHOT
[INFO]                                                                         
[INFO] ------------------------------------------------------------------------
[INFO] Building Apache cTAKES Relation Extractor 3.1.0-incubating-SNAPSHOT
[INFO] ------------------------------------------------------------------------
mojoStarted org.apache.maven.plugins:maven-remote-resources-plugin:1.3(default)
[INFO] 
[INFO] --- maven-remote-resources-plugin:1.3:process (default) @ ctakes-relation-extractor
---
mojoSucceeded org.apache.maven.plugins:maven-remote-resources-plugin:1.3(default)
mojoStarted org.apache.maven.plugins:maven-resources-plugin:2.5(default-resources)[debug]
execute contextualize

[INFO] Using 'UTF-8' encoding to copy filtered resources.
[INFO] 
[INFO] Copying 22 resources
[INFO] Copying 3 resources
[INFO] --- maven-resources-plugin:2.5:resources (default-resources) @ ctakes-relation-extractor
---
mojoSucceeded org.apache.maven.plugins:maven-resources-plugin:2.5(default-resources)
mojoStarted org.apache.maven.plugins:maven-compiler-plugin:2.4(default-compile)
[INFO] 
[INFO] --- maven-compiler-plugin:2.4:compile (default-compile) @ ctakes-relation-extractor
---
[INFO] Compiling 4 source files to <https://builds.apache.org/job/ctakes-trunk-package/ws/ctakes-relation-extractor/target/classes>
[INFO] -------------------------------------------------------------
[ERROR] COMPILATION ERROR : 
[INFO] -------------------------------------------------------------
[ERROR] <https://builds.apache.org/job/ctakes-trunk-package/ws/ctakes-relation-extractor/src/main/java/org/apache/ctakes/relationextractor/ae/features/FlatTreeFeatureExtractor.java>:[27,34]
getLCA(org.apache.ctakes.typesystem.type.syntax.TreebankNode,org.apache.ctakes.typesystem.type.syntax.TreebankNode)
has private access in org.apache.ctakes.constituency.parser.treekernel.TreeExtractor
[INFO] 1 error
[INFO] -------------------------------------------------------------
mojoFailed org.apache.maven.plugins:maven-compiler-plugin:2.4(default-compile)
projectFailed org.apache.ctakes:ctakes-relation-extractor:3.1.0-incubating-SNAPSHOT
sessionEnded
[INFO] ------------------------------------------------------------------------
[INFO] Reactor Summary:
[INFO] 
[INFO] Apache cTAKES ..................................... SUCCESS [2:08.979s]
[INFO] Apache cTAKES common type system .................. SUCCESS [41.312s]
[INFO] Apache cTAKES utils ............................... SUCCESS [15.607s]
[INFO] Apache cTAKES core ................................ SUCCESS [48.562s]
[INFO] Apache cTAKES part-of-speech tagger ............... SUCCESS [20.134s]
[INFO] Apache cTAKES chunker ............................. SUCCESS [14.199s]
[INFO] Apache cTAKES document preprocessor ............... SUCCESS [16.360s]
[INFO] Apache cTAKES dictionary lookup ................... SUCCESS [32.010s]
[INFO] Apache cTAKES context dependent tokenizer ......... SUCCESS [15.907s]
[INFO] Apache cTAKES LVG lexical tools ................... SUCCESS [12.283s]
[INFO] Apache cTAKES named entity contexts ............... SUCCESS [23.206s]
[INFO] Apache cTAKES Constituency Parser ................. SUCCESS [20.493s]
[INFO] Apache cTAKES Dependency Parser ................... SUCCESS [36.574s]
[INFO] Apache cTAKES Assertion's zoner ................... SUCCESS [41.938s]
[INFO] Apache cTAKES Assertion ........................... SUCCESS [47.920s]
[INFO] Apache cTAKES ctakes-clinical-pipeline ............ SUCCESS [58.602s]
[INFO] Apache cTAKES Relation Extractor .................. FAILURE [19.138s]
[INFO] Apache cTAKES CoReference Resolver ................ SKIPPED
[INFO] Apache cTAKES Drug NER ............................ SKIPPED
[INFO] Apache cTAKES Side Effects ........................ SKIPPED
[INFO] Apache cTAKES Smoking Status ...................... SKIPPED
[INFO] Apache cTAKES Pad Term Spotter .................... SKIPPED
[INFO] Apache cTAKES Temporal Information Extraction ..... SKIPPED
[INFO] Apache cTAKES Distribution ........................ SKIPPED
[INFO] ------------------------------------------------------------------------
[INFO] BUILD FAILURE
[INFO] ------------------------------------------------------------------------
[INFO] Total time: 10:45.029s
[INFO] Finished at: Tue Jan 08 00:40:35 GMT+00:00 2013
[INFO] Final Memory: 32M/147M
[INFO] ------------------------------------------------------------------------
Projects to build: [MavenProject: org.apache.ctakes:ctakes:3.1.0-incubating-SNAPSHOT @ <https://builds.apache.org/job/ctakes-trunk-package/ws/pom.xml,>
MavenProject: org.apache.ctakes:ctakes-type-system:3.1.0-incubating-SNAPSHOT @ <https://builds.apache.org/job/ctakes-trunk-package/ws/ctakes-type-system/pom.xml,>
MavenProject: org.apache.ctakes:ctakes-utils:3.1.0-incubating-SNAPSHOT @ <https://builds.apache.org/job/ctakes-trunk-package/ws/ctakes-utils/pom.xml,>
MavenProject: org.apache.ctakes:ctakes-core:3.1.0-incubating-SNAPSHOT @ <https://builds.apache.org/job/ctakes-trunk-package/ws/ctakes-core/pom.xml,>
MavenProject: org.apache.ctakes:ctakes-pos-tagger:3.1.0-incubating-SNAPSHOT @ <https://builds.apache.org/job/ctakes-trunk-package/ws/ctakes-pos-tagger/pom.xml,>
MavenProject: org.apache.ctakes:ctakes-chunker:3.1.0-incubating-SNAPSHOT @ <https://builds.apache.org/job/ctakes-trunk-package/ws/ctakes-chunker/pom.xml,>
MavenProject: org.apache.ctakes:ctakes-preprocessor:3.1.0-incubating-SNAPSHOT @ <https://builds.apache.org/job/ctakes-trunk-package/ws/ctakes-preprocessor/pom.xml,>
MavenProject: org.apache.ctakes:ctakes-dictionary-lookup:3.1.0-incubating-SNAPSHOT @ <https://builds.apache.org/job/ctakes-trunk-package/ws/ctakes-dictionary-lookup/pom.xml,>
MavenProject: org.apache.ctakes:ctakes-context-tokenizer:3.1.0-incubating-SNAPSHOT @ <https://builds.apache.org/job/ctakes-trunk-package/ws/ctakes-context-tokenizer/pom.xml,>
MavenProject: org.apache.ctakes:ctakes-lvg:3.1.0-incubating-SNAPSHOT @ <https://builds.apache.org/job/ctakes-trunk-package/ws/ctakes-lvg/pom.xml,>
MavenProject: org.apache.ctakes:ctakes-ne-contexts:3.1.0-incubating-SNAPSHOT @ <https://builds.apache.org/job/ctakes-trunk-package/ws/ctakes-ne-contexts/pom.xml,>
MavenProject: org.apache.ctakes:ctakes-constituency-parser:3.1.0-incubating-SNAPSHOT @ <https://builds.apache.org/job/ctakes-trunk-package/ws/ctakes-constituency-parser/pom.xml,>
MavenProject: org.apache.ctakes:ctakes-dependency-parser:3.1.0-incubating-SNAPSHOT @ <https://builds.apache.org/job/ctakes-trunk-package/ws/ctakes-dependency-parser/pom.xml,>
MavenProject: org.apache.ctakes:ctakes-assertion-zoner:3.1.0-incubating-SNAPSHOT @ <https://builds.apache.org/job/ctakes-trunk-package/ws/ctakes-assertion-zoner/pom.xml,>
MavenProject: org.apache.ctakes:ctakes-assertion:3.1.0-incubating-SNAPSHOT @ <https://builds.apache.org/job/ctakes-trunk-package/ws/ctakes-assertion/pom.xml,>
MavenProject: org.apache.ctakes:ctakes-clinical-pipeline:3.1.0-incubating-SNAPSHOT @ <https://builds.apache.org/job/ctakes-trunk-package/ws/ctakes-clinical-pipeline/pom.xml,>
MavenProject: org.apache.ctakes:ctakes-relation-extractor:3.1.0-incubating-SNAPSHOT @ <https://builds.apache.org/job/ctakes-trunk-package/ws/ctakes-relation-extractor/pom.xml,>
MavenProject: org.apache.ctakes:ctakes-coreference:3.1.0-incubating-SNAPSHOT @ <https://builds.apache.org/job/ctakes-trunk-package/ws/ctakes-coreference/pom.xml,>
MavenProject: org.apache.ctakes:ctakes-drug-ner:3.1.0-incubating-SNAPSHOT @ <https://builds.apache.org/job/ctakes-trunk-package/ws/ctakes-drug-ner/pom.xml,>
MavenProject: org.apache.ctakes:ctakes-side-effect:3.1.0-incubating-SNAPSHOT @ <https://builds.apache.org/job/ctakes-trunk-package/ws/ctakes-side-effect/pom.xml,>
MavenProject: org.apache.ctakes:ctakes-smoking-status:3.1.0-incubating-SNAPSHOT @ <https://builds.apache.org/job/ctakes-trunk-package/ws/ctakes-smoking-status/pom.xml,>
MavenProject: org.apache.ctakes:ctakes-pad-term-spotter:3.1.0-incubating-SNAPSHOT @ <https://builds.apache.org/job/ctakes-trunk-package/ws/ctakes-pad-term-spotter/pom.xml,>
MavenProject: org.apache.ctakes:ctakes-temporal:3.1.0-incubating-SNAPSHOT @ <https://builds.apache.org/job/ctakes-trunk-package/ws/ctakes-temporal/pom.xml,>
MavenProject: org.apache.ctakes:ctakes-distribution:3.1.0-incubating-SNAPSHOT @ <https://builds.apache.org/job/ctakes-trunk-package/ws/ctakes-distribution/pom.xml]>
[JENKINS] Archiving disabled
[JENKINS] Archiving disabled
[JENKINS] Archiving disabled
[JENKINS] Archiving disabled
[JENKINS] Archiving disabled
[JENKINS] Archiving disabled
[JENKINS] Archiving disabled
[JENKINS] Archiving disabled
[JENKINS] Archiving disabled
[JENKINS] Archiving disabled
[JENKINS] Archiving disabled
[JENKINS] Archiving disabled
[JENKINS] Archiving disabled
[JENKINS] Archiving disabled
[JENKINS] Archiving disabled
[JENKINS] Archiving disabled
[JENKINS] Archiving disabled
[JENKINS] Archiving disabled
[JENKINS] Archiving disabled
[JENKINS] Archiving disabled
[JENKINS] Archiving disabled
[JENKINS] Archiving disabled
[JENKINS] Archiving disabled
[JENKINS] Archiving disabled
Waiting for Jenkins to finish collecting data
mavenExecutionResult exceptions not empty
message : Failed to execute goal org.apache.maven.plugins:maven-compiler-plugin:2.4:compile
(default-compile) on project ctakes-relation-extractor: Compilation failure
<https://builds.apache.org/job/ctakes-trunk-package/ws/ctakes-relation-extractor/src/main/java/org/apache/ctakes/relationextractor/ae/features/FlatTreeFeatureExtractor.java>:[27,34]
getLCA(org.apache.ctakes.typesystem.type.syntax.TreebankNode,org.apache.ctakes.typesystem.type.syntax.TreebankNode)
has private access in org.apache.ctakes.constituency.parser.treekernel.TreeExtractor

cause : Compilation failure
<https://builds.apache.org/job/ctakes-trunk-package/ws/ctakes-relation-extractor/src/main/java/org/apache/ctakes/relationextractor/ae/features/FlatTreeFeatureExtractor.java>:[27,34]
getLCA(org.apache.ctakes.typesystem.type.syntax.TreebankNode,org.apache.ctakes.typesystem.type.syntax.TreebankNode)
has private access in org.apache.ctakes.constituency.parser.treekernel.TreeExtractor

Stack trace : 
org.apache.maven.lifecycle.LifecycleExecutionException: Failed to execute goal org.apache.maven.plugins:maven-compiler-plugin:2.4:compile
(default-compile) on project ctakes-relation-extractor: Compilation failure
<https://builds.apache.org/job/ctakes-trunk-package/ws/ctakes-relation-extractor/src/main/java/org/apache/ctakes/relationextractor/ae/features/FlatTreeFeatureExtractor.java>:[27,34]
getLCA(org.apache.ctakes.typesystem.type.syntax.TreebankNode,org.apache.ctakes.typesystem.type.syntax.TreebankNode)
has private access in org.apache.ctakes.constituency.parser.treekernel.TreeExtractor

	at org.apache.maven.lifecycle.internal.MojoExecutor.execute(MojoExecutor.java:213)
	at org.apache.maven.lifecycle.internal.MojoExecutor.execute(MojoExecutor.java:153)
	at org.apache.maven.lifecycle.internal.MojoExecutor.execute(MojoExecutor.java:145)
	at org.apache.maven.lifecycle.internal.LifecycleModuleBuilder.buildProject(LifecycleModuleBuilder.java:84)
	at org.apache.maven.lifecycle.internal.LifecycleModuleBuilder.buildProject(LifecycleModuleBuilder.java:59)
	at org.apache.maven.lifecycle.internal.LifecycleStarter.singleThreadedBuild(LifecycleStarter.java:183)
	at org.apache.maven.lifecycle.internal.LifecycleStarter.execute(LifecycleStarter.java:161)
	at org.apache.maven.DefaultMaven.doExecute(DefaultMaven.java:319)
	at org.apache.maven.DefaultMaven.execute(DefaultMaven.java:156)
	at org.jvnet.hudson.maven3.launcher.Maven3Launcher.main(Maven3Launcher.java:79)
	at sun.reflect.NativeMethodAccessorImpl.invoke0(Native Method)
	at sun.reflect.NativeMethodAccessorImpl.invoke(NativeMethodAccessorImpl.java:39)
	at sun.reflect.DelegatingMethodAccessorImpl.invoke(DelegatingMethodAccessorImpl.java:25)
	at java.lang.reflect.Method.invoke(Method.java:597)
	at org.codehaus.plexus.classworlds.launcher.Launcher.launchStandard(Launcher.java:329)
	at org.codehaus.plexus.classworlds.launcher.Launcher.launch(Launcher.java:239)
	at org.jvnet.hudson.maven3.agent.Maven3Main.launch(Maven3Main.java:158)
	at hudson.maven.Maven3Builder.call(Maven3Builder.java:100)
	at hudson.maven.Maven3Builder.call(Maven3Builder.java:66)
	at hudson.remoting.UserRequest.perform(UserRequest.java:118)
	at hudson.remoting.UserRequest.perform(UserRequest.java:48)
	at hudson.remoting.Request$2.run(Request.java:326)
	at hudson.remoting.InterceptingExecutorService$1.call(InterceptingExecutorService.java:72)
	at java.util.concurrent.FutureTask$Sync.innerRun(FutureTask.java:303)
	at java.util.concurrent.FutureTask.run(FutureTask.java:138)
	at java.util.concurrent.ThreadPoolExecutor$Worker.runTask(ThreadPoolExecutor.java:886)
	at java.util.concurrent.ThreadPoolExecutor$Worker.run(ThreadPoolExecutor.java:908)
	at java.lang.Thread.run(Thread.java:662)
Caused by: org.apache.maven.plugin.CompilationFailureException: Compilation failure
<https://builds.apache.org/job/ctakes-trunk-package/ws/ctakes-relation-extractor/src/main/java/org/apache/ctakes/relationextractor/ae/features/FlatTreeFeatureExtractor.java>:[27,34]
getLCA(org.apache.ctakes.typesystem.type.syntax.TreebankNode,org.apache.ctakes.typesystem.type.syntax.TreebankNode)
has private access in org.apache.ctakes.constituency.parser.treekernel.TreeExtractor

	at org.apache.maven.plugin.AbstractCompilerMojo.execute(AbstractCompilerMojo.java:678)
	at org.apache.maven.plugin.CompilerMojo.execute(CompilerMojo.java:128)
	at org.apache.maven.plugin.DefaultBuildPluginManager.executeMojo(DefaultBuildPluginManager.java:101)
	at org.apache.maven.lifecycle.internal.MojoExecutor.execute(MojoExecutor.java:209)
	... 27 more
Sending e-mails to: ctakes-notifications@incubator.apache.org tmill@apache.org dligach@apache.org
channel stopped

Mime
View raw message