incubator-ctakes-notifications mailing list archives

Site index · List index
Message view « Date » · « Thread »
Top « Date » · « Thread »
From Apache Jenkins Server <jenk...@builds.apache.org>
Subject Build failed in Jenkins: cTAKES-trunk-compiletest #66
Date Thu, 29 Nov 2012 21:01:16 GMT
See <https://builds.apache.org/job/cTAKES-trunk-compiletest/66/changes>

Changes:

[tmill] ctakes-111: Added classes and simple model for tree kernel fragment features in relation-extractor.

------------------------------------------
[...truncated 2141 lines...]
A         ctakes-utils/src/main/java/org/apache/ctakes/utils
A         ctakes-utils/src/main/java/org/apache/ctakes/utils/build
A         ctakes-utils/src/main/java/org/apache/ctakes/utils/build/InstallPearSilently.java
A         ctakes-utils/src/main/java/org/apache/ctakes/utils/build/BuildPear.document preprocessor.properties
A         ctakes-utils/src/main/java/org/apache/ctakes/utils/build/BuildPear.clinical documents
pipeline.properties
A         ctakes-utils/src/main/java/org/apache/ctakes/utils/build/BuildPear.java
A         ctakes-utils/src/main/java/org/apache/ctakes/utils/build/BuildPear.LVG.properties
A         ctakes-utils/src/main/java/org/apache/ctakes/utils/build/BuildPear.core.properties
A         ctakes-utils/src/main/java/org/apache/ctakes/utils/build/InstallPipelineFromPears.java
A         ctakes-utils/src/main/java/org/apache/ctakes/utils/build/BuildPear.NE contexts.properties
A         ctakes-utils/src/main/java/org/apache/ctakes/utils/build/BuildPear.POS tagger.properties
A         ctakes-utils/src/main/java/org/apache/ctakes/utils/build/BuildPear.dependency parser.properties
A         ctakes-utils/src/main/java/org/apache/ctakes/utils/build/BuildPear.coref-resolver.properties
A         ctakes-utils/src/main/java/org/apache/ctakes/utils/build/BuildPipelinePears.java
A         ctakes-utils/src/main/java/org/apache/ctakes/utils/build/BuildPear.chunker.properties
A         ctakes-utils/src/main/java/org/apache/ctakes/utils/build/BuildPear.dictionary lookup.properties
A         ctakes-utils/src/main/java/org/apache/ctakes/utils/build/BuildPear.SideEffect.properties
A         ctakes-utils/src/main/java/org/apache/ctakes/utils/build/BuildPear.Constituency
Parser.properties
A         ctakes-utils/src/main/java/org/apache/ctakes/utils/build/BuildPear.context dependent
tokenizer.properties
A         ctakes-utils/src/main/java/org/apache/ctakes/utils/build/BuildPear.Drug NER.properties
A         ctakes-utils/src/main/java/org/apache/ctakes/utils/build/BuildPear.smoking status.properties
A         ctakes-utils/src/main/java/org/apache/ctakes/utils/build/BuildPear.PAD term spotter.properties
A         ctakes-utils/src/main/java/org/apache/ctakes/utils/test
AU        ctakes-utils/src/main/java/org/apache/ctakes/utils/test/TestUtil.java
A         ctakes-utils/src/main/java/org/apache/ctakes/utils/tree
AU        ctakes-utils/src/main/java/org/apache/ctakes/utils/tree/FragmentUtils.java
AU        ctakes-utils/src/main/java/org/apache/ctakes/utils/tree/SimpleTree.java
A         ctakes-utils/src/main/java/org/apache/ctakes/utils/kernel
AU        ctakes-utils/src/main/java/org/apache/ctakes/utils/kernel/Kernel.java
AU        ctakes-utils/src/main/java/org/apache/ctakes/utils/kernel/PolyKernel.java
AU        ctakes-utils/src/main/java/org/apache/ctakes/utils/kernel/RBFKernel.java
AU        ctakes-utils/src/main/java/org/apache/ctakes/utils/kernel/LinearKernel.java
A         ctakes-utils/src/main/java/org/apache/ctakes/utils/env
AU        ctakes-utils/src/main/java/org/apache/ctakes/utils/env/EnvironmentVariable.java
A         ctakes-utils/src/main/java/org/apache/ctakes/utils/xcas_comparison
A         ctakes-utils/src/main/java/org/apache/ctakes/utils/xcas_comparison/Compare.java
A         ctakes-utils/src/main/java/org/apache/ctakes/utils/xcas_comparison/Const.java
A         ctakes-utils/src/main/java/org/apache/ctakes/utils/xcas_comparison/attributes_to_ignore.properties
A         ctakes-utils/src/main/java/org/apache/ctakes/utils/xcas_comparison/XcasDiff.java
A         ctakes-utils/src/main/java/org/apache/ctakes/utils/xcas_comparison/XcasAnnotation.java
A         ctakes-utils/src/main/java/org/apache/ctakes/utils/xcas_comparison/ConvertAndCompare.java
A         ctakes-utils/src/main/java/org/apache/ctakes/utils/xcas_comparison/XcasFile.java
A         ctakes-utils/src/main/java/org/apache/ctakes/utils/xcas_comparison/XcasProcessor.java
A         ctakes-utils/pom.xml
A         ctakes-utils/.settings
AU        ctakes-utils/.settings/org.eclipse.jdt.core.prefs
AU        ctakes-utils/.settings/org.eclipse.core.resources.prefs
AU        KEYS
A         ctakes-type-system
A         ctakes-type-system/.classpath
A         ctakes-type-system/META-INF
A         ctakes-type-system/META-INF/MANIFEST.MF
A         ctakes-type-system/metadata
A         ctakes-type-system/metadata/install.xml
A         ctakes-type-system/.project
A         ctakes-type-system/doc
AU        ctakes-type-system/doc/CommonTypeSystem-Full.asta
AU        ctakes-type-system/doc/CommonTypeSystem.asta
A         ctakes-type-system/src
A         ctakes-type-system/src/main
A         ctakes-type-system/src/main/java
A         ctakes-type-system/src/main/java/org
A         ctakes-type-system/src/main/java/org/apache
A         ctakes-type-system/src/main/java/org/apache/ctakes
A         ctakes-type-system/src/main/java/org/apache/ctakes/typesystem
A         ctakes-type-system/src/main/java/org/apache/ctakes/typesystem/type
A         ctakes-type-system/src/main/java/org/apache/ctakes/typesystem/type/constants
A         ctakes-type-system/src/main/java/org/apache/ctakes/typesystem/type/constants/CONST.java
A         ctakes-type-system/src/main/resources
A         ctakes-type-system/src/main/resources/META-INF
A         ctakes-type-system/src/main/resources/META-INF/org.uimafit
A         ctakes-type-system/src/main/resources/META-INF/org.uimafit/types.txt
A         ctakes-type-system/src/main/resources/org
A         ctakes-type-system/src/main/resources/org/apache
A         ctakes-type-system/src/main/resources/org/apache/ctakes
A         ctakes-type-system/src/main/resources/org/apache/ctakes/typesystem
A         ctakes-type-system/src/main/resources/org/apache/ctakes/typesystem/types
A         ctakes-type-system/src/main/resources/org/apache/ctakes/typesystem/types/TypeSystem.xml
A         ctakes-type-system/pom.xml
A         ctakes-type-system/.settings
AU        ctakes-type-system/.settings/org.eclipse.jdt.core.prefs
AU        ctakes-type-system/.settings/org.eclipse.core.resources.prefs
A         ctakes-type-system/desc
At revision 1415373
Parsing POMs
[cTAKES-trunk-compiletest] $ /home/hudson/tools/java/latest1.6/bin/java -cp /home/jenkins/jenkins-slave/maven3-agent.jar:/home/hudson/tools/maven/latest3/boot/plexus-classworlds-2.4.jar
org.jvnet.hudson.maven3.agent.Maven3Main /home/hudson/tools/maven/latest3 /home/jenkins/jenkins-slave/slave.jar
/home/jenkins/jenkins-slave/maven3-interceptor.jar 38333
<===[JENKINS REMOTING CAPACITY]===>channel started
   log4j:WARN No appenders could be found for logger (org.apache.commons.beanutils.converters.BooleanConverter).
log4j:WARN Please initialize the log4j system properly.
Executing Maven:  -B -f <https://builds.apache.org/job/cTAKES-trunk-compiletest/ws/pom.xml>
-Dmaven.repo.local=/home/jenkins/jenkins-slave/maven-repositories/0 -amd -pl org.apache.ctakes:ctakes-relation-extractor
clean compile test
[INFO] Scanning for projects...
[WARNING] 
[WARNING] Some problems were encountered while building the effective model for org.apache.ctakes:ctakes-core:jar:3.1.0-incubating-SNAPSHOT
[WARNING] 'dependencies.dependency.systemPath' for net.sourceforge.openai:fsm:jar should not
point at files within the project directory, ${project.basedir}/lib/OpenAI_FSM.jar will be
unresolvable by dependent projects @ line 90, column 16
[WARNING] 'dependencies.dependency.systemPath' for findstruct:findstruct:jar should not point
at files within the project directory, ${project.basedir}/lib/FindStructAPI.jar will be unresolvable
by dependent projects @ line 97, column 16
[WARNING] 'dependencies.dependency.systemPath' for sqlWrapper:sqlWrapper:jar should not point
at files within the project directory, ${project.basedir}/lib/SQLWrapper.jar will be unresolvable
by dependent projects @ line 104, column 16
[WARNING] 
[WARNING] Some problems were encountered while building the effective model for org.apache.ctakes:ctakes-lvg:jar:3.1.0-incubating-SNAPSHOT
[WARNING] 'dependencies.dependency.systemPath' for lvg2010dist:lvg2010dist:jar should not
point at files within the project directory, ${project.basedir}/lib/lvg2010dist.jar will be
unresolvable by dependent projects @ line 59, column 16
[WARNING] 
[WARNING] Some problems were encountered while building the effective model for org.apache.ctakes:ctakes-drug-ner:jar:3.1.0-incubating-SNAPSHOT
[WARNING] 'dependencies.dependency.systemPath' for net.sourceforge.openai:fsm:jar should not
point at files within the project directory, ${project.basedir}/../ctakes-core/lib/OpenAI_FSM.jar
will be unresolvable by dependent projects @ line 86, column 16
[WARNING] 
[WARNING] Some problems were encountered while building the effective model for org.apache.ctakes:ctakes-assertion:jar:3.1.0-incubating-SNAPSHOT
[WARNING] 'dependencies.dependency.(groupId:artifactId:type:classifier)' must be unique: junit:junit:jar
-> duplicate declaration of version (?) @ line 155, column 15
[WARNING] 'dependencies.dependency.systemPath' for org.mitre.medfacts:medfacts-i2b2:jar should
not point at files within the project directory, ${project.basedir}/lib/med-facts-i2b2-1.2-SNAPSHOT.jar
will be unresolvable by dependent projects @ line 193, column 16
[WARNING] 'dependencies.dependency.systemPath' for org.mitre.medfacts:medfacts-zoner:jar should
not point at files within the project directory, ${project.basedir}/lib/med-facts-zoner-1.1.jar
will be unresolvable by dependent projects @ line 200, column 16
[WARNING] 'dependencies.dependency.systemPath' for org.mitre.jcarafe.core:jcarafe.core:jar
should not point at files within the project directory, ${project.basedir}/lib/jcarafe-core_2.9.1-0.9.8.3.RC4.jar
will be unresolvable by dependent projects @ line 207, column 16
[WARNING] 'dependencies.dependency.systemPath' for org.mitre.jcarafe.ext:jcarafe.ext:jar should
not point at files within the project directory, ${project.basedir}/lib/jcarafe-ext_2.9.1-0.9.8.3.RC4.jar
will be unresolvable by dependent projects @ line 214, column 16
[WARNING] 
[WARNING] Some problems were encountered while building the effective model for org.apache.ctakes:ctakes-distribution:pom:3.1.0-incubating-SNAPSHOT
[WARNING] 'dependencies.dependency.(groupId:artifactId:type:classifier)' must be unique: org.apache.ctakes:ctakes-ne-contexts:jar
-> duplicate declaration of version (?) @ line 99, column 15
[WARNING] 
[WARNING] It is highly recommended to fix these problems because they threaten the stability
of your build.
[WARNING] 
[WARNING] For this reason, future Maven versions might no longer support building such malformed
projects.
[WARNING] 
[INFO] ------------------------------------------------------------------------
[INFO] Reactor Build Order:
[INFO] 
[INFO] Apache cTAKES Relation Extractor
[INFO] Apache cTAKES Distribution
Projects to build: [MavenProject: org.apache.ctakes:ctakes-relation-extractor:3.1.0-incubating-SNAPSHOT
@ <https://builds.apache.org/job/cTAKES-trunk-compiletest/ws/ctakes-relation-extractor/pom.xml,>
MavenProject: org.apache.ctakes:ctakes-distribution:3.1.0-incubating-SNAPSHOT @ <https://builds.apache.org/job/cTAKES-trunk-compiletest/ws/ctakes-distribution/pom.xml]>
projectStarted org.apache.ctakes:ctakes-relation-extractor:3.1.0-incubating-SNAPSHOT
[INFO]                                                                         
[INFO] ------------------------------------------------------------------------
[INFO] Building Apache cTAKES Relation Extractor 3.1.0-incubating-SNAPSHOT
[INFO] ------------------------------------------------------------------------
Downloading: http://repository.apache.org/snapshots/org/apache/ctakes/ctakes-type-system/3.1.0-incubating-SNAPSHOT/maven-metadata.xml
Downloading: http://repository.apache.org/snapshots/org/apache/ctakes/ctakes-core/3.1.0-incubating-SNAPSHOT/maven-metadata.xml
Downloading: http://repository.apache.org/snapshots/org/apache/ctakes/ctakes-utils/3.1.0-incubating-SNAPSHOT/maven-metadata.xml
Downloading: http://repository.apache.org/snapshots/junit/junit/maven-metadata.xml
Downloading: http://repo1.maven.org/maven2/junit/junit/maven-metadata.xml
Downloaded: http://repo1.maven.org/maven2/junit/junit/maven-metadata.xml (884 B at 48.0 KB/sec)
Downloading: http://repository.apache.org/snapshots/org/apache/ctakes/ctakes-pos-tagger/3.1.0-incubating-SNAPSHOT/maven-metadata.xml
Downloading: https://oss.sonatype.org/content/repositories/snapshots/junit/junit/maven-metadata.xml
Downloading: http://repository.apache.org/snapshots/org/apache/ctakes/ctakes-context-tokenizer/3.1.0-incubating-SNAPSHOT/maven-metadata.xml
Downloading: http://repository.apache.org/snapshots/org/apache/ctakes/ctakes-constituency-parser/3.1.0-incubating-SNAPSHOT/maven-metadata.xml
Downloading: http://repository.apache.org/snapshots/org/apache/ctakes/ctakes-ne-contexts/3.1.0-incubating-SNAPSHOT/maven-metadata.xml
Downloading: http://repository.apache.org/snapshots/org/apache/ctakes/ctakes-chunker/3.1.0-incubating-SNAPSHOT/maven-metadata.xml
Downloading: http://repository.apache.org/snapshots/org/apache/ctakes/ctakes-dependency-parser/3.1.0-incubating-SNAPSHOT/maven-metadata.xml
Downloading: http://cleartk.googlecode.com/svn/repo/junit/junit/maven-metadata.xml
Downloading: http://cleartk.googlecode.com/svn/repo/org/apache/ctakes/ctakes-lvg/3.1.0-incubating-SNAPSHOT/maven-metadata.xml
Downloading: http://repository.apache.org/snapshots/org/apache/ctakes/ctakes-lvg/3.1.0-incubating-SNAPSHOT/maven-metadata.xml
Downloading: http://repository.apache.org/snapshots/com/googlecode/clearparser/clearparser/0.4.0-SNAPSHOT/maven-metadata.xml
Downloading: http://cleartk.googlecode.com/svn/repo/com/googlecode/clearparser/clearparser/0.4.0-SNAPSHOT/maven-metadata.xml
Downloaded: http://cleartk.googlecode.com/svn/repo/com/googlecode/clearparser/clearparser/0.4.0-SNAPSHOT/maven-metadata.xml
(2 KB at 1.8 KB/sec)
Downloading: http://repository.apache.org/snapshots/org/apache/ctakes/ctakes-dictionary-lookup/3.1.0-incubating-SNAPSHOT/maven-metadata.xml
Downloading: http://repo1.maven.org/maven2/net/sourceforge/ctakesresources/ctakes-resources-umls2011ab/3.1.0/ctakes-resources-umls2011ab-3.1.0.pom
Downloaded: http://repo1.maven.org/maven2/net/sourceforge/ctakesresources/ctakes-resources-umls2011ab/3.1.0/ctakes-resources-umls2011ab-3.1.0.pom
(550 B at 1.9 KB/sec)
Downloading: http://repo1.maven.org/maven2/net/sourceforge/ctakesresources/ctakes-resources/3.1.0/ctakes-resources-3.1.0.pom
Downloaded: http://repo1.maven.org/maven2/net/sourceforge/ctakesresources/ctakes-resources/3.1.0/ctakes-resources-3.1.0.pom
(3 KB at 9.8 KB/sec)
Downloading: http://repository.apache.org/snapshots/org/apache/ctakes/ctakes-clinical-pipeline/3.1.0-incubating-SNAPSHOT/maven-metadata.xml
Downloading: http://repository.apache.org/snapshots/org/apache/ctakes/ctakes-preprocessor/3.1.0-incubating-SNAPSHOT/maven-metadata.xml
Downloading: http://repository.apache.org/snapshots/org/apache/ctakes/ctakes-assertion/3.1.0-incubating-SNAPSHOT/maven-metadata.xml
Downloading: http://repository.apache.org/snapshots/org/apache/ctakes/ctakes-type-system/3.1.0-incubating-SNAPSHOT/ctakes-type-system-3.1.0-incubating-SNAPSHOT.jar
Downloading: http://repository.apache.org/snapshots/org/apache/ctakes/ctakes-core/3.1.0-incubating-SNAPSHOT/ctakes-core-3.1.0-incubating-SNAPSHOT.jar
Downloading: http://repository.apache.org/snapshots/org/apache/ctakes/ctakes-context-tokenizer/3.1.0-incubating-SNAPSHOT/ctakes-context-tokenizer-3.1.0-incubating-SNAPSHOT.jar
Downloading: http://repository.apache.org/snapshots/org/apache/ctakes/ctakes-pos-tagger/3.1.0-incubating-SNAPSHOT/ctakes-pos-tagger-3.1.0-incubating-SNAPSHOT.jar
Downloading: http://repository.apache.org/snapshots/org/apache/ctakes/ctakes-utils/3.1.0-incubating-SNAPSHOT/ctakes-utils-3.1.0-incubating-SNAPSHOT.jar
Downloading: http://repository.apache.org/snapshots/org/apache/ctakes/ctakes-constituency-parser/3.1.0-incubating-SNAPSHOT/ctakes-constituency-parser-3.1.0-incubating-SNAPSHOT.jar
Downloading: http://repository.apache.org/snapshots/org/apache/ctakes/ctakes-ne-contexts/3.1.0-incubating-SNAPSHOT/ctakes-ne-contexts-3.1.0-incubating-SNAPSHOT.jar
Downloading: http://repository.apache.org/snapshots/org/apache/ctakes/ctakes-chunker/3.1.0-incubating-SNAPSHOT/ctakes-chunker-3.1.0-incubating-SNAPSHOT.jar
Downloading: http://repository.apache.org/snapshots/org/apache/ctakes/ctakes-dependency-parser/3.1.0-incubating-SNAPSHOT/ctakes-dependency-parser-3.1.0-incubating-SNAPSHOT.jar
Downloading: http://repository.apache.org/snapshots/org/apache/ctakes/ctakes-lvg/3.1.0-incubating-SNAPSHOT/ctakes-lvg-3.1.0-incubating-SNAPSHOT.jar
Downloading: http://repository.apache.org/snapshots/org/apache/ctakes/ctakes-dictionary-lookup/3.1.0-incubating-SNAPSHOT/ctakes-dictionary-lookup-3.1.0-incubating-SNAPSHOT.jar
Downloading: http://repository.apache.org/snapshots/org/apache/ctakes/ctakes-clinical-pipeline/3.1.0-incubating-SNAPSHOT/ctakes-clinical-pipeline-3.1.0-incubating-SNAPSHOT.jar
Downloading: http://repository.apache.org/snapshots/org/apache/ctakes/ctakes-preprocessor/3.1.0-incubating-SNAPSHOT/ctakes-preprocessor-3.1.0-incubating-SNAPSHOT.jar
Downloading: http://repository.apache.org/snapshots/org/apache/ctakes/ctakes-assertion/3.1.0-incubating-SNAPSHOT/ctakes-assertion-3.1.0-incubating-SNAPSHOT.jar
Downloading: http://cleartk.googlecode.com/svn/repo/org/apache/ctakes/ctakes-lvg/3.1.0-incubating-SNAPSHOT/ctakes-lvg-3.1.0-incubating-SNAPSHOT.jar
Downloading: http://repo1.maven.org/maven2/net/sourceforge/ctakesresources/ctakes-resources-umls2011ab/3.1.0/ctakes-resources-umls2011ab-3.1.0.jar
Downloaded: http://repo1.maven.org/maven2/net/sourceforge/ctakesresources/ctakes-resources-umls2011ab/3.1.0/ctakes-resources-umls2011ab-3.1.0.jar
(181865 KB at 38777.1 KB/sec)
projectFailed org.apache.ctakes:ctakes-relation-extractor:3.1.0-incubating-SNAPSHOT
sessionEnded
[INFO] ------------------------------------------------------------------------
[INFO] Reactor Summary:
[INFO] 
[INFO] Apache cTAKES Relation Extractor .................. FAILURE [14.111s]
[INFO] Apache cTAKES Distribution ........................ SKIPPED
[INFO] ------------------------------------------------------------------------
[INFO] BUILD FAILURE
[INFO] ------------------------------------------------------------------------
[INFO] Total time: 22.720s
[INFO] Finished at: Thu Nov 29 20:59:26 UTC 2012
[INFO] Final Memory: 10M/58M
[INFO] ------------------------------------------------------------------------
Projects to build: [MavenProject: org.apache.ctakes:ctakes-relation-extractor:3.1.0-incubating-SNAPSHOT
@ <https://builds.apache.org/job/cTAKES-trunk-compiletest/ws/ctakes-relation-extractor/pom.xml,>
MavenProject: org.apache.ctakes:ctakes-distribution:3.1.0-incubating-SNAPSHOT @ <https://builds.apache.org/job/cTAKES-trunk-compiletest/ws/ctakes-distribution/pom.xml]>
[JENKINS] Archiving disabled
[JENKINS] Archiving disabled
Waiting for Jenkins to finish collecting data
mavenExecutionResult exceptions not empty
message : Failed to execute goal on project ctakes-relation-extractor: Could not resolve dependencies
for project org.apache.ctakes:ctakes-relation-extractor:jar:3.1.0-incubating-SNAPSHOT: The
following artifacts could not be resolved: org.apache.ctakes:ctakes-type-system:jar:3.1.0-incubating-SNAPSHOT,
org.apache.ctakes:ctakes-core:jar:3.1.0-incubating-SNAPSHOT, org.apache.ctakes:ctakes-utils:jar:3.1.0-incubating-SNAPSHOT,
org.apache.ctakes:ctakes-pos-tagger:jar:3.1.0-incubating-SNAPSHOT, org.apache.ctakes:ctakes-context-tokenizer:jar:3.1.0-incubating-SNAPSHOT,
org.apache.ctakes:ctakes-constituency-parser:jar:3.1.0-incubating-SNAPSHOT, org.apache.ctakes:ctakes-ne-contexts:jar:3.1.0-incubating-SNAPSHOT,
org.apache.ctakes:ctakes-chunker:jar:3.1.0-incubating-SNAPSHOT, org.apache.ctakes:ctakes-dependency-parser:jar:3.1.0-incubating-SNAPSHOT,
org.apache.ctakes:ctakes-lvg:jar:3.1.0-incubating-SNAPSHOT, org.apache.ctakes:ctakes-dictionary-lookup:jar:3.1.0-incubating-SNAPSHOT,
org.apache.ctakes:ctakes-clinical-pipeline:jar:3.1.0-incubating-SNAPSHOT, org.apache.ctakes:ctakes-preprocessor:jar:3.1.0-incubating-SNAPSHOT,
org.apache.ctakes:ctakes-assertion:jar:3.1.0-incubating-SNAPSHOT: Could not find artifact
org.apache.ctakes:ctakes-type-system:jar:3.1.0-incubating-SNAPSHOT in Nexus (http://repository.apache.org/snapshots)
cause : Could not resolve dependencies for project org.apache.ctakes:ctakes-relation-extractor:jar:3.1.0-incubating-SNAPSHOT:
The following artifacts could not be resolved: org.apache.ctakes:ctakes-type-system:jar:3.1.0-incubating-SNAPSHOT,
org.apache.ctakes:ctakes-core:jar:3.1.0-incubating-SNAPSHOT, org.apache.ctakes:ctakes-utils:jar:3.1.0-incubating-SNAPSHOT,
org.apache.ctakes:ctakes-pos-tagger:jar:3.1.0-incubating-SNAPSHOT, org.apache.ctakes:ctakes-context-tokenizer:jar:3.1.0-incubating-SNAPSHOT,
org.apache.ctakes:ctakes-constituency-parser:jar:3.1.0-incubating-SNAPSHOT, org.apache.ctakes:ctakes-ne-contexts:jar:3.1.0-incubating-SNAPSHOT,
org.apache.ctakes:ctakes-chunker:jar:3.1.0-incubating-SNAPSHOT, org.apache.ctakes:ctakes-dependency-parser:jar:3.1.0-incubating-SNAPSHOT,
org.apache.ctakes:ctakes-lvg:jar:3.1.0-incubating-SNAPSHOT, org.apache.ctakes:ctakes-dictionary-lookup:jar:3.1.0-incubating-SNAPSHOT,
org.apache.ctakes:ctakes-clinical-pipeline:jar:3.1.0-incubating-SNAPSHOT, org.apache.ctakes:ctakes-preprocessor:jar:3.1.0-incubating-SNAPSHOT,
org.apache.ctakes:ctakes-assertion:jar:3.1.0-incubating-SNAPSHOT: Could not find artifact
org.apache.ctakes:ctakes-type-system:jar:3.1.0-incubating-SNAPSHOT in Nexus (http://repository.apache.org/snapshots)
Stack trace : 
org.apache.maven.lifecycle.LifecycleExecutionException: Failed to execute goal on project
ctakes-relation-extractor: Could not resolve dependencies for project org.apache.ctakes:ctakes-relation-extractor:jar:3.1.0-incubating-SNAPSHOT:
The following artifacts could not be resolved: org.apache.ctakes:ctakes-type-system:jar:3.1.0-incubating-SNAPSHOT,
org.apache.ctakes:ctakes-core:jar:3.1.0-incubating-SNAPSHOT, org.apache.ctakes:ctakes-utils:jar:3.1.0-incubating-SNAPSHOT,
org.apache.ctakes:ctakes-pos-tagger:jar:3.1.0-incubating-SNAPSHOT, org.apache.ctakes:ctakes-context-tokenizer:jar:3.1.0-incubating-SNAPSHOT,
org.apache.ctakes:ctakes-constituency-parser:jar:3.1.0-incubating-SNAPSHOT, org.apache.ctakes:ctakes-ne-contexts:jar:3.1.0-incubating-SNAPSHOT,
org.apache.ctakes:ctakes-chunker:jar:3.1.0-incubating-SNAPSHOT, org.apache.ctakes:ctakes-dependency-parser:jar:3.1.0-incubating-SNAPSHOT,
org.apache.ctakes:ctakes-lvg:jar:3.1.0-incubating-SNAPSHOT, org.apache.ctakes:ctakes-dictionary-lookup:jar:3.1.0-incubating-SNAPSHOT,
org.apache.ctakes:ctakes-clinical-pipeline:jar:3.1.0-incubating-SNAPSHOT, org.apache.ctakes:ctakes-preprocessor:jar:3.1.0-incubating-SNAPSHOT,
org.apache.ctakes:ctakes-assertion:jar:3.1.0-incubating-SNAPSHOT: Could not find artifact
org.apache.ctakes:ctakes-type-system:jar:3.1.0-incubating-SNAPSHOT in Nexus (http://repository.apache.org/snapshots)
	at org.apache.maven.lifecycle.internal.LifecycleDependencyResolver.getDependencies(LifecycleDependencyResolver.java:196)
	at org.apache.maven.lifecycle.internal.LifecycleDependencyResolver.resolveProjectDependencies(LifecycleDependencyResolver.java:108)
	at org.apache.maven.lifecycle.internal.MojoExecutor.ensureDependenciesAreResolved(MojoExecutor.java:258)
	at org.apache.maven.lifecycle.internal.MojoExecutor.execute(MojoExecutor.java:201)
	at org.apache.maven.lifecycle.internal.MojoExecutor.execute(MojoExecutor.java:153)
	at org.apache.maven.lifecycle.internal.MojoExecutor.execute(MojoExecutor.java:145)
	at org.apache.maven.lifecycle.internal.LifecycleModuleBuilder.buildProject(LifecycleModuleBuilder.java:84)
	at org.apache.maven.lifecycle.internal.LifecycleModuleBuilder.buildProject(LifecycleModuleBuilder.java:59)
	at org.apache.maven.lifecycle.internal.LifecycleStarter.singleThreadedBuild(LifecycleStarter.java:183)
	at org.apache.maven.lifecycle.internal.LifecycleStarter.execute(LifecycleStarter.java:161)
	at org.apache.maven.DefaultMaven.doExecute(DefaultMaven.java:319)
	at org.apache.maven.DefaultMaven.execute(DefaultMaven.java:156)
	at org.jvnet.hudson.maven3.launcher.Maven3Launcher.main(Maven3Launcher.java:79)
	at sun.reflect.NativeMethodAccessorImpl.invoke0(Native Method)
	at sun.reflect.NativeMethodAccessorImpl.invoke(NativeMethodAccessorImpl.java:39)
	at sun.reflect.DelegatingMethodAccessorImpl.invoke(DelegatingMethodAccessorImpl.java:25)
	at java.lang.reflect.Method.invoke(Method.java:597)
	at org.codehaus.plexus.classworlds.launcher.Launcher.launchStandard(Launcher.java:329)
	at org.codehaus.plexus.classworlds.launcher.Launcher.launch(Launcher.java:239)
	at org.jvnet.hudson.maven3.agent.Maven3Main.launch(Maven3Main.java:158)
	at hudson.maven.Maven3Builder.call(Maven3Builder.java:98)
	at hudson.maven.Maven3Builder.call(Maven3Builder.java:64)
	at hudson.remoting.UserRequest.perform(UserRequest.java:118)
	at hudson.remoting.UserRequest.perform(UserRequest.java:48)
	at hudson.remoting.Request$2.run(Request.java:326)
	at hudson.remoting.InterceptingExecutorService$1.call(InterceptingExecutorService.java:72)
	at java.util.concurrent.FutureTask$Sync.innerRun(FutureTask.java:303)
	at java.util.concurrent.FutureTask.run(FutureTask.java:138)
	at java.util.concurrent.ThreadPoolExecutor$Worker.runTask(ThreadPoolExecutor.java:886)
	at java.util.concurrent.ThreadPoolExecutor$Worker.run(ThreadPoolExecutor.java:908)
	at java.lang.Thread.run(Thread.java:662)
Caused by: org.apache.maven.project.DependencyResolutionException: Could not resolve dependencies
for project org.apache.ctakes:ctakes-relation-extractor:jar:3.1.0-incubating-SNAPSHOT: The
following artifacts could not be resolved: org.apache.ctakes:ctakes-type-system:jar:3.1.0-incubating-SNAPSHOT,
org.apache.ctakes:ctakes-core:jar:3.1.0-incubating-SNAPSHOT, org.apache.ctakes:ctakes-utils:jar:3.1.0-incubating-SNAPSHOT,
org.apache.ctakes:ctakes-pos-tagger:jar:3.1.0-incubating-SNAPSHOT, org.apache.ctakes:ctakes-context-tokenizer:jar:3.1.0-incubating-SNAPSHOT,
org.apache.ctakes:ctakes-constituency-parser:jar:3.1.0-incubating-SNAPSHOT, org.apache.ctakes:ctakes-ne-contexts:jar:3.1.0-incubating-SNAPSHOT,
org.apache.ctakes:ctakes-chunker:jar:3.1.0-incubating-SNAPSHOT, org.apache.ctakes:ctakes-dependency-parser:jar:3.1.0-incubating-SNAPSHOT,
org.apache.ctakes:ctakes-lvg:jar:3.1.0-incubating-SNAPSHOT, org.apache.ctakes:ctakes-dictionary-lookup:jar:3.1.0-incubating-SNAPSHOT,
org.apache.ctakes:ctakes-clinical-pipeline:jar:3.1.0-incubating-SNAPSHOT, org.apache.ctakes:ctakes-preprocessor:jar:3.1.0-incubating-SNAPSHOT,
org.apache.ctakes:ctakes-assertion:jar:3.1.0-incubating-SNAPSHOT: Could not find artifact
org.apache.ctakes:ctakes-type-system:jar:3.1.0-incubating-SNAPSHOT in Nexus (http://repository.apache.org/snapshots)
	at org.apache.maven.project.DefaultProjectDependenciesResolver.resolve(DefaultProjectDependenciesResolver.java:170)
	at org.apache.maven.lifecycle.internal.LifecycleDependencyResolver.getDependencies(LifecycleDependencyResolver.java:171)
	... 30 more
Caused by: org.sonatype.aether.resolution.DependencyResolutionException: The following artifacts
could not be resolved: org.apache.ctakes:ctakes-type-system:jar:3.1.0-incubating-SNAPSHOT,
org.apache.ctakes:ctakes-core:jar:3.1.0-incubating-SNAPSHOT, org.apache.ctakes:ctakes-utils:jar:3.1.0-incubating-SNAPSHOT,
org.apache.ctakes:ctakes-pos-tagger:jar:3.1.0-incubating-SNAPSHOT, org.apache.ctakes:ctakes-context-tokenizer:jar:3.1.0-incubating-SNAPSHOT,
org.apache.ctakes:ctakes-constituency-parser:jar:3.1.0-incubating-SNAPSHOT, org.apache.ctakes:ctakes-ne-contexts:jar:3.1.0-incubating-SNAPSHOT,
org.apache.ctakes:ctakes-chunker:jar:3.1.0-incubating-SNAPSHOT, org.apache.ctakes:ctakes-dependency-parser:jar:3.1.0-incubating-SNAPSHOT,
org.apache.ctakes:ctakes-lvg:jar:3.1.0-incubating-SNAPSHOT, org.apache.ctakes:ctakes-dictionary-lookup:jar:3.1.0-incubating-SNAPSHOT,
org.apache.ctakes:ctakes-clinical-pipeline:jar:3.1.0-incubating-SNAPSHOT, org.apache.ctakes:ctakes-preprocessor:jar:3.1.0-incubating-SNAPSHOT,
org.apache.ctakes:ctakes-assertion:jar:3.1.0-incubating-SNAPSHOT: Could not find artifact
org.apache.ctakes:ctakes-type-system:jar:3.1.0-incubating-SNAPSHOT in Nexus (http://repository.apache.org/snapshots)
	at org.sonatype.aether.impl.internal.DefaultRepositorySystem.resolveDependencies(DefaultRepositorySystem.java:412)
	at org.apache.maven.project.DefaultProjectDependenciesResolver.resolve(DefaultProjectDependenciesResolver.java:164)
	... 31 more
Caused by: org.sonatype.aether.resolution.ArtifactResolutionException: The following artifacts
could not be resolved: org.apache.ctakes:ctakes-type-system:jar:3.1.0-incubating-SNAPSHOT,
org.apache.ctakes:ctakes-core:jar:3.1.0-incubating-SNAPSHOT, org.apache.ctakes:ctakes-utils:jar:3.1.0-incubating-SNAPSHOT,
org.apache.ctakes:ctakes-pos-tagger:jar:3.1.0-incubating-SNAPSHOT, org.apache.ctakes:ctakes-context-tokenizer:jar:3.1.0-incubating-SNAPSHOT,
org.apache.ctakes:ctakes-constituency-parser:jar:3.1.0-incubating-SNAPSHOT, org.apache.ctakes:ctakes-ne-contexts:jar:3.1.0-incubating-SNAPSHOT,
org.apache.ctakes:ctakes-chunker:jar:3.1.0-incubating-SNAPSHOT, org.apache.ctakes:ctakes-dependency-parser:jar:3.1.0-incubating-SNAPSHOT,
org.apache.ctakes:ctakes-lvg:jar:3.1.0-incubating-SNAPSHOT, org.apache.ctakes:ctakes-dictionary-lookup:jar:3.1.0-incubating-SNAPSHOT,
org.apache.ctakes:ctakes-clinical-pipeline:jar:3.1.0-incubating-SNAPSHOT, org.apache.ctakes:ctakes-preprocessor:jar:3.1.0-incubating-SNAPSHOT,
org.apache.ctakes:ctakes-assertion:jar:3.1.0-incubating-SNAPSHOT: Could not find artifact
org.apache.ctakes:ctakes-type-system:jar:3.1.0-incubating-SNAPSHOT in Nexus (http://repository.apache.org/snapshots)
	at org.sonatype.aether.impl.internal.DefaultArtifactResolver.resolve(DefaultArtifactResolver.java:541)
	at org.sonatype.aether.impl.internal.DefaultArtifactResolver.resolveArtifacts(DefaultArtifactResolver.java:220)
	at org.sonatype.aether.impl.internal.DefaultRepositorySystem.resolveDependencies(DefaultRepositorySystem.java:395)
	... 32 more
Caused by: org.sonatype.aether.transfer.ArtifactNotFoundException: Could not find artifact
org.apache.ctakes:ctakes-type-system:jar:3.1.0-incubating-SNAPSHOT in Nexus (http://repository.apache.org/snapshots)
	at org.sonatype.aether.connector.wagon.WagonRepositoryConnector$4.wrap(WagonRepositoryConnector.java:945)
	at org.sonatype.aether.connector.wagon.WagonRepositoryConnector$4.wrap(WagonRepositoryConnector.java:940)
	at org.sonatype.aether.connector.wagon.WagonRepositoryConnector$GetTask.flush(WagonRepositoryConnector.java:695)
	at org.sonatype.aether.connector.wagon.WagonRepositoryConnector$GetTask.flush(WagonRepositoryConnector.java:689)
	at org.sonatype.aether.connector.wagon.WagonRepositoryConnector.get(WagonRepositoryConnector.java:445)
	at org.sonatype.aether.impl.internal.DefaultArtifactResolver.resolve(DefaultArtifactResolver.java:460)
	... 34 more
Sending e-mails to: ctakes-notifications@incubator.apache.org timothy.miller@childrens.harvard.edu
channel stopped

Mime
View raw message