incubator-ctakes-notifications mailing list archives

Site index · List index
Message view « Date » · « Thread »
Top « Date » · « Thread »
From Apache Jenkins Server <jenk...@builds.apache.org>
Subject Build failed in Jenkins: cTAKES-trunk-compiletest #38
Date Wed, 31 Oct 2012 20:07:59 GMT
See <https://builds.apache.org/job/cTAKES-trunk-compiletest/38/changes>

Changes:

[mattcoarr] added apache license information using "mvn license:format" to the ctakes-assertion
module's new code

------------------------------------------
Started by an SCM change
Building remotely on ubuntu4 in workspace <https://builds.apache.org/job/cTAKES-trunk-compiletest/ws/>
Updating http://svn.apache.org/repos/asf/incubator/ctakes/trunk
D         cTAKES_license.pdf
U         ctakes-pad-term-spotter/pom.xml
U         ctakes-ne-contexts/pom.xml
U         ctakes-assertion/src/main/java/org/apache/ctakes/assertion/medfacts/cleartk/TrainAssertionModel.java
U         ctakes-assertion/src/main/java/org/apache/ctakes/assertion/medfacts/cleartk/AssertionCleartkAnalysisEngine.java
U         ctakes-assertion/src/main/java/org/apache/ctakes/assertion/medfacts/cleartk/AssertionComponents.java
U         ctakes-assertion/src/main/java/org/apache/ctakes/assertion/eval/XMIReader.java
U         ctakes-assertion/src/main/java/org/apache/ctakes/assertion/eval/AssertionEvalBasedOnModifier.java
U         ctakes-assertion/pom.xml
U         ctakes-pos-tagger/pom.xml
U         ctakes-dependency-parser/pom.xml
U         NOTICE
U         LICENSE
U         ctakes-dictionary-lookup/pom.xml
U         ctakes-side-effect/pom.xml
A         ctakes-distribution/NOTICE
A         ctakes-distribution/LICENSE
U         ctakes-distribution/src/main/assembly/bin.xml
U         ctakes-distribution/pom.xml
U         ctakes-distribution/RELEASE_NOTES.html
U         ctakes-coreference/pom.xml
U         ctakes-clinical-pipeline/pom.xml
U         ctakes-constituency-parser/pom.xml
U         pom.xml
U         ctakes-drug-ner/pom.xml
U         ctakes-preprocessor/pom.xml
U         ctakes-relation-extractor/pom.xml
U         ctakes-core/pom.xml
U         ctakes-lvg/pom.xml
U         ctakes-smoking-status/pom.xml
U         ctakes-context-tokenizer/pom.xml
U         ctakes-chunker/pom.xml
U         ctakes-utils/pom.xml
A         KEYS
D         ctakes-type-system/src/main/java/edu
D         ctakes-type-system/src/main/java/org/chboston
D         ctakes-type-system/src/main/java/org/apache/ctakes/typesystem/kernel
D         ctakes-type-system/src/main/java/org/apache/ctakes/typesystem/util
U         ctakes-type-system/pom.xml
At revision 1404328
Parsing POMs
Modules changed, recalculating dependency graph
[cTAKES-trunk-compiletest] $ /home/hudson/tools/java/latest1.6/bin/java -cp /home/jenkins/jenkins-slave/maven3-agent.jar:/home/hudson/tools/maven/latest3/boot/plexus-classworlds-2.4.jar
org.jvnet.hudson.maven3.agent.Maven3Main /home/hudson/tools/maven/latest3 /home/jenkins/jenkins-slave/slave.jar
/home/jenkins/jenkins-slave/maven3-interceptor.jar 54591
<===[JENKINS REMOTING CAPACITY]===>channel started
   log4j:WARN No appenders could be found for logger (org.apache.commons.beanutils.converters.BooleanConverter).
log4j:WARN Please initialize the log4j system properly.
Executing Maven:  -B -f <https://builds.apache.org/job/cTAKES-trunk-compiletest/ws/pom.xml>
-Dmaven.repo.local=/home/jenkins/jenkins-slave/maven-repositories/0 -amd -pl org.apache.ctakes:ctakes-assertion
clean compile test
[INFO] Scanning for projects...
[WARNING] 
[WARNING] Some problems were encountered while building the effective model for org.apache.ctakes:ctakes-core:jar:3.1.0-incubating
[WARNING] 'dependencies.dependency.systemPath' for net.sourceforge.openai:fsm:jar should not
point at files within the project directory, ${project.basedir}/lib/OpenAI_FSM.jar will be
unresolvable by dependent projects @ line 82, column 16
[WARNING] 'dependencies.dependency.systemPath' for findstruct:findstruct:jar should not point
at files within the project directory, ${project.basedir}/lib/FindStructAPI.jar will be unresolvable
by dependent projects @ line 89, column 16
[WARNING] 'dependencies.dependency.systemPath' for sqlWrapper:sqlWrapper:jar should not point
at files within the project directory, ${project.basedir}/lib/SQLWrapper.jar will be unresolvable
by dependent projects @ line 96, column 16
[WARNING] 
[WARNING] Some problems were encountered while building the effective model for org.apache.ctakes:ctakes-lvg:jar:3.1.0-incubating
[WARNING] 'dependencies.dependency.systemPath' for lvg2010dist:lvg2010dist:jar should not
point at files within the project directory, ${project.basedir}/lib/lvg2010dist.jar will be
unresolvable by dependent projects @ line 59, column 16
[WARNING] 
[WARNING] Some problems were encountered while building the effective model for org.apache.ctakes:ctakes-drug-ner:jar:3.1.0-incubating
[WARNING] 'dependencies.dependency.systemPath' for net.sourceforge.openai:fsm:jar should not
point at files within the project directory, ${project.basedir}/../ctakes-core/lib/OpenAI_FSM.jar
will be unresolvable by dependent projects @ line 86, column 16
[WARNING] 
[WARNING] Some problems were encountered while building the effective model for org.apache.ctakes:ctakes-assertion:jar:3.1.0-incubating
[WARNING] 'dependencies.dependency.(groupId:artifactId:type:classifier)' must be unique: junit:junit:jar
-> duplicate declaration of version (?) @ line 146, column 15
[WARNING] 'dependencies.dependency.systemPath' for org.mitre.medfacts:medfacts-i2b2:jar should
not point at files within the project directory, ${project.basedir}/lib/med-facts-i2b2-1.2-SNAPSHOT.jar
will be unresolvable by dependent projects @ line 184, column 16
[WARNING] 'dependencies.dependency.systemPath' for org.mitre.medfacts:medfacts-zoner:jar should
not point at files within the project directory, ${project.basedir}/lib/med-facts-zoner-1.1.jar
will be unresolvable by dependent projects @ line 191, column 16
[WARNING] 'dependencies.dependency.systemPath' for org.mitre.jcarafe.core:jcarafe.core:jar
should not point at files within the project directory, ${project.basedir}/lib/jcarafe-core_2.9.1-0.9.8.3.RC4.jar
will be unresolvable by dependent projects @ line 198, column 16
[WARNING] 'dependencies.dependency.systemPath' for org.mitre.jcarafe.ext:jcarafe.ext:jar should
not point at files within the project directory, ${project.basedir}/lib/jcarafe-ext_2.9.1-0.9.8.3.RC4.jar
will be unresolvable by dependent projects @ line 205, column 16
[WARNING] 
[WARNING] Some problems were encountered while building the effective model for org.apache.ctakes:ctakes-distribution:pom:3.1.0-incubating
[WARNING] 'dependencies.dependency.(groupId:artifactId:type:classifier)' must be unique: org.apache.ctakes:ctakes-ne-contexts:jar
-> duplicate declaration of version (?) @ line 99, column 15
[WARNING] 
[WARNING] It is highly recommended to fix these problems because they threaten the stability
of your build.
[WARNING] 
[INFO] [WARNING] For this reason, future Maven versions might no longer support building such
malformed projects.
[WARNING] 
------------------------------------------------------------------------
[INFO] Reactor Build Order:
[INFO] 
[INFO] Apache cTAKES Assertion
[INFO] Apache cTAKES ctakes-clinical-pipeline
[INFO] Apache cTAKES Relation Extractor
[INFO] Apache cTAKES Distribution
Projects to build: [MavenProject: org.apache.ctakes:ctakes-assertion:3.1.0-incubating @ <https://builds.apache.org/job/cTAKES-trunk-compiletest/ws/ctakes-assertion/pom.xml,>
MavenProject: org.apache.ctakes:ctakes-clinical-pipeline:3.1.0-incubating @ <https://builds.apache.org/job/cTAKES-trunk-compiletest/ws/ctakes-clinical-pipeline/pom.xml,>
MavenProject: org.apache.ctakes:ctakes-relation-extractor:3.1.0-incubating @ <https://builds.apache.org/job/cTAKES-trunk-compiletest/ws/ctakes-relation-extractor/pom.xml,>
MavenProject: org.apache.ctakes:ctakes-distribution:3.1.0-incubating @ <https://builds.apache.org/job/cTAKES-trunk-compiletest/ws/ctakes-distribution/pom.xml]>
projectStarted org.apache.ctakes:ctakes-assertion:3.1.0-incubating
[INFO]                                                                         
[INFO] ------------------------------------------------------------------------
[INFO] Building Apache cTAKES Assertion 3.1.0-incubating
[INFO] ------------------------------------------------------------------------
Downloading: http://repo1.maven.org/maven2/junit/junit/maven-metadata.xml
Downloading: http://repository.apache.org/snapshots/junit/junit/maven-metadata.xml
Downloaded: http://repo1.maven.org/maven2/junit/junit/maven-metadata.xml (868 B at 13.2 KB/sec)
Downloading: http://cleartk.googlecode.com/svn/repo/junit/junit/maven-metadata.xml
Downloading: http://repository.apache.org/snapshots/com/googlecode/clearparser/clearparser/0.4.0-SNAPSHOT/maven-metadata.xml
Downloading: http://cleartk.googlecode.com/svn/repo/com/googlecode/clearparser/clearparser/0.4.0-SNAPSHOT/maven-metadata.xml
Downloaded: http://cleartk.googlecode.com/svn/repo/com/googlecode/clearparser/clearparser/0.4.0-SNAPSHOT/maven-metadata.xml
(2 KB at 5.3 KB/sec)
Downloading: https://oss.sonatype.org/content/repositories/snapshots/junit/junit/maven-metadata.xml
Downloaded: https://oss.sonatype.org/content/repositories/snapshots/junit/junit/maven-metadata.xml
(369 B at 0.4 KB/sec)
Downloading: http://repo1.maven.org/maven2/org/cleartk/cleartk-examples/0.6.2/cleartk-examples-0.6.2.pom
Downloaded: http://repo1.maven.org/maven2/org/cleartk/cleartk-examples/0.6.2/cleartk-examples-0.6.2.pom
(5 KB at 18.4 KB/sec)
Downloading: http://repo1.maven.org/maven2/org/cleartk/cleartk-ml-svmlight/1.1.0/cleartk-ml-svmlight-1.1.0.pom
Downloaded: http://repo1.maven.org/maven2/org/cleartk/cleartk-ml-svmlight/1.1.0/cleartk-ml-svmlight-1.1.0.pom
(2 KB at 5.8 KB/sec)
Downloading: http://repo1.maven.org/maven2/org/cleartk/cleartk-named-entity/0.6.3/cleartk-named-entity-0.6.3.pom
Downloaded: http://repo1.maven.org/maven2/org/cleartk/cleartk-named-entity/0.6.3/cleartk-named-entity-0.6.3.pom
(3 KB at 6.5 KB/sec)
Downloading: http://repo1.maven.org/maven2/org/cleartk/cleartk-clearparser/0.7.1/cleartk-clearparser-0.7.1.pom
Downloaded: http://repo1.maven.org/maven2/org/cleartk/cleartk-clearparser/0.7.1/cleartk-clearparser-0.7.1.pom
(4 KB at 14.5 KB/sec)
Downloading: http://repo1.maven.org/maven2/org/apache/ctakes/ctakes-type-system/3.1.0-incubating/ctakes-type-system-3.1.0-incubating.jar
Downloading: http://repo1.maven.org/maven2/org/apache/ctakes/ctakes-core/3.1.0-incubating/ctakes-core-3.1.0-incubating.jar
Downloading: http://repo1.maven.org/maven2/org/apache/ctakes/ctakes-utils/3.1.0-incubating/ctakes-utils-3.1.0-incubating.jar
Downloading: http://repo1.maven.org/maven2/org/apache/ctakes/ctakes-pos-tagger/3.1.0-incubating/ctakes-pos-tagger-3.1.0-incubating.jar
Downloading: http://repo1.maven.org/maven2/org/apache/ctakes/ctakes-dependency-parser/3.1.0-incubating/ctakes-dependency-parser-3.1.0-incubating.jar
Downloading: http://repo1.maven.org/maven2/org/apache/ctakes/ctakes-lvg/3.1.0-incubating/ctakes-lvg-3.1.0-incubating.jar
Downloading: http://repo1.maven.org/maven2/org/cleartk/cleartk-examples/0.6.2/cleartk-examples-0.6.2.jar
Downloading: http://repo1.maven.org/maven2/org/cleartk/cleartk-ml-svmlight/1.1.0/cleartk-ml-svmlight-1.1.0.jar
Downloading: http://repo1.maven.org/maven2/org/cleartk/cleartk-named-entity/0.6.3/cleartk-named-entity-0.6.3.jar
Downloading: http://repo1.maven.org/maven2/org/cleartk/cleartk-clearparser/0.7.1/cleartk-clearparser-0.7.1.jar
Downloaded: http://repo1.maven.org/maven2/org/cleartk/cleartk-ml-svmlight/1.1.0/cleartk-ml-svmlight-1.1.0.jar
(56 KB at 266.4 KB/sec)
Downloaded: http://repo1.maven.org/maven2/org/cleartk/cleartk-named-entity/0.6.3/cleartk-named-entity-0.6.3.jar
(32 KB at 127.5 KB/sec)
Downloaded: http://repo1.maven.org/maven2/org/cleartk/cleartk-examples/0.6.2/cleartk-examples-0.6.2.jar
(4833 KB at 10934.1 KB/sec)
Downloaded: http://repo1.maven.org/maven2/org/cleartk/cleartk-clearparser/0.7.1/cleartk-clearparser-0.7.1.jar
(82652 KB at 23400.8 KB/sec)
Downloading: http://cleartk.googlecode.com/svn/repo/org/apache/ctakes/ctakes-lvg/3.1.0-incubating/ctakes-lvg-3.1.0-incubating.jar
projectFailed org.apache.ctakes:ctakes-assertion:3.1.0-incubating
sessionEnded
[INFO] ------------------------------------------------------------------------
[INFO] Reactor Summary:
[INFO] 
[INFO] Apache cTAKES Assertion ........................... FAILURE [10.018s]
[INFO] Apache cTAKES ctakes-clinical-pipeline ............ SKIPPED
[INFO] Apache cTAKES Relation Extractor .................. SKIPPED
[INFO] Apache cTAKES Distribution ........................ SKIPPED
[INFO] ------------------------------------------------------------------------
[INFO] BUILD FAILURE
[INFO] ------------------------------------------------------------------------
[INFO] Total time: 19.780s
[INFO] Finished at: Wed Oct 31 20:06:08 UTC 2012
[INFO] Final Memory: 10M/58M
[INFO] ------------------------------------------------------------------------
Projects to build: [MavenProject: org.apache.ctakes:ctakes-assertion:3.1.0-incubating @ <https://builds.apache.org/job/cTAKES-trunk-compiletest/ws/ctakes-assertion/pom.xml,>
MavenProject: org.apache.ctakes:ctakes-clinical-pipeline:3.1.0-incubating @ <https://builds.apache.org/job/cTAKES-trunk-compiletest/ws/ctakes-clinical-pipeline/pom.xml,>
MavenProject: org.apache.ctakes:ctakes-relation-extractor:3.1.0-incubating @ <https://builds.apache.org/job/cTAKES-trunk-compiletest/ws/ctakes-relation-extractor/pom.xml,>
MavenProject: org.apache.ctakes:ctakes-distribution:3.1.0-incubating @ <https://builds.apache.org/job/cTAKES-trunk-compiletest/ws/ctakes-distribution/pom.xml]>
[JENKINS] Archiving disabled - not archiving <https://builds.apache.org/job/cTAKES-trunk-compiletest/ws/ctakes-distribution/pom.xml>
[JENKINS] Archiving disabled - not archiving <https://builds.apache.org/job/cTAKES-trunk-compiletest/ws/ctakes-clinical-pipeline/pom.xml>
[JENKINS] Archiving disabled - not archiving <https://builds.apache.org/job/cTAKES-trunk-compiletest/ws/ctakes-assertion/pom.xml>
[JENKINS] Archiving disabled - not archiving <https://builds.apache.org/job/cTAKES-trunk-compiletest/ws/ctakes-relation-extractor/pom.xml>
Waiting for Jenkins to finish collecting data
mavenExecutionResult exceptions not empty
message : Failed to execute goal on project ctakes-assertion: Could not resolve dependencies
for project org.apache.ctakes:ctakes-assertion:jar:3.1.0-incubating: The following artifacts
could not be resolved: org.apache.ctakes:ctakes-type-system:jar:3.1.0-incubating, org.apache.ctakes:ctakes-core:jar:3.1.0-incubating,
org.apache.ctakes:ctakes-utils:jar:3.1.0-incubating, org.apache.ctakes:ctakes-pos-tagger:jar:3.1.0-incubating,
org.apache.ctakes:ctakes-dependency-parser:jar:3.1.0-incubating, org.apache.ctakes:ctakes-lvg:jar:3.1.0-incubating:
Could not find artifact org.apache.ctakes:ctakes-type-system:jar:3.1.0-incubating in central
(http://repo1.maven.org/maven2)
cause : Could not resolve dependencies for project org.apache.ctakes:ctakes-assertion:jar:3.1.0-incubating:
The following artifacts could not be resolved: org.apache.ctakes:ctakes-type-system:jar:3.1.0-incubating,
org.apache.ctakes:ctakes-core:jar:3.1.0-incubating, org.apache.ctakes:ctakes-utils:jar:3.1.0-incubating,
org.apache.ctakes:ctakes-pos-tagger:jar:3.1.0-incubating, org.apache.ctakes:ctakes-dependency-parser:jar:3.1.0-incubating,
org.apache.ctakes:ctakes-lvg:jar:3.1.0-incubating: Could not find artifact org.apache.ctakes:ctakes-type-system:jar:3.1.0-incubating
in central (http://repo1.maven.org/maven2)
Stack trace : 
org.apache.maven.lifecycle.LifecycleExecutionException: Failed to execute goal on project
ctakes-assertion: Could not resolve dependencies for project org.apache.ctakes:ctakes-assertion:jar:3.1.0-incubating:
The following artifacts could not be resolved: org.apache.ctakes:ctakes-type-system:jar:3.1.0-incubating,
org.apache.ctakes:ctakes-core:jar:3.1.0-incubating, org.apache.ctakes:ctakes-utils:jar:3.1.0-incubating,
org.apache.ctakes:ctakes-pos-tagger:jar:3.1.0-incubating, org.apache.ctakes:ctakes-dependency-parser:jar:3.1.0-incubating,
org.apache.ctakes:ctakes-lvg:jar:3.1.0-incubating: Could not find artifact org.apache.ctakes:ctakes-type-system:jar:3.1.0-incubating
in central (http://repo1.maven.org/maven2)
	at org.apache.maven.lifecycle.internal.LifecycleDependencyResolver.getDependencies(LifecycleDependencyResolver.java:196)
	at org.apache.maven.lifecycle.internal.LifecycleDependencyResolver.resolveProjectDependencies(LifecycleDependencyResolver.java:108)
	at org.apache.maven.lifecycle.internal.MojoExecutor.ensureDependenciesAreResolved(MojoExecutor.java:258)
	at org.apache.maven.lifecycle.internal.MojoExecutor.execute(MojoExecutor.java:201)
	at org.apache.maven.lifecycle.internal.MojoExecutor.execute(MojoExecutor.java:153)
	at org.apache.maven.lifecycle.internal.MojoExecutor.execute(MojoExecutor.java:145)
	at org.apache.maven.lifecycle.internal.LifecycleModuleBuilder.buildProject(LifecycleModuleBuilder.java:84)
	at org.apache.maven.lifecycle.internal.LifecycleModuleBuilder.buildProject(LifecycleModuleBuilder.java:59)
	at org.apache.maven.lifecycle.internal.LifecycleStarter.singleThreadedBuild(LifecycleStarter.java:183)
	at org.apache.maven.lifecycle.internal.LifecycleStarter.execute(LifecycleStarter.java:161)
	at org.apache.maven.DefaultMaven.doExecute(DefaultMaven.java:319)
	at org.apache.maven.DefaultMaven.execute(DefaultMaven.java:156)
	at org.jvnet.hudson.maven3.launcher.Maven3Launcher.main(Maven3Launcher.java:79)
	at sun.reflect.NativeMethodAccessorImpl.invoke0(Native Method)
	at sun.reflect.NativeMethodAccessorImpl.invoke(NativeMethodAccessorImpl.java:39)
	at sun.reflect.DelegatingMethodAccessorImpl.invoke(DelegatingMethodAccessorImpl.java:25)
	at java.lang.reflect.Method.invoke(Method.java:597)
	at org.codehaus.plexus.classworlds.launcher.Launcher.launchStandard(Launcher.java:329)
	at org.codehaus.plexus.classworlds.launcher.Launcher.launch(Launcher.java:239)
	at org.jvnet.hudson.maven3.agent.Maven3Main.launch(Maven3Main.java:158)
	at hudson.maven.Maven3Builder.call(Maven3Builder.java:98)
	at hudson.maven.Maven3Builder.call(Maven3Builder.java:64)
	at hudson.remoting.UserRequest.perform(UserRequest.java:118)
	at hudson.remoting.UserRequest.perform(UserRequest.java:48)
	at hudson.remoting.Request$2.run(Request.java:326)
	at hudson.remoting.InterceptingExecutorService$1.call(InterceptingExecutorService.java:72)
	at java.util.concurrent.FutureTask$Sync.innerRun(FutureTask.java:303)
	at java.util.concurrent.FutureTask.run(FutureTask.java:138)
	at java.util.concurrent.ThreadPoolExecutor$Worker.runTask(ThreadPoolExecutor.java:886)
	at java.util.concurrent.ThreadPoolExecutor$Worker.run(ThreadPoolExecutor.java:908)
	at java.lang.Thread.run(Thread.java:662)
Caused by: org.apache.maven.project.DependencyResolutionException: Could not resolve dependencies
for project org.apache.ctakes:ctakes-assertion:jar:3.1.0-incubating: The following artifacts
could not be resolved: org.apache.ctakes:ctakes-type-system:jar:3.1.0-incubating, org.apache.ctakes:ctakes-core:jar:3.1.0-incubating,
org.apache.ctakes:ctakes-utils:jar:3.1.0-incubating, org.apache.ctakes:ctakes-pos-tagger:jar:3.1.0-incubating,
org.apache.ctakes:ctakes-dependency-parser:jar:3.1.0-incubating, org.apache.ctakes:ctakes-lvg:jar:3.1.0-incubating:
Could not find artifact org.apache.ctakes:ctakes-type-system:jar:3.1.0-incubating in central
(http://repo1.maven.org/maven2)
	at org.apache.maven.project.DefaultProjectDependenciesResolver.resolve(DefaultProjectDependenciesResolver.java:170)
	at org.apache.maven.lifecycle.internal.LifecycleDependencyResolver.getDependencies(LifecycleDependencyResolver.java:171)
	... 30 more
Caused by: org.sonatype.aether.resolution.DependencyResolutionException: The following artifacts
could not be resolved: org.apache.ctakes:ctakes-type-system:jar:3.1.0-incubating, org.apache.ctakes:ctakes-core:jar:3.1.0-incubating,
org.apache.ctakes:ctakes-utils:jar:3.1.0-incubating, org.apache.ctakes:ctakes-pos-tagger:jar:3.1.0-incubating,
org.apache.ctakes:ctakes-dependency-parser:jar:3.1.0-incubating, org.apache.ctakes:ctakes-lvg:jar:3.1.0-incubating:
Could not find artifact org.apache.ctakes:ctakes-type-system:jar:3.1.0-incubating in central
(http://repo1.maven.org/maven2)
	at org.sonatype.aether.impl.internal.DefaultRepositorySystem.resolveDependencies(DefaultRepositorySystem.java:412)
	at org.apache.maven.project.DefaultProjectDependenciesResolver.resolve(DefaultProjectDependenciesResolver.java:164)
	... 31 more
Caused by: org.sonatype.aether.resolution.ArtifactResolutionException: The following artifacts
could not be resolved: org.apache.ctakes:ctakes-type-system:jar:3.1.0-incubating, org.apache.ctakes:ctakes-core:jar:3.1.0-incubating,
org.apache.ctakes:ctakes-utils:jar:3.1.0-incubating, org.apache.ctakes:ctakes-pos-tagger:jar:3.1.0-incubating,
org.apache.ctakes:ctakes-dependency-parser:jar:3.1.0-incubating, org.apache.ctakes:ctakes-lvg:jar:3.1.0-incubating:
Could not find artifact org.apache.ctakes:ctakes-type-system:jar:3.1.0-incubating in central
(http://repo1.maven.org/maven2)
	at org.sonatype.aether.impl.internal.DefaultArtifactResolver.resolve(DefaultArtifactResolver.java:541)
	at org.sonatype.aether.impl.internal.DefaultArtifactResolver.resolveArtifacts(DefaultArtifactResolver.java:220)
	at org.sonatype.aether.impl.internal.DefaultRepositorySystem.resolveDependencies(DefaultRepositorySystem.java:395)
	... 32 more
Caused by: org.sonatype.aether.transfer.ArtifactNotFoundException: Could not find artifact
org.apache.ctakes:ctakes-type-system:jar:3.1.0-incubating in central (http://repo1.maven.org/maven2)
	at org.sonatype.aether.connector.wagon.WagonRepositoryConnector$4.wrap(WagonRepositoryConnector.java:945)
	at org.sonatype.aether.connector.wagon.WagonRepositoryConnector$4.wrap(WagonRepositoryConnector.java:940)
	at org.sonatype.aether.connector.wagon.WagonRepositoryConnector$GetTask.flush(WagonRepositoryConnector.java:695)
	at org.sonatype.aether.connector.wagon.WagonRepositoryConnector$GetTask.flush(WagonRepositoryConnector.java:689)
	at org.sonatype.aether.connector.wagon.WagonRepositoryConnector.get(WagonRepositoryConnector.java:445)
	at org.sonatype.aether.impl.internal.DefaultArtifactResolver.resolve(DefaultArtifactResolver.java:460)
	... 34 more
Sending e-mails to: ctakes-notifications@incubator.apache.org mattcoarr@gmail.com
channel stopped

Mime
View raw message