incubator-ctakes-notifications mailing list archives

Site index · List index
Message view « Date » · « Thread »
Top « Date » · « Thread »
From Apache Jenkins Server <jenk...@builds.apache.org>
Subject Build failed in Jenkins: ctakes-trunk-package » Apache cTAKES Assertion #6
Date Tue, 30 Oct 2012 00:52:27 GMT
See <https://builds.apache.org/job/ctakes-trunk-package/org.apache.ctakes$ctakes-assertion/6/changes>

Changes:

[mattcoarr] beginnings of the assertion evaluation code

[chenpei] [maven-release-plugin] prepare for next development iteration

[chenpei] [maven-release-plugin] prepare release 3.0.0-incubating-rc1

------------------------------------------
[...truncated 20 lines...]
[INFO] 
[INFO] JCasGen: Output going to '<https://builds.apache.org/job/ctakes-trunk-package/org.apache.ctakes$ctakes-assertion/ws/target/generated-sources/jcasgen'>
[INFO] JCasGen: Reading the XML TAE descriptor, and creating types, for xml input file '<https://builds.apache.org/job/ctakes-trunk-package/org.apache.ctakes$ctakes-assertion/ws/src/main/resources/org/apache/ctakes/assertion/types/TypeSystem.xml'.>
[INFO] JCasGen: Replacing: 'org.apache.ctakes.assertion.medfacts.types.Assertion'.
[INFO] JCasGen: Replacing: 'org.apache.ctakes.assertion.medfacts.types.Assertion_Type'.
[INFO] JCasGen: Replacing: 'org.apache.ctakes.assertion.medfacts.types.Concept'.
[INFO] JCasGen: Replacing: 'org.apache.ctakes.assertion.medfacts.types.Concept_Type'.
[INFO] --- jcasgen-maven-plugin:0.9.3:generate (default) @ ctakes-assertion ---
mojoSucceeded org.cleartk:jcasgen-maven-plugin:0.9.3(default)
mojoStarted org.apache.maven.plugins:maven-compiler-plugin:2.4(default-compile)
[INFO] 
[INFO] --- maven-compiler-plugin:2.4:compile (default-compile) @ ctakes-assertion ---
[INFO] Compiling 7 source files to <https://builds.apache.org/job/ctakes-trunk-package/org.apache.ctakes$ctakes-assertion/ws/target/classes>
[INFO] -------------------------------------------------------------
[ERROR] COMPILATION ERROR : 
[INFO] -------------------------------------------------------------
[ERROR] <https://builds.apache.org/job/ctakes-trunk-package/org.apache.ctakes$ctakes-assertion/ws/src/main/java/org/apache/ctakes/assertion/medfacts/cleartk/AssertionCleartkAnalysisEngine.java>:[20,29]
[deprecation] org.cleartk.classifier.CleartkAnnotatorDescriptionFactory in org.cleartk.classifier
has been deprecated
[ERROR] <https://builds.apache.org/job/ctakes-trunk-package/org.apache.ctakes$ctakes-assertion/ws/src/main/java/org/apache/ctakes/assertion/medfacts/cleartk/AssertionCleartkAnalysisEngine.java>:[23,47]
[deprecation] org.cleartk.classifier.feature.extractor.ContextExtractor in org.cleartk.classifier.feature.extractor
has been deprecated
[ERROR] <https://builds.apache.org/job/ctakes-trunk-package/org.apache.ctakes$ctakes-assertion/ws/src/main/java/org/apache/ctakes/assertion/medfacts/cleartk/AssertionCleartkAnalysisEngine.java>:[24,47]
[deprecation] org.cleartk.classifier.feature.extractor.ContextExtractor in org.cleartk.classifier.feature.extractor
has been deprecated
[ERROR] <https://builds.apache.org/job/ctakes-trunk-package/org.apache.ctakes$ctakes-assertion/ws/src/main/java/org/apache/ctakes/assertion/medfacts/cleartk/AssertionCleartkAnalysisEngine.java>:[24,47]
[deprecation] org.cleartk.classifier.feature.extractor.ContextExtractor in org.cleartk.classifier.feature.extractor
has been deprecated
[ERROR] <https://builds.apache.org/job/ctakes-trunk-package/org.apache.ctakes$ctakes-assertion/ws/src/main/java/org/apache/ctakes/assertion/medfacts/cleartk/AssertionCleartkAnalysisEngine.java>:[25,47]
[deprecation] org.cleartk.classifier.feature.extractor.ContextExtractor in org.cleartk.classifier.feature.extractor
has been deprecated
[ERROR] <https://builds.apache.org/job/ctakes-trunk-package/org.apache.ctakes$ctakes-assertion/ws/src/main/java/org/apache/ctakes/assertion/medfacts/cleartk/AssertionCleartkAnalysisEngine.java>:[25,47]
[deprecation] org.cleartk.classifier.feature.extractor.ContextExtractor in org.cleartk.classifier.feature.extractor
has been deprecated
[ERROR] <https://builds.apache.org/job/ctakes-trunk-package/org.apache.ctakes$ctakes-assertion/ws/src/main/java/org/apache/ctakes/assertion/medfacts/cleartk/AssertionCleartkAnalysisEngine.java>:[26,47]
[deprecation] org.cleartk.classifier.feature.extractor.ContextExtractor in org.cleartk.classifier.feature.extractor
has been deprecated
[ERROR] <https://builds.apache.org/job/ctakes-trunk-package/org.apache.ctakes$ctakes-assertion/ws/src/main/java/org/apache/ctakes/assertion/medfacts/cleartk/AssertionCleartkAnalysisEngine.java>:[26,47]
[deprecation] org.cleartk.classifier.feature.extractor.ContextExtractor in org.cleartk.classifier.feature.extractor
has been deprecated
[ERROR] <https://builds.apache.org/job/ctakes-trunk-package/org.apache.ctakes$ctakes-assertion/ws/src/main/java/org/apache/ctakes/assertion/medfacts/cleartk/AssertionCleartkAnalysisEngine.java>:[29,54]
[deprecation] org.cleartk.classifier.feature.extractor.simple.SpannedTextExtractor in org.cleartk.classifier.feature.extractor.simple
has been deprecated
[ERROR] <https://builds.apache.org/job/ctakes-trunk-package/org.apache.ctakes$ctakes-assertion/ws/src/main/java/org/apache/ctakes/assertion/medfacts/cleartk/AssertionCleartkAnalysisEngine.java>:[31,49]
[deprecation] org.cleartk.classifier.feature.proliferate.CapitalTypeProliferator in org.cleartk.classifier.feature.proliferate
has been deprecated
[ERROR] <https://builds.apache.org/job/ctakes-trunk-package/org.apache.ctakes$ctakes-assertion/ws/src/main/java/org/apache/ctakes/assertion/medfacts/cleartk/AssertionCleartkAnalysisEngine.java>:[32,49]
[deprecation] org.cleartk.classifier.feature.proliferate.CharacterNGramProliferator in org.cleartk.classifier.feature.proliferate
has been deprecated
[ERROR] <https://builds.apache.org/job/ctakes-trunk-package/org.apache.ctakes$ctakes-assertion/ws/src/main/java/org/apache/ctakes/assertion/medfacts/cleartk/AssertionCleartkAnalysisEngine.java>:[33,49]
[deprecation] org.cleartk.classifier.feature.proliferate.LowerCaseProliferator in org.cleartk.classifier.feature.proliferate
has been deprecated
[ERROR] <https://builds.apache.org/job/ctakes-trunk-package/org.apache.ctakes$ctakes-assertion/ws/src/main/java/org/apache/ctakes/assertion/medfacts/cleartk/AssertionCleartkAnalysisEngine.java>:[34,49]
[deprecation] org.cleartk.classifier.feature.proliferate.NumericTypeProliferator in org.cleartk.classifier.feature.proliferate
has been deprecated
[ERROR] <https://builds.apache.org/job/ctakes-trunk-package/org.apache.ctakes$ctakes-assertion/ws/src/main/java/org/apache/ctakes/assertion/medfacts/cleartk/AssertionCleartkAnalysisEngine.java>:[35,49]
[deprecation] org.cleartk.classifier.feature.proliferate.ProliferatingExtractor in org.cleartk.classifier.feature.proliferate
has been deprecated
[ERROR] <https://builds.apache.org/job/ctakes-trunk-package/org.apache.ctakes$ctakes-assertion/ws/src/main/java/org/apache/ctakes/assertion/medfacts/cleartk/AssertionCleartkAnalysisEngine.java>:[36,37]
[deprecation] org.cleartk.classifier.opennlp.DefaultMaxentDataWriterFactory in org.cleartk.classifier.opennlp
has been deprecated
[ERROR] <https://builds.apache.org/job/ctakes-trunk-package/org.apache.ctakes$ctakes-assertion/ws/src/main/java/org/apache/ctakes/assertion/medfacts/cleartk/AssertionCleartkAnalysisEngine.java>:[37,37]
[deprecation] org.cleartk.classifier.opennlp.MaxentDataWriterFactory_ImplBase in org.cleartk.classifier.opennlp
has been deprecated
[ERROR] <https://builds.apache.org/job/ctakes-trunk-package/org.apache.ctakes$ctakes-assertion/ws/src/main/java/org/apache/ctakes/assertion/medfacts/cleartk/AssertionCleartkAnalysisEngine.java>:[44,45]
package edu.mayo.bmi.uima.core.type.structured does not exist
[ERROR] <https://builds.apache.org/job/ctakes-trunk-package/org.apache.ctakes$ctakes-assertion/ws/src/main/java/org/apache/ctakes/assertion/medfacts/cleartk/AssertionCleartkAnalysisEngine.java>:[45,41]
package edu.mayo.bmi.uima.core.type.syntax does not exist
[ERROR] <https://builds.apache.org/job/ctakes-trunk-package/org.apache.ctakes$ctakes-assertion/ws/src/main/java/org/apache/ctakes/assertion/medfacts/cleartk/AssertionCleartkAnalysisEngine.java>:[46,42]
package edu.mayo.bmi.uima.core.type.textsem does not exist
[ERROR] <https://builds.apache.org/job/ctakes-trunk-package/org.apache.ctakes$ctakes-assertion/ws/src/main/java/org/apache/ctakes/assertion/medfacts/cleartk/AssertionCleartkAnalysisEngine.java>:[47,42]
package edu.mayo.bmi.uima.core.type.textsem does not exist
[ERROR] <https://builds.apache.org/job/ctakes-trunk-package/org.apache.ctakes$ctakes-assertion/ws/src/main/java/org/apache/ctakes/assertion/medfacts/cleartk/AssertionCleartkAnalysisEngine.java>:[48,42]
package edu.mayo.bmi.uima.core.type.textsem does not exist
[ERROR] <https://builds.apache.org/job/ctakes-trunk-package/org.apache.ctakes$ctakes-assertion/ws/src/main/java/org/apache/ctakes/assertion/medfacts/cleartk/AssertionCleartkAnalysisEngine.java>:[49,43]
package edu.mayo.bmi.uima.core.type.textspan does not exist
[ERROR] <https://builds.apache.org/job/ctakes-trunk-package/org.apache.ctakes$ctakes-assertion/ws/src/main/java/org/apache/ctakes/assertion/medfacts/cleartk/AssertionCleartkAnalysisEngine.java>:[78,15]
[deprecation] org.cleartk.classifier.feature.extractor.ContextExtractor in org.cleartk.classifier.feature.extractor
has been deprecated
[ERROR] <https://builds.apache.org/job/ctakes-trunk-package/org.apache.ctakes$ctakes-assertion/ws/src/main/java/org/apache/ctakes/assertion/medfacts/cleartk/AssertionCleartkAnalysisEngine.java>:[78,32]
cannot find symbol
symbol  : class IdentifiedAnnotation
location: class org.apache.ctakes.assertion.medfacts.cleartk.AssertionCleartkAnalysisEngine
[ERROR] <https://builds.apache.org/job/ctakes-trunk-package/org.apache.ctakes$ctakes-assertion/ws/src/main/java/org/apache/ctakes/assertion/medfacts/cleartk/AssertionCleartkAnalysisEngine.java>:[79,15]
[deprecation] org.cleartk.classifier.feature.extractor.ContextExtractor in org.cleartk.classifier.feature.extractor
has been deprecated
[ERROR] <https://builds.apache.org/job/ctakes-trunk-package/org.apache.ctakes$ctakes-assertion/ws/src/main/java/org/apache/ctakes/assertion/medfacts/cleartk/AssertionCleartkAnalysisEngine.java>:[79,32]
cannot find symbol
symbol  : class BaseToken
location: class org.apache.ctakes.assertion.medfacts.cleartk.AssertionCleartkAnalysisEngine
[ERROR] <https://builds.apache.org/job/ctakes-trunk-package/org.apache.ctakes$ctakes-assertion/ws/src/main/java/org/apache/ctakes/assertion/eval/AssertionEvalBasedOnModifier.java>:[56,37]
[deprecation] org.cleartk.classifier.opennlp.DefaultMaxentDataWriterFactory in org.cleartk.classifier.opennlp
has been deprecated
[ERROR] <https://builds.apache.org/job/ctakes-trunk-package/org.apache.ctakes$ctakes-assertion/ws/src/main/java/org/apache/ctakes/assertion/eval/AssertionEvalBasedOnModifier.java>:[58,23]
package org.cleartk.eval does not exist
[ERROR] <https://builds.apache.org/job/ctakes-trunk-package/org.apache.ctakes$ctakes-assertion/ws/src/main/java/org/apache/ctakes/assertion/eval/AssertionEvalBasedOnModifier.java>:[59,23]
package org.cleartk.eval does not exist
[ERROR] <https://builds.apache.org/job/ctakes-trunk-package/org.apache.ctakes$ctakes-assertion/ws/src/main/java/org/apache/ctakes/assertion/eval/AssertionEvalBasedOnModifier.java>:[91,50]
cannot find symbol
symbol: class Evaluation_ImplBase
public class AssertionEvalBasedOnModifier extends Evaluation_ImplBase<File, AnnotationStatistics>
{
[ERROR] <https://builds.apache.org/job/ctakes-trunk-package/org.apache.ctakes$ctakes-assertion/ws/src/main/java/org/apache/ctakes/assertion/eval/AssertionEvalBasedOnModifier.java>:[91,76]
cannot find symbol
symbol: class AnnotationStatistics
public class AssertionEvalBasedOnModifier extends Evaluation_ImplBase<File, AnnotationStatistics>
{
[ERROR] <https://builds.apache.org/job/ctakes-trunk-package/org.apache.ctakes$ctakes-assertion/ws/src/main/java/org/apache/ctakes/assertion/medfacts/cleartk/TrainAssertionModel.java>:[23,29]
[deprecation] org.cleartk.classifier.CleartkAnnotatorDescriptionFactory in org.cleartk.classifier
has been deprecated
[ERROR] <https://builds.apache.org/job/ctakes-trunk-package/org.apache.ctakes$ctakes-assertion/ws/src/main/java/org/apache/ctakes/assertion/medfacts/cleartk/TrainAssertionModel.java>:[27,37]
[deprecation] org.cleartk.classifier.opennlp.DefaultMaxentDataWriterFactory in org.cleartk.classifier.opennlp
has been deprecated
[ERROR] <https://builds.apache.org/job/ctakes-trunk-package/org.apache.ctakes$ctakes-assertion/ws/src/main/java/org/apache/ctakes/assertion/medfacts/cleartk/TrainAssertionModel.java>:[28,37]
[deprecation] org.cleartk.classifier.opennlp.MaxentDataWriter in org.cleartk.classifier.opennlp
has been deprecated
[ERROR] <https://builds.apache.org/job/ctakes-trunk-package/org.apache.ctakes$ctakes-assertion/ws/src/main/java/org/apache/ctakes/assertion/medfacts/cleartk/TrainAssertionModel.java>:[39,16]
package org.junit does not exist
[ERROR] <https://builds.apache.org/job/ctakes-trunk-package/org.apache.ctakes$ctakes-assertion/ws/src/main/java/org/apache/ctakes/assertion/medfacts/cleartk/TrainAssertionModel.java>:[41,41]
package edu.mayo.bmi.uima.core.type.syntax does not exist
[ERROR] <https://builds.apache.org/job/ctakes-trunk-package/org.apache.ctakes$ctakes-assertion/ws/src/main/java/org/apache/ctakes/assertion/medfacts/cleartk/TrainAssertionModel.java>:[43,42]
package edu.mayo.bmi.uima.core.type.textsem does not exist
[ERROR] <https://builds.apache.org/job/ctakes-trunk-package/org.apache.ctakes$ctakes-assertion/ws/src/main/java/org/apache/ctakes/assertion/medfacts/cleartk/TrainAssertionModel.java>:[44,43]
package edu.mayo.bmi.uima.core.type.textspan does not exist
[ERROR] <https://builds.apache.org/job/ctakes-trunk-package/org.apache.ctakes$ctakes-assertion/ws/src/main/java/org/apache/ctakes/assertion/medfacts/cleartk/TrainAssertionModel.java>:[46,31]
package org.cleartk.examples.pos does not exist
[ERROR] <https://builds.apache.org/job/ctakes-trunk-package/org.apache.ctakes$ctakes-assertion/ws/src/main/java/org/apache/ctakes/assertion/eval/AssertionEvalBasedOnModifier.java>:[288,12]
cannot find symbol
symbol  : class AnnotationStatistics
location: class org.apache.ctakes.assertion.eval.AssertionEvalBasedOnModifier
[ERROR] <https://builds.apache.org/job/ctakes-trunk-package/org.apache.ctakes$ctakes-assertion/ws/src/main/java/org/apache/ctakes/assertion/medfacts/cleartk/TrainAssertionModel.java>:[91,3]
cannot find symbol
symbol  : class Test
location: class org.apache.ctakes.assertion.medfacts.cleartk.TrainAssertionModel
[ERROR] <https://builds.apache.org/job/ctakes-trunk-package/org.apache.ctakes$ctakes-assertion/ws/src/main/java/org/apache/ctakes/assertion/medfacts/cleartk/AssertionCleartkAnalysisEngine.java>:[90,20]
[deprecation] org.cleartk.classifier.feature.proliferate.CharacterNGramProliferator in org.cleartk.classifier.feature.proliferate
has been deprecated
[ERROR] <https://builds.apache.org/job/ctakes-trunk-package/org.apache.ctakes$ctakes-assertion/ws/src/main/java/org/apache/ctakes/assertion/medfacts/cleartk/AssertionCleartkAnalysisEngine.java>:[98,12]
[deprecation] org.cleartk.classifier.feature.proliferate.ProliferatingExtractor in org.cleartk.classifier.feature.proliferate
has been deprecated
[ERROR] <https://builds.apache.org/job/ctakes-trunk-package/org.apache.ctakes$ctakes-assertion/ws/src/main/java/org/apache/ctakes/assertion/medfacts/cleartk/AssertionCleartkAnalysisEngine.java>:[99,16]
[deprecation] org.cleartk.classifier.feature.extractor.simple.SpannedTextExtractor in org.cleartk.classifier.feature.extractor.simple
has been deprecated
[ERROR] <https://builds.apache.org/job/ctakes-trunk-package/org.apache.ctakes$ctakes-assertion/ws/src/main/java/org/apache/ctakes/assertion/medfacts/cleartk/AssertionCleartkAnalysisEngine.java>:[100,16]
[deprecation] org.cleartk.classifier.feature.proliferate.LowerCaseProliferator in org.cleartk.classifier.feature.proliferate
has been deprecated
[ERROR] <https://builds.apache.org/job/ctakes-trunk-package/org.apache.ctakes$ctakes-assertion/ws/src/main/java/org/apache/ctakes/assertion/medfacts/cleartk/AssertionCleartkAnalysisEngine.java>:[101,16]
[deprecation] org.cleartk.classifier.feature.proliferate.CapitalTypeProliferator in org.cleartk.classifier.feature.proliferate
has been deprecated
[ERROR] <https://builds.apache.org/job/ctakes-trunk-package/org.apache.ctakes$ctakes-assertion/ws/src/main/java/org/apache/ctakes/assertion/medfacts/cleartk/AssertionCleartkAnalysisEngine.java>:[102,16]
[deprecation] org.cleartk.classifier.feature.proliferate.NumericTypeProliferator in org.cleartk.classifier.feature.proliferate
has been deprecated
[ERROR] <https://builds.apache.org/job/ctakes-trunk-package/org.apache.ctakes$ctakes-assertion/ws/src/main/java/org/apache/ctakes/assertion/medfacts/cleartk/AssertionCleartkAnalysisEngine.java>:[103,16]
[deprecation] org.cleartk.classifier.feature.proliferate.CharacterNGramProliferator in org.cleartk.classifier.feature.proliferate
has been deprecated
[ERROR] <https://builds.apache.org/job/ctakes-trunk-package/org.apache.ctakes$ctakes-assertion/ws/src/main/java/org/apache/ctakes/assertion/medfacts/cleartk/AssertionCleartkAnalysisEngine.java>:[104,16]
[deprecation] org.cleartk.classifier.feature.proliferate.CharacterNGramProliferator in org.cleartk.classifier.feature.proliferate
has been deprecated
[ERROR] <https://builds.apache.org/job/ctakes-trunk-package/org.apache.ctakes$ctakes-assertion/ws/src/main/java/org/apache/ctakes/assertion/medfacts/cleartk/AssertionCleartkAnalysisEngine.java>:[107,50]
[deprecation] org.cleartk.classifier.feature.extractor.ContextExtractor in org.cleartk.classifier.feature.extractor
has been deprecated
[ERROR] <https://builds.apache.org/job/ctakes-trunk-package/org.apache.ctakes$ctakes-assertion/ws/src/main/java/org/apache/ctakes/assertion/medfacts/cleartk/AssertionCleartkAnalysisEngine.java>:[107,67]
cannot find symbol
symbol  : class IdentifiedAnnotation
location: class org.apache.ctakes.assertion.medfacts.cleartk.AssertionCleartkAnalysisEngine
[ERROR] <https://builds.apache.org/job/ctakes-trunk-package/org.apache.ctakes$ctakes-assertion/ws/src/main/java/org/apache/ctakes/assertion/medfacts/cleartk/AssertionCleartkAnalysisEngine.java>:[108,42]
[deprecation] org.cleartk.classifier.feature.extractor.ContextExtractor in org.cleartk.classifier.feature.extractor
has been deprecated
[ERROR] <https://builds.apache.org/job/ctakes-trunk-package/org.apache.ctakes$ctakes-assertion/ws/src/main/java/org/apache/ctakes/assertion/medfacts/cleartk/AssertionCleartkAnalysisEngine.java>:[108,59]
cannot find symbol
symbol  : class IdentifiedAnnotation
location: class org.apache.ctakes.assertion.medfacts.cleartk.AssertionCleartkAnalysisEngine
[ERROR] <https://builds.apache.org/job/ctakes-trunk-package/org.apache.ctakes$ctakes-assertion/ws/src/main/java/org/apache/ctakes/assertion/medfacts/cleartk/AssertionCleartkAnalysisEngine.java>:[109,8]
cannot find symbol
symbol  : class IdentifiedAnnotation
location: class org.apache.ctakes.assertion.medfacts.cleartk.AssertionCleartkAnalysisEngine
[ERROR] <https://builds.apache.org/job/ctakes-trunk-package/org.apache.ctakes$ctakes-assertion/ws/src/main/java/org/apache/ctakes/assertion/medfacts/cleartk/AssertionCleartkAnalysisEngine.java>:[115,4]
[deprecation] org.cleartk.classifier.feature.extractor.ContextExtractor in org.cleartk.classifier.feature.extractor
has been deprecated
[ERROR] <https://builds.apache.org/job/ctakes-trunk-package/org.apache.ctakes$ctakes-assertion/ws/src/main/java/org/apache/ctakes/assertion/medfacts/cleartk/AssertionCleartkAnalysisEngine.java>:[115,21]
cannot find symbol
symbol  : class BaseToken
location: class org.apache.ctakes.assertion.medfacts.cleartk.AssertionCleartkAnalysisEngine
[ERROR] <https://builds.apache.org/job/ctakes-trunk-package/org.apache.ctakes$ctakes-assertion/ws/src/main/java/org/apache/ctakes/assertion/medfacts/cleartk/AssertionCleartkAnalysisEngine.java>:[115,61]
[deprecation] org.cleartk.classifier.feature.extractor.ContextExtractor in org.cleartk.classifier.feature.extractor
has been deprecated
[ERROR] <https://builds.apache.org/job/ctakes-trunk-package/org.apache.ctakes$ctakes-assertion/ws/src/main/java/org/apache/ctakes/assertion/medfacts/cleartk/AssertionCleartkAnalysisEngine.java>:[115,78]
cannot find symbol
symbol  : class BaseToken
location: class org.apache.ctakes.assertion.medfacts.cleartk.AssertionCleartkAnalysisEngine
[ERROR] <https://builds.apache.org/job/ctakes-trunk-package/org.apache.ctakes$ctakes-assertion/ws/src/main/java/org/apache/ctakes/assertion/medfacts/cleartk/AssertionCleartkAnalysisEngine.java>:[116,8]
cannot find symbol
symbol  : class BaseToken
location: class org.apache.ctakes.assertion.medfacts.cleartk.AssertionCleartkAnalysisEngine
[ERROR] <https://builds.apache.org/job/ctakes-trunk-package/org.apache.ctakes$ctakes-assertion/ws/src/main/java/org/apache/ctakes/assertion/medfacts/cleartk/AssertionCleartkAnalysisEngine.java>:[117,12]
[deprecation] org.cleartk.classifier.feature.extractor.simple.SpannedTextExtractor in org.cleartk.classifier.feature.extractor.simple
has been deprecated
[ERROR] <https://builds.apache.org/job/ctakes-trunk-package/org.apache.ctakes$ctakes-assertion/ws/src/main/java/org/apache/ctakes/assertion/medfacts/cleartk/AssertionCleartkAnalysisEngine.java>:[118,12]
[deprecation] org.cleartk.classifier.feature.extractor.ContextExtractor in org.cleartk.classifier.feature.extractor
has been deprecated
[ERROR] <https://builds.apache.org/job/ctakes-trunk-package/org.apache.ctakes$ctakes-assertion/ws/src/main/java/org/apache/ctakes/assertion/medfacts/cleartk/AssertionCleartkAnalysisEngine.java>:[120,12]
[deprecation] org.cleartk.classifier.feature.extractor.ContextExtractor in org.cleartk.classifier.feature.extractor
has been deprecated
[ERROR] <https://builds.apache.org/job/ctakes-trunk-package/org.apache.ctakes$ctakes-assertion/ws/src/main/java/org/apache/ctakes/assertion/medfacts/cleartk/AssertionCleartkAnalysisEngine.java>:[121,12]
[deprecation] org.cleartk.classifier.feature.extractor.ContextExtractor in org.cleartk.classifier.feature.extractor
has been deprecated
[ERROR] <https://builds.apache.org/job/ctakes-trunk-package/org.apache.ctakes$ctakes-assertion/ws/src/main/java/org/apache/ctakes/assertion/medfacts/cleartk/AssertionCleartkAnalysisEngine.java>:[123,12]
[deprecation] org.cleartk.classifier.feature.extractor.ContextExtractor in org.cleartk.classifier.feature.extractor
has been deprecated
[ERROR] <https://builds.apache.org/job/ctakes-trunk-package/org.apache.ctakes$ctakes-assertion/ws/src/main/java/org/apache/ctakes/assertion/medfacts/cleartk/AssertionCleartkAnalysisEngine.java>:[125,12]
[deprecation] org.cleartk.classifier.feature.extractor.ContextExtractor in org.cleartk.classifier.feature.extractor
has been deprecated
[ERROR] <https://builds.apache.org/job/ctakes-trunk-package/org.apache.ctakes$ctakes-assertion/ws/src/main/java/org/apache/ctakes/assertion/medfacts/cleartk/AssertionCleartkAnalysisEngine.java>:[126,12]
[deprecation] org.cleartk.classifier.feature.extractor.ContextExtractor in org.cleartk.classifier.feature.extractor
has been deprecated
[ERROR] <https://builds.apache.org/job/ctakes-trunk-package/org.apache.ctakes$ctakes-assertion/ws/src/main/java/org/apache/ctakes/assertion/medfacts/cleartk/AssertionCleartkAnalysisEngine.java>:[128,12]
[deprecation] org.cleartk.classifier.feature.extractor.ContextExtractor in org.cleartk.classifier.feature.extractor
has been deprecated
[ERROR] <https://builds.apache.org/job/ctakes-trunk-package/org.apache.ctakes$ctakes-assertion/ws/src/main/java/org/apache/ctakes/assertion/medfacts/cleartk/AssertionCleartkAnalysisEngine.java>:[131,50]
[deprecation] org.cleartk.classifier.feature.extractor.ContextExtractor in org.cleartk.classifier.feature.extractor
has been deprecated
[ERROR] <https://builds.apache.org/job/ctakes-trunk-package/org.apache.ctakes$ctakes-assertion/ws/src/main/java/org/apache/ctakes/assertion/medfacts/cleartk/AssertionCleartkAnalysisEngine.java>:[131,67]
cannot find symbol
symbol  : class BaseToken
location: class org.apache.ctakes.assertion.medfacts.cleartk.AssertionCleartkAnalysisEngine
[ERROR] <https://builds.apache.org/job/ctakes-trunk-package/org.apache.ctakes$ctakes-assertion/ws/src/main/java/org/apache/ctakes/assertion/medfacts/cleartk/AssertionCleartkAnalysisEngine.java>:[134,59]
cannot find symbol
symbol  : class BaseToken
location: class org.apache.ctakes.assertion.medfacts.cleartk.AssertionCleartkAnalysisEngine
[ERROR] <https://builds.apache.org/job/ctakes-trunk-package/org.apache.ctakes$ctakes-assertion/ws/src/main/java/org/apache/ctakes/assertion/medfacts/cleartk/AssertionCleartkAnalysisEngine.java>:[135,4]
[deprecation] org.cleartk.classifier.feature.extractor.ContextExtractor in org.cleartk.classifier.feature.extractor
has been deprecated
[ERROR] <https://builds.apache.org/job/ctakes-trunk-package/org.apache.ctakes$ctakes-assertion/ws/src/main/java/org/apache/ctakes/assertion/medfacts/cleartk/AssertionCleartkAnalysisEngine.java>:[135,21]
cannot find symbol
symbol  : class BaseToken
location: class org.apache.ctakes.assertion.medfacts.cleartk.AssertionCleartkAnalysisEngine
[ERROR] <https://builds.apache.org/job/ctakes-trunk-package/org.apache.ctakes$ctakes-assertion/ws/src/main/java/org/apache/ctakes/assertion/medfacts/cleartk/AssertionCleartkAnalysisEngine.java>:[135,49]
[deprecation] org.cleartk.classifier.feature.extractor.ContextExtractor in org.cleartk.classifier.feature.extractor
has been deprecated
[ERROR] <https://builds.apache.org/job/ctakes-trunk-package/org.apache.ctakes$ctakes-assertion/ws/src/main/java/org/apache/ctakes/assertion/medfacts/cleartk/AssertionCleartkAnalysisEngine.java>:[135,66]
cannot find symbol
symbol  : class BaseToken
location: class org.apache.ctakes.assertion.medfacts.cleartk.AssertionCleartkAnalysisEngine
[ERROR] <https://builds.apache.org/job/ctakes-trunk-package/org.apache.ctakes$ctakes-assertion/ws/src/main/java/org/apache/ctakes/assertion/medfacts/cleartk/AssertionCleartkAnalysisEngine.java>:[136,8]
cannot find symbol
symbol  : class BaseToken
location: class org.apache.ctakes.assertion.medfacts.cleartk.AssertionCleartkAnalysisEngine
[ERROR] <https://builds.apache.org/job/ctakes-trunk-package/org.apache.ctakes$ctakes-assertion/ws/src/main/java/org/apache/ctakes/assertion/medfacts/cleartk/AssertionCleartkAnalysisEngine.java>:[138,12]
[deprecation] org.cleartk.classifier.feature.extractor.ContextExtractor in org.cleartk.classifier.feature.extractor
has been deprecated
[ERROR] <https://builds.apache.org/job/ctakes-trunk-package/org.apache.ctakes$ctakes-assertion/ws/src/main/java/org/apache/ctakes/assertion/medfacts/cleartk/AssertionCleartkAnalysisEngine.java>:[139,12]
[deprecation] org.cleartk.classifier.feature.extractor.ContextExtractor in org.cleartk.classifier.feature.extractor
has been deprecated
[ERROR] <https://builds.apache.org/job/ctakes-trunk-package/org.apache.ctakes$ctakes-assertion/ws/src/main/java/org/apache/ctakes/assertion/medfacts/cleartk/AssertionCleartkAnalysisEngine.java>:[140,12]
[deprecation] org.cleartk.classifier.feature.extractor.ContextExtractor in org.cleartk.classifier.feature.extractor
has been deprecated
[ERROR] <https://builds.apache.org/job/ctakes-trunk-package/org.apache.ctakes$ctakes-assertion/ws/src/main/java/org/apache/ctakes/assertion/medfacts/cleartk/AssertionCleartkAnalysisEngine.java>:[141,12]
[deprecation] org.cleartk.classifier.feature.extractor.ContextExtractor in org.cleartk.classifier.feature.extractor
has been deprecated
[ERROR] <https://builds.apache.org/job/ctakes-trunk-package/org.apache.ctakes$ctakes-assertion/ws/src/main/java/org/apache/ctakes/assertion/medfacts/cleartk/AssertionCleartkAnalysisEngine.java>:[142,12]
[deprecation] org.cleartk.classifier.feature.extractor.ContextExtractor in org.cleartk.classifier.feature.extractor
has been deprecated
[ERROR] <https://builds.apache.org/job/ctakes-trunk-package/org.apache.ctakes$ctakes-assertion/ws/src/main/java/org/apache/ctakes/assertion/medfacts/cleartk/AssertionCleartkAnalysisEngine.java>:[160,4]
cannot find symbol
symbol  : class DocumentID
location: class org.apache.ctakes.assertion.medfacts.cleartk.AssertionCleartkAnalysisEngine
[ERROR] <https://builds.apache.org/job/ctakes-trunk-package/org.apache.ctakes$ctakes-assertion/ws/src/main/java/org/apache/ctakes/assertion/medfacts/cleartk/AssertionCleartkAnalysisEngine.java>:[160,56]
cannot find symbol
symbol  : class DocumentID
location: class org.apache.ctakes.assertion.medfacts.cleartk.AssertionCleartkAnalysisEngine
[ERROR] <https://builds.apache.org/job/ctakes-trunk-package/org.apache.ctakes$ctakes-assertion/ws/src/main/java/org/apache/ctakes/assertion/medfacts/cleartk/AssertionCleartkAnalysisEngine.java>:[192,8]
cannot find symbol
symbol  : class IdentifiedAnnotation
location: class org.apache.ctakes.assertion.medfacts.cleartk.AssertionCleartkAnalysisEngine
[ERROR] <https://builds.apache.org/job/ctakes-trunk-package/org.apache.ctakes$ctakes-assertion/ws/src/main/java/org/apache/ctakes/assertion/medfacts/cleartk/AssertionCleartkAnalysisEngine.java>:[192,41]
cannot find symbol
symbol  : class Sentence
location: class org.apache.ctakes.assertion.medfacts.cleartk.AssertionCleartkAnalysisEngine
[ERROR] <https://builds.apache.org/job/ctakes-trunk-package/org.apache.ctakes$ctakes-assertion/ws/src/main/java/org/apache/ctakes/assertion/medfacts/cleartk/AssertionCleartkAnalysisEngine.java>:[192,123]
cannot find symbol
symbol  : class IdentifiedAnnotation
location: class org.apache.ctakes.assertion.medfacts.cleartk.AssertionCleartkAnalysisEngine
[ERROR] <https://builds.apache.org/job/ctakes-trunk-package/org.apache.ctakes$ctakes-assertion/ws/src/main/java/org/apache/ctakes/assertion/medfacts/cleartk/AssertionCleartkAnalysisEngine.java>:[192,151]
cannot find symbol
symbol  : class Sentence
location: class org.apache.ctakes.assertion.medfacts.cleartk.AssertionCleartkAnalysisEngine
[ERROR] <https://builds.apache.org/job/ctakes-trunk-package/org.apache.ctakes$ctakes-assertion/ws/src/main/java/org/apache/ctakes/assertion/medfacts/cleartk/AssertionCleartkAnalysisEngine.java>:[193,8]
cannot find symbol
symbol  : class Sentence
location: class org.apache.ctakes.assertion.medfacts.cleartk.AssertionCleartkAnalysisEngine
[ERROR] <https://builds.apache.org/job/ctakes-trunk-package/org.apache.ctakes$ctakes-assertion/ws/src/main/java/org/apache/ctakes/assertion/medfacts/cleartk/AssertionCleartkAnalysisEngine.java>:[193,29]
cannot find symbol
symbol  : class BaseToken
location: class org.apache.ctakes.assertion.medfacts.cleartk.AssertionCleartkAnalysisEngine
[ERROR] <https://builds.apache.org/job/ctakes-trunk-package/org.apache.ctakes$ctakes-assertion/ws/src/main/java/org/apache/ctakes/assertion/medfacts/cleartk/AssertionCleartkAnalysisEngine.java>:[193,118]
cannot find symbol
symbol  : class Sentence
location: class org.apache.ctakes.assertion.medfacts.cleartk.AssertionCleartkAnalysisEngine
[ERROR] <https://builds.apache.org/job/ctakes-trunk-package/org.apache.ctakes$ctakes-assertion/ws/src/main/java/org/apache/ctakes/assertion/medfacts/cleartk/AssertionCleartkAnalysisEngine.java>:[193,134]
cannot find symbol
symbol  : class BaseToken
location: class org.apache.ctakes.assertion.medfacts.cleartk.AssertionCleartkAnalysisEngine
[ERROR] <https://builds.apache.org/job/ctakes-trunk-package/org.apache.ctakes$ctakes-assertion/ws/src/main/java/org/apache/ctakes/assertion/medfacts/cleartk/AssertionCleartkAnalysisEngine.java>:[197,15]
cannot find symbol
symbol  : class IdentifiedAnnotation
location: class org.apache.ctakes.assertion.medfacts.cleartk.AssertionCleartkAnalysisEngine
[ERROR] <https://builds.apache.org/job/ctakes-trunk-package/org.apache.ctakes$ctakes-assertion/ws/src/main/java/org/apache/ctakes/assertion/medfacts/cleartk/AssertionCleartkAnalysisEngine.java>:[197,90]
cannot find symbol
symbol  : class IdentifiedAnnotation
location: class org.apache.ctakes.assertion.medfacts.cleartk.AssertionCleartkAnalysisEngine
[ERROR] <https://builds.apache.org/job/ctakes-trunk-package/org.apache.ctakes$ctakes-assertion/ws/src/main/java/org/apache/ctakes/assertion/medfacts/cleartk/AssertionCleartkAnalysisEngine.java>:[198,9]
cannot find symbol
symbol  : class IdentifiedAnnotation
location: class org.apache.ctakes.assertion.medfacts.cleartk.AssertionCleartkAnalysisEngine
[ERROR] <https://builds.apache.org/job/ctakes-trunk-package/org.apache.ctakes$ctakes-assertion/ws/src/main/java/org/apache/ctakes/assertion/medfacts/cleartk/AssertionCleartkAnalysisEngine.java>:[200,37]
cannot find symbol
symbol  : class EntityMention
location: class org.apache.ctakes.assertion.medfacts.cleartk.AssertionCleartkAnalysisEngine
[ERROR] <https://builds.apache.org/job/ctakes-trunk-package/org.apache.ctakes$ctakes-assertion/ws/src/main/java/org/apache/ctakes/assertion/medfacts/cleartk/AssertionCleartkAnalysisEngine.java>:[200,79]
cannot find symbol
symbol  : class EventMention
location: class org.apache.ctakes.assertion.medfacts.cleartk.AssertionCleartkAnalysisEngine
[ERROR] <https://builds.apache.org/job/ctakes-trunk-package/org.apache.ctakes$ctakes-assertion/ws/src/main/java/org/apache/ctakes/assertion/medfacts/cleartk/AssertionCleartkAnalysisEngine.java>:[218,17]
cannot find symbol
symbol  : class Sentence
location: class org.apache.ctakes.assertion.medfacts.cleartk.AssertionCleartkAnalysisEngine
[ERROR] <https://builds.apache.org/job/ctakes-trunk-package/org.apache.ctakes$ctakes-assertion/ws/src/main/java/org/apache/ctakes/assertion/medfacts/cleartk/AssertionCleartkAnalysisEngine.java>:[219,6]
cannot find symbol
symbol  : class Sentence
location: class org.apache.ctakes.assertion.medfacts.cleartk.AssertionCleartkAnalysisEngine
[ERROR] <https://builds.apache.org/job/ctakes-trunk-package/org.apache.ctakes$ctakes-assertion/ws/src/main/java/org/apache/ctakes/assertion/medfacts/cleartk/AssertionCleartkAnalysisEngine.java>:[240,13]
[deprecation] org.cleartk.classifier.feature.extractor.ContextExtractor in org.cleartk.classifier.feature.extractor
has been deprecated
[ERROR] <https://builds.apache.org/job/ctakes-trunk-package/org.apache.ctakes$ctakes-assertion/ws/src/main/java/org/apache/ctakes/assertion/medfacts/cleartk/AssertionCleartkAnalysisEngine.java>:[240,30]
cannot find symbol
symbol  : class IdentifiedAnnotation
location: class org.apache.ctakes.assertion.medfacts.cleartk.AssertionCleartkAnalysisEngine
[ERROR] <https://builds.apache.org/job/ctakes-trunk-package/org.apache.ctakes$ctakes-assertion/ws/src/main/java/org/apache/ctakes/assertion/medfacts/cleartk/AssertionCleartkAnalysisEngine.java>:[249,11]
[deprecation] org.cleartk.classifier.feature.extractor.ContextExtractor in org.cleartk.classifier.feature.extractor
has been deprecated
[ERROR] <https://builds.apache.org/job/ctakes-trunk-package/org.apache.ctakes$ctakes-assertion/ws/src/main/java/org/apache/ctakes/assertion/medfacts/cleartk/AssertionCleartkAnalysisEngine.java>:[249,28]
cannot find symbol
symbol  : class BaseToken
location: class org.apache.ctakes.assertion.medfacts.cleartk.AssertionCleartkAnalysisEngine
[ERROR] <https://builds.apache.org/job/ctakes-trunk-package/org.apache.ctakes$ctakes-assertion/ws/src/main/java/org/apache/ctakes/assertion/eval/AssertionEvalBasedOnModifier.java>:[131,72]
[deprecation] org.cleartk.classifier.opennlp.DefaultMaxentDataWriterFactory in org.cleartk.classifier.opennlp
has been deprecated
[ERROR] <https://builds.apache.org/job/ctakes-trunk-package/org.apache.ctakes$ctakes-assertion/ws/src/main/java/org/apache/ctakes/assertion/eval/AssertionEvalBasedOnModifier.java>:[173,11]
cannot find symbol
symbol  : class AnnotationStatistics
location: class org.apache.ctakes.assertion.eval.AssertionEvalBasedOnModifier
[ERROR] <https://builds.apache.org/job/ctakes-trunk-package/org.apache.ctakes$ctakes-assertion/ws/src/main/java/org/apache/ctakes/assertion/eval/AssertionEvalBasedOnModifier.java>:[173,55]
cannot find symbol
symbol  : method crossValidation(java.util.List<java.io.File>,int)
location: class org.apache.ctakes.assertion.eval.AssertionEvalBasedOnModifier
[ERROR] <https://builds.apache.org/job/ctakes-trunk-package/org.apache.ctakes$ctakes-assertion/ws/src/main/java/org/apache/ctakes/assertion/eval/AssertionEvalBasedOnModifier.java>:[175,6]
cannot find symbol
symbol  : class AnnotationStatistics
location: class org.apache.ctakes.assertion.eval.AssertionEvalBasedOnModifier
[ERROR] <https://builds.apache.org/job/ctakes-trunk-package/org.apache.ctakes$ctakes-assertion/ws/src/main/java/org/apache/ctakes/assertion/eval/AssertionEvalBasedOnModifier.java>:[175,46]
cannot find symbol
symbol  : class AnnotationStatistics
location: class org.apache.ctakes.assertion.eval.AssertionEvalBasedOnModifier
[ERROR] <https://builds.apache.org/job/ctakes-trunk-package/org.apache.ctakes$ctakes-assertion/ws/src/main/java/org/apache/ctakes/assertion/eval/AssertionEvalBasedOnModifier.java>:[176,11]
cannot find symbol
symbol  : class AnnotationStatistics
location: class org.apache.ctakes.assertion.eval.AssertionEvalBasedOnModifier
[ERROR] <https://builds.apache.org/job/ctakes-trunk-package/org.apache.ctakes$ctakes-assertion/ws/src/main/java/org/apache/ctakes/assertion/eval/AssertionEvalBasedOnModifier.java>:[194,6]
cannot find symbol
mojoFailed org.apache.maven.plugins:maven-compiler-plugin:2.4(default-compile)symbol  : class
AnnotationStatistics
location: class org.apache.ctakes.assertion.eval.AssertionEvalBasedOnModifier
[ERROR] <https://builds.apache.org/job/ctakes-trunk-package/org.apache.ctakes$ctakes-assertion/ws/src/main/java/org/apache/ctakes/assertion/eval/AssertionEvalBasedOnModifier.java>:[224,8]
cannot find symbol
symbol  : class XMIReader
location: class org.apache.ctakes.assertion.eval.AssertionEvalBasedOnModifier
[ERROR] <https://builds.apache.org/job/ctakes-trunk-package/org.apache.ctakes$ctakes-assertion/ws/src/main/java/org/apache/ctakes/assertion/eval/AssertionEvalBasedOnModifier.java>:[226,8]
cannot find symbol
symbol  : variable XMIReader
location: class org.apache.ctakes.assertion.eval.AssertionEvalBasedOnModifier
[ERROR] <https://builds.apache.org/job/ctakes-trunk-package/org.apache.ctakes$ctakes-assertion/ws/src/main/java/org/apache/ctakes/assertion/eval/AssertionEvalBasedOnModifier.java>:[216,2]
method does not override or implement a method from a supertype
[ERROR] <https://builds.apache.org/job/ctakes-trunk-package/org.apache.ctakes$ctakes-assertion/ws/src/main/java/org/apache/ctakes/assertion/eval/AssertionEvalBasedOnModifier.java>:[230,2]
method does not override or implement a method from a supertype
[ERROR] <https://builds.apache.org/job/ctakes-trunk-package/org.apache.ctakes$ctakes-assertion/ws/src/main/java/org/apache/ctakes/assertion/eval/AssertionEvalBasedOnModifier.java>:[316,4]
cannot find symbol
symbol  : class AnnotationStatistics
location: class org.apache.ctakes.assertion.eval.AssertionEvalBasedOnModifier
[ERROR] <https://builds.apache.org/job/ctakes-trunk-package/org.apache.ctakes$ctakes-assertion/ws/src/main/java/org/apache/ctakes/assertion/eval/AssertionEvalBasedOnModifier.java>:[316,37]
cannot find symbol
symbol  : class AnnotationStatistics
location: class org.apache.ctakes.assertion.eval.AssertionEvalBasedOnModifier
[ERROR] <https://builds.apache.org/job/ctakes-trunk-package/org.apache.ctakes$ctakes-assertion/ws/src/main/java/org/apache/ctakes/assertion/eval/AssertionEvalBasedOnModifier.java>:[333,4]
cannot find symbol
symbol  : variable AnnotationStatistics
location: class org.apache.ctakes.assertion.eval.AssertionEvalBasedOnModifier
[ERROR] <https://builds.apache.org/job/ctakes-trunk-package/org.apache.ctakes$ctakes-assertion/ws/src/main/java/org/apache/ctakes/assertion/eval/AssertionEvalBasedOnModifier.java>:[334,4]
cannot find symbol
symbol  : variable AnnotationStatistics
location: class org.apache.ctakes.assertion.eval.AssertionEvalBasedOnModifier
[ERROR] <https://builds.apache.org/job/ctakes-trunk-package/org.apache.ctakes$ctakes-assertion/ws/src/main/java/org/apache/ctakes/assertion/eval/AssertionEvalBasedOnModifier.java>:[287,2]
method does not override or implement a method from a supertype
[ERROR] <https://builds.apache.org/job/ctakes-trunk-package/org.apache.ctakes$ctakes-assertion/ws/src/main/java/org/apache/ctakes/assertion/medfacts/cleartk/TrainAssertionModel.java>:[101,8]
cannot find symbol
symbol  : variable AssertionComponents
location: class org.apache.ctakes.assertion.medfacts.cleartk.TrainAssertionModel
[ERROR] <https://builds.apache.org/job/ctakes-trunk-package/org.apache.ctakes$ctakes-assertion/ws/src/main/java/org/apache/ctakes/assertion/medfacts/cleartk/TrainAssertionModel.java>:[221,10]
cannot find symbol
symbol  : variable AssertionComponents
location: class org.apache.ctakes.assertion.medfacts.cleartk.TrainAssertionModel
[ERROR] <https://builds.apache.org/job/ctakes-trunk-package/org.apache.ctakes$ctakes-assertion/ws/src/main/java/org/apache/ctakes/assertion/medfacts/cleartk/TrainAssertionModel.java>:[274,72]
[deprecation] org.cleartk.classifier.opennlp.DefaultMaxentDataWriterFactory in org.cleartk.classifier.opennlp
has been deprecated
[ERROR] <https://builds.apache.org/job/ctakes-trunk-package/org.apache.ctakes$ctakes-assertion/ws/src/main/java/org/apache/ctakes/assertion/medfacts/cleartk/TrainAssertionModel.java>:[278,12]
cannot find symbol
symbol  : variable AssertionComponents
location: class org.apache.ctakes.assertion.medfacts.cleartk.TrainAssertionModel
[ERROR] <https://builds.apache.org/job/ctakes-trunk-package/org.apache.ctakes$ctakes-assertion/ws/src/main/java/org/apache/ctakes/assertion/medfacts/cleartk/TrainAssertionModel.java>:[337,8]
cannot find symbol
symbol  : variable AssertionComponents
location: class org.apache.ctakes.assertion.medfacts.cleartk.TrainAssertionModel
[ERROR] <https://builds.apache.org/job/ctakes-trunk-package/org.apache.ctakes$ctakes-assertion/ws/src/main/java/org/apache/ctakes/assertion/medfacts/cleartk/TrainAssertionModel.java>:[369,12]
cannot find symbol
symbol  : variable AssertionComponents
location: class org.apache.ctakes.assertion.medfacts.cleartk.TrainAssertionModel
[INFO] 123 errors 
[INFO] -------------------------------------------------------------

projectFailed org.apache.ctakes:ctakes-assertion:3.1.0-incubating-SNAPSHOT

Mime
View raw message