incubator-ctakes-dev mailing list archives

Site index · List index
Message view « Date » · « Thread »
Top « Date » · « Thread »
From "Chen, Pei" <Pei.C...@childrens.harvard.edu>
Subject RE: Build failed in Jenkins: cTAKES-trunk-compiletest #38
Date Wed, 31 Oct 2012 21:23:42 GMT
Hi Matt,
I'm taking a look at it now... not sure if it's just related to the SNAPSHOT suffix or not.

--Pei

> -----Original Message-----
> From: Coarr, Matt [mailto:mcoarr@mitre.org]
> Sent: Wednesday, October 31, 2012 4:19 PM
> To: ctakes-dev@incubator.apache.org
> Subject: FW: Build failed in Jenkins: cTAKES-trunk-compiletest #38
> 
> Why are my commits causing jenkins to fail???
> 
> I updated the license comments in a few files (in ctakes-assertion).  And a
> pristine working copy compile ("mvn compile") from the command-line for
> me.
> 
> The error is the same one that caused a problem Monday -- cannot resolve
> org.apache.ctakes:ctakes-type-system:jar:3.1.0-incubating.
> 
> Is something wrong with the jenkins configuration?  It's only trying to build
> assertion, clinical document pipeline, relation extraction, and distribution?
> 
> My understanding is this would be fine if we were running "mvn install"
> instead of "mvn compile", but "mvn compile" won't be able to grab the
> dependencies for components that are not being compile in the current build
> (e.g. There is no jar for ctakes-type-system in the ~/.m2/repository repo).
> 
> Any ideas?
> 
> Matt
> 
> 
> Here's the error:
> 
> message : Failed to execute goal on project ctakes-assertion: Could not
> resolve dependencies for project
> org.apache.ctakes:ctakes-assertion:jar:3.1.0-incubating: The following
> artifacts could not be resolved:
> org.apache.ctakes:ctakes-type-system:jar:3.1.0-incubating,
> org.apache.ctakes:ctakes-core:jar:3.1.0-incubating,
> org.apache.ctakes:ctakes-utils:jar:3.1.0-incubating,
> org.apache.ctakes:ctakes-pos-tagger:jar:3.1.0-incubating,
> org.apache.ctakes:ctakes-dependency-parser:jar:3.1.0-incubating,
> org.apache.ctakes:ctakes-lvg:jar:3.1.0-incubating: Could not find artifact
> org.apache.ctakes:ctakes-type-system:jar:3.1.0-incubating in central
> (http://repo1.maven.org/maven2)
> cause : Could not resolve dependencies for project
> org.apache.ctakes:ctakes-assertion:jar:3.1.0-incubating: The following
> artifacts could not be resolved:
> org.apache.ctakes:ctakes-type-system:jar:3.1.0-incubating,
> org.apache.ctakes:ctakes-core:jar:3.1.0-incubating,
> org.apache.ctakes:ctakes-utils:jar:3.1.0-incubating,
> org.apache.ctakes:ctakes-pos-tagger:jar:3.1.0-incubating,
> org.apache.ctakes:ctakes-dependency-parser:jar:3.1.0-incubating,
> org.apache.ctakes:ctakes-lvg:jar:3.1.0-incubating: Could not find artifact
> org.apache.ctakes:ctakes-type-system:jar:3.1.0-incubating in central
> (http://repo1.maven.org/maven2)
> Stack trace :
> org.apache.maven.lifecycle.LifecycleExecutionException: Failed to execute
> goal on project ctakes-assertion: Could not resolve dependencies for project
> org.apache.ctakes:ctakes-assertion:jar:3.1.0-incubating: The following
> artifacts could not be resolved:
> org.apache.ctakes:ctakes-type-system:jar:3.1.0-incubating,
> org.apache.ctakes:ctakes-core:jar:3.1.0-incubating,
> org.apache.ctakes:ctakes-utils:jar:3.1.0-incubating,
> org.apache.ctakes:ctakes-pos-tagger:jar:3.1.0-incubating,
> org.apache.ctakes:ctakes-dependency-parser:jar:3.1.0-incubating,
> org.apache.ctakes:ctakes-lvg:jar:3.1.0-incubating: Could not find artifact
> org.apache.ctakes:ctakes-type-system:jar:3.1.0-incubating in central
> (http://repo1.maven.org/maven2)
> 	at
> org.apache.maven.lifecycle.internal.LifecycleDependencyResolver.getDepen
> den
> cies(LifecycleDependencyResolver.java:196)
> 	at
> org.apache.maven.lifecycle.internal.LifecycleDependencyResolver.resolvePr
> oj
> ectDependencies(LifecycleDependencyResolver.java:108)
> 	at
> org.apache.maven.lifecycle.internal.MojoExecutor.ensureDependenciesAre
> Resol
> ved(MojoExecutor.java:258)
> 	at
> org.apache.maven.lifecycle.internal.MojoExecutor.execute(MojoExecutor.ja
> va:
> 201)
> 	at
> org.apache.maven.lifecycle.internal.MojoExecutor.execute(MojoExecutor.ja
> va:
> 153)
> 	at
> org.apache.maven.lifecycle.internal.MojoExecutor.execute(MojoExecutor.ja
> va:
> 145)
> 	at
> org.apache.maven.lifecycle.internal.LifecycleModuleBuilder.buildProject(Lif
> ecycleModuleBuilder.java:84)
> 	at
> org.apache.maven.lifecycle.internal.LifecycleModuleBuilder.buildProject(Lif
> ecycleModuleBuilder.java:59)
> 	at
> org.apache.maven.lifecycle.internal.LifecycleStarter.singleThreadedBuild(Li
> fecycleStarter.java:183)
> 	at
> org.apache.maven.lifecycle.internal.LifecycleStarter.execute(LifecycleStart
> er.java:161)
> 	at
> org.apache.maven.DefaultMaven.doExecute(DefaultMaven.java:319)
> 	at
> org.apache.maven.DefaultMaven.execute(DefaultMaven.java:156)
> 	at
> org.jvnet.hudson.maven3.launcher.Maven3Launcher.main(Maven3Launche
> r.java:79
> )
> 	at sun.reflect.NativeMethodAccessorImpl.invoke0(Native Method)
> 	at
> sun.reflect.NativeMethodAccessorImpl.invoke(NativeMethodAccessorImpl.j
> ava:3
> 9)
> 	at
> sun.reflect.DelegatingMethodAccessorImpl.invoke(DelegatingMethodAcces
> sorImp
> l.java:25)
> 	at java.lang.reflect.Method.invoke(Method.java:597)
> 	at
> org.codehaus.plexus.classworlds.launcher.Launcher.launchStandard(Launch
> er.j
> ava:329)
> 	at
> org.codehaus.plexus.classworlds.launcher.Launcher.launch(Launcher.java:23
> 9)
> 	at
> org.jvnet.hudson.maven3.agent.Maven3Main.launch(Maven3Main.java:158
> )
> 	at hudson.maven.Maven3Builder.call(Maven3Builder.java:98)
> 	at hudson.maven.Maven3Builder.call(Maven3Builder.java:64)
> 	at hudson.remoting.UserRequest.perform(UserRequest.java:118)
> 	at hudson.remoting.UserRequest.perform(UserRequest.java:48)
> 	at hudson.remoting.Request$2.run(Request.java:326)
> 	at
> hudson.remoting.InterceptingExecutorService$1.call(InterceptingExecutorSe
> rv
> ice.java:72)
> 	at
> java.util.concurrent.FutureTask$Sync.innerRun(FutureTask.java:303)
> 	at java.util.concurrent.FutureTask.run(FutureTask.java:138)
> 	at
> java.util.concurrent.ThreadPoolExecutor$Worker.runTask(ThreadPoolExecut
> or.j
> ava:886)
> 	at
> java.util.concurrent.ThreadPoolExecutor$Worker.run(ThreadPoolExecutor.ja
> va:
> 908)
> 	at java.lang.Thread.run(Thread.java:662)
> Caused by: org.apache.maven.project.DependencyResolutionException:
> Could not resolve dependencies for project
> org.apache.ctakes:ctakes-assertion:jar:3.1.0-incubating: The following
> artifacts could not be resolved:
> org.apache.ctakes:ctakes-type-system:jar:3.1.0-incubating,
> org.apache.ctakes:ctakes-core:jar:3.1.0-incubating,
> org.apache.ctakes:ctakes-utils:jar:3.1.0-incubating,
> org.apache.ctakes:ctakes-pos-tagger:jar:3.1.0-incubating,
> org.apache.ctakes:ctakes-dependency-parser:jar:3.1.0-incubating,
> org.apache.ctakes:ctakes-lvg:jar:3.1.0-incubating: Could not find artifact
> org.apache.ctakes:ctakes-type-system:jar:3.1.0-incubating in central
> (http://repo1.maven.org/maven2)
> 	at
> org.apache.maven.project.DefaultProjectDependenciesResolver.resolve(De
> fault
> ProjectDependenciesResolver.java:170)
> 	at
> org.apache.maven.lifecycle.internal.LifecycleDependencyResolver.getDepen
> den
> cies(LifecycleDependencyResolver.java:171)
> 	... 30 more
> Caused by:
> org.sonatype.aether.resolution.DependencyResolutionException:
> The following artifacts could not be resolved:
> org.apache.ctakes:ctakes-type-system:jar:3.1.0-incubating,
> org.apache.ctakes:ctakes-core:jar:3.1.0-incubating,
> org.apache.ctakes:ctakes-utils:jar:3.1.0-incubating,
> org.apache.ctakes:ctakes-pos-tagger:jar:3.1.0-incubating,
> org.apache.ctakes:ctakes-dependency-parser:jar:3.1.0-incubating,
> org.apache.ctakes:ctakes-lvg:jar:3.1.0-incubating: Could not find artifact
> org.apache.ctakes:ctakes-type-system:jar:3.1.0-incubating in central
> (http://repo1.maven.org/maven2)
> 	at
> org.sonatype.aether.impl.internal.DefaultRepositorySystem.resolveDepend
> enci
> es(DefaultRepositorySystem.java:412)
> 	at
> org.apache.maven.project.DefaultProjectDependenciesResolver.resolve(De
> fault
> ProjectDependenciesResolver.java:164)
> 	... 31 more
> Caused by: org.sonatype.aether.resolution.ArtifactResolutionException: The
> following artifacts could not be resolved:
> org.apache.ctakes:ctakes-type-system:jar:3.1.0-incubating,
> org.apache.ctakes:ctakes-core:jar:3.1.0-incubating,
> org.apache.ctakes:ctakes-utils:jar:3.1.0-incubating,
> org.apache.ctakes:ctakes-pos-tagger:jar:3.1.0-incubating,
> org.apache.ctakes:ctakes-dependency-parser:jar:3.1.0-incubating,
> org.apache.ctakes:ctakes-lvg:jar:3.1.0-incubating: Could not find artifact
> org.apache.ctakes:ctakes-type-system:jar:3.1.0-incubating in central
> (http://repo1.maven.org/maven2)
> 	at
> org.sonatype.aether.impl.internal.DefaultArtifactResolver.resolve(DefaultAr
> tifactResolver.java:541)
> 	at
> org.sonatype.aether.impl.internal.DefaultArtifactResolver.resolveArtifacts(
> DefaultArtifactResolver.java:220)
> 	at
> org.sonatype.aether.impl.internal.DefaultRepositorySystem.resolveDepend
> enci
> es(DefaultRepositorySystem.java:395)
> 	... 32 more
> Caused by: org.sonatype.aether.transfer.ArtifactNotFoundException: Could
> not find artifact org.apache.ctakes:ctakes-type-system:jar:3.1.0-incubating in
> central
> (http://repo1.maven.org/maven2)
> 	at
> org.sonatype.aether.connector.wagon.WagonRepositoryConnector$4.wrap(
> WagonRe
> positoryConnector.java:945)
> 	at
> org.sonatype.aether.connector.wagon.WagonRepositoryConnector$4.wrap(
> WagonRe
> positoryConnector.java:940)
> 	at
> org.sonatype.aether.connector.wagon.WagonRepositoryConnector$GetTas
> k.flush(
> WagonRepositoryConnector.java:695)
> 	at
> org.sonatype.aether.connector.wagon.WagonRepositoryConnector$GetTas
> k.flush(
> WagonRepositoryConnector.java:689)
> 	at
> org.sonatype.aether.connector.wagon.WagonRepositoryConnector.get(Wag
> onRepos
> itoryConnector.java:445)
> 	at
> org.sonatype.aether.impl.internal.DefaultArtifactResolver.resolve(DefaultAr
> tifactResolver.java:460)
> 	... 34 more
> Sending e-mails to: ctakes-notifications@incubator.apache.org
> mattcoarr@gmail.com
> channel stopped
> Sending e-mails to: ctakes-notifications@incubator.apache.org
> mattcoarr@gmail.com
> Finished: FAILURE


Mime
View raw message