incubator-crunch-dev mailing list archives

Site index · List index
Message view « Date » · « Thread »
Top « Date » · « Thread »
From Apache Jenkins Server <jenk...@builds.apache.org>
Subject Build failed in Jenkins: Crunch-master-integration » Apache Crunch Archetype #63
Date Mon, 01 Oct 2012 00:27:22 GMT
See <https://builds.apache.org/job/Crunch-master-integration/org.apache.crunch$crunch-archetype/63/changes>

Changes:

[matt] CRUNCH-83: Create a Maven Archetype.

------------------------------------------
projectStarted org.apache.crunch:crunch-archetype:0.4.0-incubating-SNAPSHOT
[INFO]                                                                         
[INFO] ------------------------------------------------------------------------
[INFO] Building Apache Crunch Archetype 0.4.0-incubating-SNAPSHOT
[INFO] ------------------------------------------------------------------------
mojoStarted org.apache.maven.plugins:maven-clean-plugin:2.5(default-clean)
[INFO] 
[INFO] --- maven-clean-plugin:2.5:clean (default-clean) @ crunch-archetype ---
mojoSucceeded org.apache.maven.plugins:maven-clean-plugin:2.5(default-clean)
mojoStarted org.apache.maven.plugins:maven-remote-resources-plugin:1.3(default)
[INFO] 
[INFO] --- maven-remote-resources-plugin:1.3:process (default) @ crunch-archetype ---
mojoSucceeded org.apache.maven.plugins:maven-remote-resources-plugin:1.3(default)
mojoStarted org.apache.maven.plugins:maven-resources-plugin:2.5(default-resources)[debug]
execute contextualize
[INFO] Using 'UTF-8' encoding to copy filtered resources.
[INFO] Copying 1 resource

[INFO] 
[INFO] --- maven-resources-plugin:2.5:resources (default-resources) @ crunch-archetype ---
[INFO] Copying 7 resources
[INFO] Copying 3 resources
mojoSucceeded org.apache.maven.plugins:maven-resources-plugin:2.5(default-resources)
mojoStarted org.apache.maven.plugins:maven-resources-plugin:2.5(default-testResources)[debug]
execute contextualize
[INFO] Using 'UTF-8' encoding to copy filtered resources.
[INFO] Copying 2 resources
[INFO] Copying 3 resources

[INFO] 
[INFO] --- maven-resources-plugin:2.5:testResources (default-testResources) @ crunch-archetype
---
mojoSucceeded org.apache.maven.plugins:maven-resources-plugin:2.5(default-testResources)
mojoStarted org.apache.rat:apache-rat-plugin:0.8(rat-check)
[INFO] 
[INFO] --- apache-rat-plugin:0.8:check (rat-check) @ crunch-archetype ---
[INFO] Exclude: DEPENDENCIES
[INFO] Exclude: .git/**
[INFO] Exclude: .gitignore
[INFO] Exclude: .repository/
[INFO] Exclude: **/resources/*.txt
[INFO] Exclude: **/goal.txt
[INFO] Exclude: **/target/generated-test-sources/**
[INFO] Exclude: **/scripts/scrunch
mojoSucceeded org.apache.rat:apache-rat-plugin:0.8(rat-check)
mojoStarted org.apache.maven.plugins:maven-archetype-plugin:2.2(default-jar)
[INFO] 
[INFO] --- maven-archetype-plugin:2.2:jar (default-jar) @ crunch-archetype ---
[INFO] Building archetype jar: <https://builds.apache.org/job/Crunch-master-integration/org.apache.crunch$crunch-archetype/ws/target/crunch-archetype-0.4.0-incubating-SNAPSHOT>
mojoSucceeded org.apache.maven.plugins:maven-archetype-plugin:2.2(default-jar)
mojoStarted org.apache.maven.plugins:maven-archetype-plugin:2.2(default-integration-test)[INFO]
Processing Archetype IT project: basic
[INFO] ----------------------------------------------------------------------------
[INFO] Using following parameters for creating project from Archetype: crunch-archetype:0.4.0-incubating-SNAPSHOT
[INFO] ----------------------------------------------------------------------------
[INFO] Parameter: groupId, Value: archetype.it
[INFO] Parameter: artifactId, Value: basic
[INFO] Parameter: version, Value: 0.1-SNAPSHOT
[INFO] Parameter: package, Value: it.pkg
[INFO] Parameter: packageInPathFormat, Value: it/pkg
[INFO] Parameter: version, Value: 0.1-SNAPSHOT
[INFO] Parameter: package, Value: it.pkg
[INFO] Parameter: groupId, Value: archetype.it
[INFO] Parameter: artifactId, Value: basic

[INFO] 
[INFO] project created from Archetype in dir: <https://builds.apache.org/job/Crunch-master-integration/org.apache.crunch$crunch-archetype/ws/target/test-classes/projects/basic/project/basic>
[INFO] --- maven-archetype-plugin:2.2:integration-test (default-integration-test) @ crunch-archetype
---[INFO] Invoking post-archetype-generation goals: clean package


[INFO] [INFO] Error stacktraces are turned on.
[INFO] [INFO] Scanning for projects...
[INFO] [INFO]                                                                         
[INFO] [INFO] ------------------------------------------------------------------------
[INFO] [INFO] Building basic 0.1-SNAPSHOT
[INFO] [INFO] ------------------------------------------------------------------------
[INFO] [WARNING] The POM for org.apache.crunch:crunch:jar:0.4.0-incubating-SNAPSHOT is missing,
no dependency information available
[INFO] [INFO] ------------------------------------------------------------------------
[INFO] [INFO] BUILD FAILURE
[INFO] [INFO] ------------------------------------------------------------------------
[INFO] [INFO] Total time: 0.992s
[INFO] [INFO] Finished at: Mon Oct 01 00:26:48 UTC 2012
[INFO] [INFO] Final Memory: 3M/61M
[INFO] [INFO] ------------------------------------------------------------------------
[INFO] [ERROR] Failed to execute goal on project basic: Could not resolve dependencies for
project archetype.it:basic:jar:0.1-SNAPSHOT: Could not find artifact org.apache.crunch:crunch:jar:0.4.0-incubating-SNAPSHOT
-> [Help 1]
[INFO] org.apache.maven.lifecycle.LifecycleExecutionException: Failed to execute goal on project
basic: Could not resolve dependencies for project archetype.it:basic:jar:0.1-SNAPSHOT: Could
not find artifact org.apache.crunch:crunch:jar:0.4.0-incubating-SNAPSHOT
[INFO] 	at org.apache.maven.lifecycle.internal.LifecycleDependencyResolver.getDependencies(LifecycleDependencyResolver.java:196)
[INFO] 	at org.apache.maven.lifecycle.internal.LifecycleDependencyResolver.resolveProjectDependencies(LifecycleDependencyResolver.java:108)
[INFO] 	at org.apache.maven.lifecycle.internal.MojoExecutor.ensureDependenciesAreResolved(MojoExecutor.java:258)
[INFO] 	at org.apache.maven.lifecycle.internal.MojoExecutor.execute(MojoExecutor.java:201)
[INFO] 	at org.apache.maven.lifecycle.internal.MojoExecutor.execute(MojoExecutor.java:153)
[INFO] 	at org.apache.maven.lifecycle.internal.MojoExecutor.execute(MojoExecutor.java:145)
[INFO] 	at org.apache.maven.lifecycle.internal.LifecycleModuleBuilder.buildProject(LifecycleModuleBuilder.java:84)
[INFO] 	at org.apache.maven.lifecycle.internal.LifecycleModuleBuilder.buildProject(LifecycleModuleBuilder.java:59)
[INFO] 	at org.apache.maven.lifecycle.internal.LifecycleStarter.singleThreadedBuild(LifecycleStarter.java:183)
[INFO] 	at org.apache.maven.lifecycle.internal.LifecycleStarter.execute(LifecycleStarter.java:161)
[INFO] 	at org.apache.maven.DefaultMaven.doExecute(DefaultMaven.java:319)
[INFO] 	at org.apache.maven.DefaultMaven.execute(DefaultMaven.java:156)
[INFO] 	at org.apache.maven.cli.MavenCli.execute(MavenCli.java:537)
[INFO] 	at org.apache.maven.cli.MavenCli.doMain(MavenCli.java:196)
[INFO] 	at org.apache.maven.cli.MavenCli.main(MavenCli.java:141)
[INFO] 	at sun.reflect.NativeMethodAccessorImpl.invoke0(Native Method)
[INFO] 	at sun.reflect.NativeMethodAccessorImpl.invoke(NativeMethodAccessorImpl.java:39)
[INFO] 	at sun.reflect.DelegatingMethodAccessorImpl.invoke(DelegatingMethodAccessorImpl.java:25)
[INFO] 	at java.lang.reflect.Method.invoke(Method.java:597)
[INFO] 	at org.codehaus.plexus.classworlds.launcher.Launcher.launchEnhanced(Launcher.java:290)
[INFO] 	at org.codehaus.plexus.classworlds.launcher.Launcher.launch(Launcher.java:230)
[INFO] 	at org.codehaus.plexus.classworlds.launcher.Launcher.mainWithExitCode(Launcher.java:409)
[INFO] 	at org.codehaus.plexus.classworlds.launcher.Launcher.main(Launcher.java:352)
[INFO] Caused by: org.apache.maven.project.DependencyResolutionException: Could not resolve
dependencies for project archetype.it:basic:jar:0.1-SNAPSHOT: Could not find artifact org.apache.crunch:crunch:jar:0.4.0-incubating-SNAPSHOT
[INFO] 	at org.apache.maven.project.DefaultProjectDependenciesResolver.resolve(DefaultProjectDependenciesResolver.java:170)
[INFO] 	at org.apache.maven.lifecycle.internal.LifecycleDependencyResolver.getDependencies(LifecycleDependencyResolver.java:171)
[INFO] 	... 22 more
[INFO] Caused by: org.sonatype.aether.resolution.DependencyResolutionException: Could not
find artifact org.apache.crunch:crunch:jar:0.4.0-incubating-SNAPSHOT
[INFO] 	at org.sonatype.aether.impl.internal.DefaultRepositorySystem.resolveDependencies(DefaultRepositorySystem.java:412)
[INFO] 	at org.apache.maven.project.DefaultProjectDependenciesResolver.resolve(DefaultProjectDependenciesResolver.java:164)
[INFO] 	... 23 more
[INFO] Caused by: org.sonatype.aether.resolution.ArtifactResolutionException: Could not find
artifact org.apache.crunch:crunch:jar:0.4.0-incubating-SNAPSHOT
[INFO] 	at org.sonatype.aether.impl.internal.DefaultArtifactResolver.resolve(DefaultArtifactResolver.java:541)
[INFO] 	at org.sonatype.aether.impl.internal.DefaultArtifactResolver.resolveArtifacts(DefaultArtifactResolver.java:220)
[INFO] 	at org.sonatype.aether.impl.internal.DefaultRepositorySystem.resolveDependencies(DefaultRepositorySystem.java:395)
[INFO] 	... 24 more
[INFO] Caused by: org.sonatype.aether.transfer.ArtifactNotFoundException: Could not find artifact
org.apache.crunch:crunch:jar:0.4.0-incubating-SNAPSHOT
[INFO] 	at org.sonatype.aether.impl.internal.DefaultArtifactResolver.resolve(DefaultArtifactResolver.java:531)
[INFO] 	... 26 more
[INFO] [ERROR] 
[INFO] [ERROR] Re-run Maven using the -X switch to enable full debug logging.
[INFO] [ERROR] 
[INFO] [ERROR] For more information about the errors and possible solutions, please read the
following articles:
[INFO] [ERROR] [Help 1] http://cwiki.apache.org/confluence/display/MAVEN/DependencyResolutionException
[INFO] Post-archetype-generation invoker exit code: 1
mojoFailed org.apache.maven.plugins:maven-archetype-plugin:2.2(default-integration-test)
projectFailed org.apache.crunch:crunch-archetype:0.4.0-incubating-SNAPSHOT

Mime
View raw message