incubator-crunch-dev mailing list archives

Site index · List index
Message view « Date » · « Thread »
Top « Date » · « Thread »
From Apache Jenkins Server <jenk...@builds.apache.org>
Subject Build failed in Jenkins: Crunch-master-integration #63
Date Mon, 01 Oct 2012 00:27:23 GMT
See <https://builds.apache.org/job/Crunch-master-integration/63/changes>

Changes:

[matt] CRUNCH-80: Remove old markdown documentation.

[matt] CRUNCH-83: Create a Maven Archetype.

------------------------------------------
[...truncated 1654 lines...]
mojoSucceeded org.apache.maven.plugins:maven-compiler-plugin:2.5.1(default-testCompile)
mojoStarted org.apache.maven.plugins:maven-surefire-plugin:2.12(default-test)[INFO] Surefire
report directory: <https://builds.apache.org/job/Crunch-master-integration/ws/crunch-examples/target/surefire-reports>

-------------------------------------------------------
 T E S T S
-------------------------------------------------------

[INFO] 
[INFO] --- maven-surefire-plugin:2.12:test (default-test) @ crunch-examples ---

Results :

Tests run: 0, Failures: 0, Errors: 0, Skipped: 0

mojoSucceeded org.apache.maven.plugins:maven-surefire-plugin:2.12(default-test)
[JENKINS] Recording test results[INFO] Exclude: DEPENDENCIES
[INFO] Exclude: .git/**
[INFO] Exclude: .gitignore
[INFO] Exclude: .repository/
[INFO] Exclude: **/resources/*.txt
[INFO] Exclude: **/goal.txt
[INFO] Exclude: **/target/generated-test-sources/**
[INFO] Exclude: **/scripts/scrunch

mojoStarted org.apache.rat:apache-rat-plugin:0.8(rat-check)
[INFO] 
[INFO] --- apache-rat-plugin:0.8:check (rat-check) @ crunch-examples ---
mojoSucceeded org.apache.rat:apache-rat-plugin:0.8(rat-check)
mojoStarted org.apache.maven.plugins:maven-jar-plugin:2.4(default-jar)
[INFO] [INFO] Building jar: <https://builds.apache.org/job/Crunch-master-integration/ws/crunch-examples/target/crunch-examples-0.4.0-incubating-SNAPSHOT.jar>

[INFO] --- maven-jar-plugin:2.4:jar (default-jar) @ crunch-examples ---
mojoSucceeded org.apache.maven.plugins:maven-jar-plugin:2.4(default-jar)
mojoStarted org.apache.maven.plugins:maven-assembly-plugin:2.2.1(make-assembly)
[INFO] 
[INFO] --- maven-assembly-plugin:2.2.1:single (make-assembly) @ crunch-examples ---
[INFO] Reading assembly descriptor: src/main/assembly/hadoop-job.xml
[INFO] Building jar: <https://builds.apache.org/job/Crunch-master-integration/ws/crunch-examples/target/crunch-examples-0.4.0-incubating-SNAPSHOT-job.jar>
mojoSucceeded org.apache.maven.plugins:maven-assembly-plugin:2.2.1(make-assembly)
projectSucceeded org.apache.crunch:crunch-examples:0.4.0-incubating-SNAPSHOT
projectStarted org.apache.crunch:crunch-archetype:0.4.0-incubating-SNAPSHOT
[INFO]                                                                         
[INFO] ------------------------------------------------------------------------
[INFO] Building Apache Crunch Archetype 0.4.0-incubating-SNAPSHOT
[INFO] ------------------------------------------------------------------------
mojoStarted org.apache.maven.plugins:maven-clean-plugin:2.5(default-clean)
[INFO] 
[INFO] --- maven-clean-plugin:2.5:clean (default-clean) @ crunch-archetype ---
mojoSucceeded org.apache.maven.plugins:maven-clean-plugin:2.5(default-clean)
mojoStarted org.apache.maven.plugins:maven-remote-resources-plugin:1.3(default)
[INFO] 
[INFO] --- maven-remote-resources-plugin:1.3:process (default) @ crunch-archetype ---
mojoSucceeded org.apache.maven.plugins:maven-remote-resources-plugin:1.3(default)
mojoStarted org.apache.maven.plugins:maven-resources-plugin:2.5(default-resources)[debug]
execute contextualize
[INFO] Using 'UTF-8' encoding to copy filtered resources.
[INFO] Copying 1 resource

[INFO] 
[INFO] --- maven-resources-plugin:2.5:resources (default-resources) @ crunch-archetype ---
[INFO] Copying 7 resources
[INFO] Copying 3 resources
mojoSucceeded org.apache.maven.plugins:maven-resources-plugin:2.5(default-resources)
mojoStarted org.apache.maven.plugins:maven-resources-plugin:2.5(default-testResources)[debug]
execute contextualize
[INFO] Using 'UTF-8' encoding to copy filtered resources.
[INFO] Copying 2 resources
[INFO] Copying 3 resources

[INFO] 
[INFO] --- maven-resources-plugin:2.5:testResources (default-testResources) @ crunch-archetype
---
mojoSucceeded org.apache.maven.plugins:maven-resources-plugin:2.5(default-testResources)
mojoStarted org.apache.rat:apache-rat-plugin:0.8(rat-check)
[INFO] 
[INFO] --- apache-rat-plugin:0.8:check (rat-check) @ crunch-archetype ---
[INFO] Exclude: DEPENDENCIES
[INFO] Exclude: .git/**
[INFO] Exclude: .gitignore
[INFO] Exclude: .repository/
[INFO] Exclude: **/resources/*.txt
[INFO] Exclude: **/goal.txt
[INFO] Exclude: **/target/generated-test-sources/**
[INFO] Exclude: **/scripts/scrunch
mojoSucceeded org.apache.rat:apache-rat-plugin:0.8(rat-check)
mojoStarted org.apache.maven.plugins:maven-archetype-plugin:2.2(default-jar)
[INFO] 
[INFO] --- maven-archetype-plugin:2.2:jar (default-jar) @ crunch-archetype ---
[INFO] Building archetype jar: <https://builds.apache.org/job/Crunch-master-integration/ws/crunch-archetype/target/crunch-archetype-0.4.0-incubating-SNAPSHOT>
mojoSucceeded org.apache.maven.plugins:maven-archetype-plugin:2.2(default-jar)
mojoStarted org.apache.maven.plugins:maven-archetype-plugin:2.2(default-integration-test)[INFO]
Processing Archetype IT project: basic
[INFO] ----------------------------------------------------------------------------
[INFO] Using following parameters for creating project from Archetype: crunch-archetype:0.4.0-incubating-SNAPSHOT
[INFO] ----------------------------------------------------------------------------
[INFO] Parameter: groupId, Value: archetype.it
[INFO] Parameter: artifactId, Value: basic
[INFO] Parameter: version, Value: 0.1-SNAPSHOT
[INFO] Parameter: package, Value: it.pkg
[INFO] Parameter: packageInPathFormat, Value: it/pkg
[INFO] Parameter: version, Value: 0.1-SNAPSHOT
[INFO] Parameter: package, Value: it.pkg
[INFO] Parameter: groupId, Value: archetype.it
[INFO] Parameter: artifactId, Value: basic

[INFO] 
[INFO] project created from Archetype in dir: <https://builds.apache.org/job/Crunch-master-integration/ws/crunch-archetype/target/test-classes/projects/basic/project/basic>
[INFO] --- maven-archetype-plugin:2.2:integration-test (default-integration-test) @ crunch-archetype
---[INFO] Invoking post-archetype-generation goals: clean package


[INFO] [INFO] Error stacktraces are turned on.
[INFO] [INFO] Scanning for projects...
[INFO] [INFO]                                                                         
[INFO] [INFO] ------------------------------------------------------------------------
[INFO] [INFO] Building basic 0.1-SNAPSHOT
[INFO] [INFO] ------------------------------------------------------------------------
[INFO] [WARNING] The POM for org.apache.crunch:crunch:jar:0.4.0-incubating-SNAPSHOT is missing,
no dependency information available
[INFO] [INFO] ------------------------------------------------------------------------
[INFO] [INFO] BUILD FAILURE
[INFO] [INFO] ------------------------------------------------------------------------
[INFO] [INFO] Total time: 0.992s
[INFO] [INFO] Finished at: Mon Oct 01 00:26:48 UTC 2012
[INFO] [INFO] Final Memory: 3M/61M
[INFO] [INFO] ------------------------------------------------------------------------
[INFO] [ERROR] Failed to execute goal on project basic: Could not resolve dependencies for
project archetype.it:basic:jar:0.1-SNAPSHOT: Could not find artifact org.apache.crunch:crunch:jar:0.4.0-incubating-SNAPSHOT
-> [Help 1]
[INFO] org.apache.maven.lifecycle.LifecycleExecutionException: Failed to execute goal on project
basic: Could not resolve dependencies for project archetype.it:basic:jar:0.1-SNAPSHOT: Could
not find artifact org.apache.crunch:crunch:jar:0.4.0-incubating-SNAPSHOT
[INFO] 	at org.apache.maven.lifecycle.internal.LifecycleDependencyResolver.getDependencies(LifecycleDependencyResolver.java:196)
[INFO] 	at org.apache.maven.lifecycle.internal.LifecycleDependencyResolver.resolveProjectDependencies(LifecycleDependencyResolver.java:108)
[INFO] 	at org.apache.maven.lifecycle.internal.MojoExecutor.ensureDependenciesAreResolved(MojoExecutor.java:258)
[INFO] 	at org.apache.maven.lifecycle.internal.MojoExecutor.execute(MojoExecutor.java:201)
[INFO] 	at org.apache.maven.lifecycle.internal.MojoExecutor.execute(MojoExecutor.java:153)
[INFO] 	at org.apache.maven.lifecycle.internal.MojoExecutor.execute(MojoExecutor.java:145)
[INFO] 	at org.apache.maven.lifecycle.internal.LifecycleModuleBuilder.buildProject(LifecycleModuleBuilder.java:84)
[INFO] 	at org.apache.maven.lifecycle.internal.LifecycleModuleBuilder.buildProject(LifecycleModuleBuilder.java:59)
[INFO] 	at org.apache.maven.lifecycle.internal.LifecycleStarter.singleThreadedBuild(LifecycleStarter.java:183)
[INFO] 	at org.apache.maven.lifecycle.internal.LifecycleStarter.execute(LifecycleStarter.java:161)
[INFO] 	at org.apache.maven.DefaultMaven.doExecute(DefaultMaven.java:319)
[INFO] 	at org.apache.maven.DefaultMaven.execute(DefaultMaven.java:156)
[INFO] 	at org.apache.maven.cli.MavenCli.execute(MavenCli.java:537)
[INFO] 	at org.apache.maven.cli.MavenCli.doMain(MavenCli.java:196)
[INFO] 	at org.apache.maven.cli.MavenCli.main(MavenCli.java:141)
[INFO] 	at sun.reflect.NativeMethodAccessorImpl.invoke0(Native Method)
[INFO] 	at sun.reflect.NativeMethodAccessorImpl.invoke(NativeMethodAccessorImpl.java:39)
[INFO] 	at sun.reflect.DelegatingMethodAccessorImpl.invoke(DelegatingMethodAccessorImpl.java:25)
[INFO] 	at java.lang.reflect.Method.invoke(Method.java:597)
[INFO] 	at org.codehaus.plexus.classworlds.launcher.Launcher.launchEnhanced(Launcher.java:290)
[INFO] 	at org.codehaus.plexus.classworlds.launcher.Launcher.launch(Launcher.java:230)
[INFO] 	at org.codehaus.plexus.classworlds.launcher.Launcher.mainWithExitCode(Launcher.java:409)
[INFO] 	at org.codehaus.plexus.classworlds.launcher.Launcher.main(Launcher.java:352)
[INFO] Caused by: org.apache.maven.project.DependencyResolutionException: Could not resolve
dependencies for project archetype.it:basic:jar:0.1-SNAPSHOT: Could not find artifact org.apache.crunch:crunch:jar:0.4.0-incubating-SNAPSHOT
[INFO] 	at org.apache.maven.project.DefaultProjectDependenciesResolver.resolve(DefaultProjectDependenciesResolver.java:170)
[INFO] 	at org.apache.maven.lifecycle.internal.LifecycleDependencyResolver.getDependencies(LifecycleDependencyResolver.java:171)
[INFO] 	... 22 more
[INFO] Caused by: org.sonatype.aether.resolution.DependencyResolutionException: Could not
find artifact org.apache.crunch:crunch:jar:0.4.0-incubating-SNAPSHOT
[INFO] 	at org.sonatype.aether.impl.internal.DefaultRepositorySystem.resolveDependencies(DefaultRepositorySystem.java:412)
[INFO] 	at org.apache.maven.project.DefaultProjectDependenciesResolver.resolve(DefaultProjectDependenciesResolver.java:164)
[INFO] 	... 23 more
[INFO] Caused by: org.sonatype.aether.resolution.ArtifactResolutionException: Could not find
artifact org.apache.crunch:crunch:jar:0.4.0-incubating-SNAPSHOT
[INFO] 	at org.sonatype.aether.impl.internal.DefaultArtifactResolver.resolve(DefaultArtifactResolver.java:541)
[INFO] 	at org.sonatype.aether.impl.internal.DefaultArtifactResolver.resolveArtifacts(DefaultArtifactResolver.java:220)
[INFO] 	at org.sonatype.aether.impl.internal.DefaultRepositorySystem.resolveDependencies(DefaultRepositorySystem.java:395)
[INFO] 	... 24 more
[INFO] Caused by: org.sonatype.aether.transfer.ArtifactNotFoundException: Could not find artifact
org.apache.crunch:crunch:jar:0.4.0-incubating-SNAPSHOT
[INFO] 	at org.sonatype.aether.impl.internal.DefaultArtifactResolver.resolve(DefaultArtifactResolver.java:531)
[INFO] 	... 26 more
[INFO] [ERROR] 
[INFO] [ERROR] Re-run Maven using the -X switch to enable full debug logging.
[INFO] [ERROR] 
[INFO] [ERROR] For more information about the errors and possible solutions, please read the
following articles:
[INFO] [ERROR] [Help 1] http://cwiki.apache.org/confluence/display/MAVEN/DependencyResolutionException
[INFO] Post-archetype-generation invoker exit code: 1
mojoFailed org.apache.maven.plugins:maven-archetype-plugin:2.2(default-integration-test)
projectFailed org.apache.crunch:crunch-archetype:0.4.0-incubating-SNAPSHOT
sessionEnded
[INFO] ------------------------------------------------------------------------
[INFO] Reactor Summary:
[INFO] 
[INFO] Apache Crunch ..................................... SUCCESS [25.130s]
[INFO] Apache Crunch Test ................................ SUCCESS [17.274s]
[INFO] Apache Crunch Core ................................ SUCCESS [19:11.027s]
[INFO] Apache Crunch HBase Support ....................... SUCCESS [1:13.062s]
[INFO] Apache Crunch Examples ............................ SUCCESS [4.168s]
[INFO] Apache Crunch Archetype ........................... FAILURE [5.243s]
[INFO] Apache Crunch for Scala ........................... SKIPPED
[INFO] ------------------------------------------------------------------------
[INFO] BUILD FAILURE
[INFO] ------------------------------------------------------------------------
[INFO] Total time: 21:19.398s
[INFO] Finished at: Mon Oct 01 00:26:49 UTC 2012
[INFO] Final Memory: 34M/69M
[INFO] ------------------------------------------------------------------------
Projects to build: [MavenProject: org.apache.crunch:crunch-parent:0.4.0-incubating-SNAPSHOT
@ <https://builds.apache.org/job/Crunch-master-integration/ws/pom.xml,> MavenProject:
org.apache.crunch:crunch-test:0.4.0-incubating-SNAPSHOT @ <https://builds.apache.org/job/Crunch-master-integration/ws/crunch-test/pom.xml,>
MavenProject: org.apache.crunch:crunch:0.4.0-incubating-SNAPSHOT @ <https://builds.apache.org/job/Crunch-master-integration/ws/crunch/pom.xml,>
MavenProject: org.apache.crunch:crunch-hbase:0.4.0-incubating-SNAPSHOT @ <https://builds.apache.org/job/Crunch-master-integration/ws/crunch-hbase/pom.xml,>
MavenProject: org.apache.crunch:crunch-examples:0.4.0-incubating-SNAPSHOT @ <https://builds.apache.org/job/Crunch-master-integration/ws/crunch-examples/pom.xml,>
MavenProject: org.apache.crunch:crunch-archetype:0.4.0-incubating-SNAPSHOT @ <https://builds.apache.org/job/Crunch-master-integration/ws/crunch-archetype/pom.xml,>
MavenProject: org.apache.crunch:crunch-scrunch:0.4.0-incubating-SNAPSHOT @ <https://builds.apache.org/job/Crunch-master-integration/ws/crunch-scrunch/pom.xml]>
[JENKINS] Archiving <https://builds.apache.org/job/Crunch-master-integration/ws/crunch-hbase/pom.xml>
to /home/hudson/hudson/jobs/Crunch-master-integration/modules/org.apache.crunch$crunch-hbase/builds/2012-10-01_00-05-14/archive/org.apache.crunch/crunch-hbase/0.4.0-incubating-SNAPSHOT/crunch-hbase-0.4.0-incubating-SNAPSHOT.pom
[JENKINS] Archiving <https://builds.apache.org/job/Crunch-master-integration/ws/crunch-hbase/target/crunch-hbase-0.4.0-incubating-SNAPSHOT.jar>
to /home/hudson/hudson/jobs/Crunch-master-integration/modules/org.apache.crunch$crunch-hbase/builds/2012-10-01_00-05-14/archive/org.apache.crunch/crunch-hbase/0.4.0-incubating-SNAPSHOT/crunch-hbase-0.4.0-incubating-SNAPSHOT.jar
[JENKINS] Archiving <https://builds.apache.org/job/Crunch-master-integration/ws/crunch-scrunch/pom.xml>
to /home/hudson/hudson/jobs/Crunch-master-integration/modules/org.apache.crunch$crunch-scrunch/builds/2012-10-01_00-05-14/archive/org.apache.crunch/crunch-scrunch/0.4.0-incubating-SNAPSHOT/crunch-scrunch-0.4.0-incubating-SNAPSHOT.pom
[JENKINS] Archiving <https://builds.apache.org/job/Crunch-master-integration/ws/crunch/pom.xml>
to /home/hudson/hudson/jobs/Crunch-master-integration/modules/org.apache.crunch$crunch/builds/2012-10-01_00-05-14/archive/org.apache.crunch/crunch/0.4.0-incubating-SNAPSHOT/crunch-0.4.0-incubating-SNAPSHOT.pom
[JENKINS] Archiving <https://builds.apache.org/job/Crunch-master-integration/ws/crunch/target/crunch-0.4.0-incubating-SNAPSHOT.jar>
to /home/hudson/hudson/jobs/Crunch-master-integration/modules/org.apache.crunch$crunch/builds/2012-10-01_00-05-14/archive/org.apache.crunch/crunch/0.4.0-incubating-SNAPSHOT/crunch-0.4.0-incubating-SNAPSHOT.jar
[JENKINS] Archiving <https://builds.apache.org/job/Crunch-master-integration/ws/crunch-archetype/pom.xml>
to /home/hudson/hudson/jobs/Crunch-master-integration/modules/org.apache.crunch$crunch-archetype/builds/2012-10-01_00-05-14/archive/org.apache.crunch/crunch-archetype/0.4.0-incubating-SNAPSHOT/crunch-archetype-0.4.0-incubating-SNAPSHOT.pom
[JENKINS] Archiving <https://builds.apache.org/job/Crunch-master-integration/ws/crunch-archetype/target/crunch-archetype-0.4.0-incubating-SNAPSHOT.jar>
to /home/hudson/hudson/jobs/Crunch-master-integration/modules/org.apache.crunch$crunch-archetype/builds/2012-10-01_00-05-14/archive/org.apache.crunch/crunch-archetype/0.4.0-incubating-SNAPSHOT/crunch-archetype-0.4.0-incubating-SNAPSHOT.jar
[JENKINS] Archiving <https://builds.apache.org/job/Crunch-master-integration/ws/pom.xml>
to /home/hudson/hudson/jobs/Crunch-master-integration/modules/org.apache.crunch$crunch-parent/builds/2012-10-01_00-05-14/archive/org.apache.crunch/crunch-parent/0.4.0-incubating-SNAPSHOT/crunch-parent-0.4.0-incubating-SNAPSHOT.pom
[JENKINS] Archiving <https://builds.apache.org/job/Crunch-master-integration/ws/target/crunch-parent-0.4.0-incubating-SNAPSHOT-site.xml>
to /home/hudson/hudson/jobs/Crunch-master-integration/modules/org.apache.crunch$crunch-parent/builds/2012-10-01_00-05-14/archive/org.apache.crunch/crunch-parent/0.4.0-incubating-SNAPSHOT/crunch-parent-0.4.0-incubating-SNAPSHOT-site.xml
[JENKINS] Archiving <https://builds.apache.org/job/Crunch-master-integration/ws/crunch-examples/pom.xml>
to /home/hudson/hudson/jobs/Crunch-master-integration/modules/org.apache.crunch$crunch-examples/builds/2012-10-01_00-05-14/archive/org.apache.crunch/crunch-examples/0.4.0-incubating-SNAPSHOT/crunch-examples-0.4.0-incubating-SNAPSHOT.pom
[JENKINS] Archiving <https://builds.apache.org/job/Crunch-master-integration/ws/crunch-examples/target/crunch-examples-0.4.0-incubating-SNAPSHOT.jar>
to /home/hudson/hudson/jobs/Crunch-master-integration/modules/org.apache.crunch$crunch-examples/builds/2012-10-01_00-05-14/archive/org.apache.crunch/crunch-examples/0.4.0-incubating-SNAPSHOT/crunch-examples-0.4.0-incubating-SNAPSHOT.jar
[JENKINS] Archiving <https://builds.apache.org/job/Crunch-master-integration/ws/crunch-examples/target/crunch-examples-0.4.0-incubating-SNAPSHOT-job.jar>
to /home/hudson/hudson/jobs/Crunch-master-integration/modules/org.apache.crunch$crunch-examples/builds/2012-10-01_00-05-14/archive/org.apache.crunch/crunch-examples/0.4.0-incubating-SNAPSHOT/crunch-examples-0.4.0-incubating-SNAPSHOT-job.jar
[JENKINS] Archiving <https://builds.apache.org/job/Crunch-master-integration/ws/crunch-test/pom.xml>
to /home/hudson/hudson/jobs/Crunch-master-integration/modules/org.apache.crunch$crunch-test/builds/2012-10-01_00-05-14/archive/org.apache.crunch/crunch-test/0.4.0-incubating-SNAPSHOT/crunch-test-0.4.0-incubating-SNAPSHOT.pom
[JENKINS] Archiving <https://builds.apache.org/job/Crunch-master-integration/ws/crunch-test/target/crunch-test-0.4.0-incubating-SNAPSHOT.jar>
to /home/hudson/hudson/jobs/Crunch-master-integration/modules/org.apache.crunch$crunch-test/builds/2012-10-01_00-05-14/archive/org.apache.crunch/crunch-test/0.4.0-incubating-SNAPSHOT/crunch-test-0.4.0-incubating-SNAPSHOT.jar
Waiting for Jenkins to finish collecting data
mavenExecutionResult exceptions not empty
message : Failed to execute goal org.apache.maven.plugins:maven-archetype-plugin:2.2:integration-test
(default-integration-test) on project crunch-archetype: 
Archetype IT 'basic' failed: Execution failure: exit code = 1
cause : 
Archetype IT 'basic' failed: Execution failure: exit code = 1
Stack trace : 
org.apache.maven.lifecycle.LifecycleExecutionException: Failed to execute goal org.apache.maven.plugins:maven-archetype-plugin:2.2:integration-test
(default-integration-test) on project crunch-archetype: 
Archetype IT 'basic' failed: Execution failure: exit code = 1
	at org.apache.maven.lifecycle.internal.MojoExecutor.execute(MojoExecutor.java:217)
	at org.apache.maven.lifecycle.internal.MojoExecutor.execute(MojoExecutor.java:153)
	at org.apache.maven.lifecycle.internal.MojoExecutor.execute(MojoExecutor.java:145)
	at org.apache.maven.lifecycle.internal.LifecycleModuleBuilder.buildProject(LifecycleModuleBuilder.java:84)
	at org.apache.maven.lifecycle.internal.LifecycleModuleBuilder.buildProject(LifecycleModuleBuilder.java:59)
	at org.apache.maven.lifecycle.internal.LifecycleStarter.singleThreadedBuild(LifecycleStarter.java:183)
	at org.apache.maven.lifecycle.internal.LifecycleStarter.execute(LifecycleStarter.java:161)
	at org.apache.maven.DefaultMaven.doExecute(DefaultMaven.java:319)
	at org.apache.maven.DefaultMaven.execute(DefaultMaven.java:156)
	at org.jvnet.hudson.maven3.launcher.Maven3Launcher.main(Maven3Launcher.java:79)
	at sun.reflect.NativeMethodAccessorImpl.invoke0(Native Method)
	at sun.reflect.NativeMethodAccessorImpl.invoke(NativeMethodAccessorImpl.java:39)
	at sun.reflect.DelegatingMethodAccessorImpl.invoke(DelegatingMethodAccessorImpl.java:25)
	at java.lang.reflect.Method.invoke(Method.java:597)
	at org.codehaus.plexus.classworlds.launcher.Launcher.launchStandard(Launcher.java:329)
	at org.codehaus.plexus.classworlds.launcher.Launcher.launch(Launcher.java:239)
	at org.jvnet.hudson.maven3.agent.Maven3Main.launch(Maven3Main.java:158)
	at hudson.maven.Maven3Builder.call(Maven3Builder.java:98)
	at hudson.maven.Maven3Builder.call(Maven3Builder.java:64)
	at hudson.remoting.UserRequest.perform(UserRequest.java:118)
	at hudson.remoting.UserRequest.perform(UserRequest.java:48)
	at hudson.remoting.Request$2.run(Request.java:326)
	at hudson.remoting.InterceptingExecutorService$1.call(InterceptingExecutorService.java:72)
	at java.util.concurrent.FutureTask$Sync.innerRun(FutureTask.java:303)
	at java.util.concurrent.FutureTask.run(FutureTask.java:138)
	at java.util.concurrent.ThreadPoolExecutor$Worker.runTask(ThreadPoolExecutor.java:886)
	at java.util.concurrent.ThreadPoolExecutor$Worker.run(ThreadPoolExecutor.java:908)
	at java.lang.Thread.run(Thread.java:662)
Caused by: org.apache.maven.plugin.MojoExecutionException: 
Archetype IT 'basic' failed: Execution failure: exit code = 1
	at org.apache.maven.archetype.mojos.IntegrationTestMojo.execute(IntegrationTestMojo.java:268)
	at org.apache.maven.plugin.DefaultBuildPluginManager.executeMojo(DefaultBuildPluginManager.java:101)
	at org.apache.maven.lifecycle.internal.MojoExecutor.execute(MojoExecutor.java:209)
	... 27 more
Sending e-mails to: crunch-dev@incubator.apache.org
channel stopped
[locks-and-latches] Releasing all the locks
[locks-and-latches] All the locks released

Mime
View raw message