incubator-couchdb-user mailing list archives

Site index · List index
Message view « Date » · « Thread »
Top « Date » · « Thread »
From Pieter van der Eems <p.van.der.e...@interactiveblueprints.nl>
Subject Compiling couchdb on a armhf machine.
Date Wed, 07 Aug 2013 12:34:09 GMT
Hello.

I'm trying to compile couchdb on a arm machine with hardfloat (cpu:
RK3066, ARMv7).
OS: Debian jessie/sid.

When I compile with rake I always get an error like this:
-----------------------
/bin/bash /media/hitachi/couchdb/dependencies/icu4c-4_4/source/mkinstalldirs
uconvmsg
mkdir uconvmsg
LD_LIBRARY_PATH=../../lib:../../stubdata:../../tools/ctestfw:$LD_LIBRARY_PATH
 ../../bin/genrb -e UTF-8
-s /media/hitachi/couchdb/dependencies/icu4c-4_4/source/extra/uconv/resources
-d uconvmsg root.txt
/bin/bash /media/hitachi/couchdb/dependencies/icu4c-4_4/source/mkinstalldirs
uconvmsg
LD_LIBRARY_PATH=../../lib:../../stubdata:../../tools/ctestfw:$LD_LIBRARY_PATH
 ../../bin/genrb -e UTF-8
-s /media/hitachi/couchdb/dependencies/icu4c-4_4/source/extra/uconv/resources
-d uconvmsg fr.txt
make -f pkgdataMakefile
make[3]: Entering directory `/tmp/icu_build20130807-21270-1u7mine/extra/uconv'
rm -rf pkgdata.inc
make[3]: Leaving directory `/tmp/icu_build20130807-21270-1u7mine/extra/uconv'
LD_LIBRARY_PATH=../../lib:../../stubdata:../../tools/ctestfw:$LD_LIBRARY_PATH
 MAKEFLAGS= ../../bin/pkgdata -p uconvmsg -O pkgdata.inc -m static -s
uconvmsg -d uconvmsg -T uconvmsg uconvmsg/uconvmsg.lst
uconvmsg/uconvmsg_dat.s: Assembler messages:
uconvmsg/uconvmsg_dat.s:2: Error: junk at end of line, first
unrecognized character is `,'
uconvmsg/uconvmsg_dat.s:5: Error: unrecognized symbol type ""
Error generating assembly code for data.
pkgdata: gcc -D_REENTRANT  -g -O2 -Wall -ansi -pedantic -Wshadow
-Wpointer-arith -Wmissing-prototypes -Wwrite-strings -Wno-long-long
-c -I/media/hitachi/couchdb/dependencies/icu4c-4_4/source/common
-I../../common -DPIC -fPIC -o uconvmsg/uconvmsg_dat.o
uconvmsg/uconvmsg_dat.s
-- return status = 256
g++ -g -O2 -W -Wall -ansi -pedantic -Wpointer-arith -Wwrite-strings
-Wno-long-long   -o ../../bin/uconv uconv.o uwmsg.o -L../../lib
-licui18n -L../../lib -licuuc -L../../lib -L../../stubdata -licudata
-lpthread -ldl -lm   uconvmsg/libuconvmsg.a
g++: error: uconvmsg/libuconvmsg.a: No such file or directory
make[2]: Leaving directory `/tmp/icu_build20130807-21270-1u7mine/extra/uconv'
make[2]: *** [../../bin/uconv] Error 1
make[1]: *** [all-recursive] Error 2
make[1]: Leaving directory `/tmp/icu_build20130807-21270-1u7mine/extra'
make: *** [all-recursive] Error 2
rake aborted!
Command failed with status (2): [make ...]
------------------------

Looks like something went wrong with the assembler.

Anyone any idea what I did wrong or how I can compile couchdb on armhf?

Greetz,
Pieter.

Mime
View raw message