incubator-cloudstack-dev mailing list archives

Site index · List index
Message view « Date » · « Thread »
Top « Date » · « Thread »
From Isaac Chiang <isaacchi...@gmail.com>
Subject Master build failure
Date Thu, 21 Feb 2013 01:12:14 GMT
Hi all:
        I was trying to build CloudStack from source and blocked by
following message:

[INFO] Apache CloudStack Plugin - Network Elastic Load Balancer  SUCCESS
[2.816s]
[INFO] Apache CloudStack Plugin - Network Nicira NVP ..... FAILURE [7.876s]
[INFO] Apache CloudStack Plugin - BigSwitch Virtual Network Segment  SKIPPED
[INFO] Apache CloudStack Plugin - Storage Allocator Random  SKIPPED
[INFO] Apache CloudStack Plugin - User Authenticator LDAP  SKIPPED
[INFO] Apache CloudStack Plugin - User Authenticator MD5 . SKIPPED
[INFO] Apache CloudStack Plugin - User Authenticator Plain Text  SKIPPED
[INFO] Apache CloudStack Plugin - User Authenticator SHA256 Salted  SKIPPED
[INFO] Apache CloudStack Plugin - Dns Notifier Example ... SKIPPED
[INFO] Apache CloudStack Engine Storage Image Component .. SKIPPED
[INFO] Apache CloudStack Plugin - Storage Image S3 ....... SKIPPED
[INFO] Apache CloudStack Engine Storage Volume Component . SKIPPED
[INFO] Apache CloudStack Plugin - Storage Volume solidfire  SKIPPED
[INFO] Apache CloudStack SystemVM Patches ................ SKIPPED
[INFO] Apache CloudStack Cloud Engine Compute Component .. SKIPPED
[INFO] Apache CloudStack Cloud Engine Orchestration Component  SKIPPED
[INFO] Apache CloudStack Engine Storage Image Motion Component  SKIPPED
[INFO] Apache CloudStack Engine Storage Backup Component . SKIPPED
[INFO] Apache CloudStack Engine Storage Snapshot Component  SKIPPED
[INFO] Apache CloudStack Engine Storage integration test Component  SKIPPED
[INFO] Apache CloudStack Cloud Engine Schema Component ... SKIPPED
[INFO] Apache CloudStack Cloud Engine API ................ SKIPPED
[INFO] Apache CloudStack Cloud Engine Service ............ SKIPPED
INFO] Apache CloudStack Console Proxy Plugin ............ SKIPPED
[INFO] Apache CloudStack Console Proxy ................... SKIPPED
[INFO] Apache CloudStack Test ............................ SKIPPED
[INFO] Apache CloudStack Client UI ....................... SKIPPED
[INFO] Apache CloudStack Developer Tools ................. SKIPPED
[INFO] Apache CloudStack Developer Tools ................. SKIPPED
[INFO] Apache CloudStack marvin .......................... SKIPPED
[INFO] Apache CloudStack cloudmonkey cli ................. SKIPPED
[INFO] Apache CloudStack DevCloud ........................ SKIPPED
[INFO] Apache CloudStack DevCloud-KVM .................... SKIPPED
[INFO]
------------------------------------------------------------------------
[INFO] BUILD FAILURE
[INFO]
------------------------------------------------------------------------
[INFO] Total time: 3:11.112s
[INFO] Finished at: Thu Feb 21 09:04:16 CST 2013
[INFO] Final Memory: 34M/241M
[INFO]
------------------------------------------------------------------------
[ERROR] Failed to execute goal
org.apache.maven.plugins:maven-surefire-plugin:2.12:test (default-test) on
project cloud-plugin-network-
nvp: There are test failures.

The commit version is : commit 744c24ee

Anyone else running into this? Any help will be appreciated

Thanks

Isaac Chiang

Mime
  • Unnamed multipart/alternative (inline, None, 0 bytes)
View raw message