incubator-cloudstack-dev mailing list archives

Site index · List index
Message view « Date » · « Thread »
Top « Date » · « Thread »
From Anshul Gangwar <anshul.gang...@citrix.com>
Subject Re: Building Master is failing for nonoss.
Date Fri, 28 Dec 2012 06:46:23 GMT
Hi,
      For me it is failing in building Network Netscaler plugin. I have
tried things suggested in this thread and on
https://cwiki.apache.org/CLOUDSTACK/building-with-maven.html. Error is
as follows

[ERROR] Failed to execute goal
org.apache.maven.plugins:maven-compiler-plugin:2.5.1:compile
(default-compile) on project cloud-plugin-network-netscaler: Compilation
failure: Compilation failure:
[ERROR]
/home/anshul/asfCloudStack/incubator-cloudstack/plugins/network-elements/netscaler/src/com/cloud/network/resource/NetscalerResource.java:[31,59]
error: package com.citrix.netscaler.nitro.resource.config.autoscale does
not exist
[ERROR]
/home/anshul/asfCloudStack/incubator-cloudstack/plugins/network-elements/netscaler/src/com/cloud/network/resource/NetscalerResource.java:[32,59]
error: package com.citrix.netscaler.nitro.resource.config.autoscale does
not exist
[ERROR]
/home/anshul/asfCloudStack/incubator-cloudstack/plugins/network-elements/netscaler/src/com/cloud/network/resource/NetscalerResource.java:[39,52]
error: cannot find symbol
[ERROR] symbol:   class lbmonitor_metric_binding
[ERROR] location: package com.citrix.netscaler.nitro.resource.config.lb
[ERROR]
/home/anshul/asfCloudStack/incubator-cloudstack/plugins/network-elements/netscaler/src/com/cloud/network/resource/NetscalerResource.java:[51,52]
error: cannot find symbol
[ERROR] symbol:   class nstimer
[ERROR] location: package com.citrix.netscaler.nitro.resource.config.ns
[ERROR]
/home/anshul/asfCloudStack/incubator-cloudstack/plugins/network-elements/netscaler/src/com/cloud/network/resource/NetscalerResource.java:[52,52]
error: cannot find symbol
[ERROR] symbol:   class nstimer_autoscalepolicy_binding
[ERROR] location: package com.citrix.netscaler.nitro.resource.config.ns
[ERROR]
/home/anshul/asfCloudStack/incubator-cloudstack/plugins/network-elements/netscaler/src/com/cloud/network/resource/NetscalerResource.java:[1537,28]
error: cannot find symbol
[ERROR] symbol:   method set_autoscale(String)
[ERROR] location: variable serviceGroup of type servicegroup
[ERROR]
/home/anshul/asfCloudStack/incubator-cloudstack/plugins/network-elements/netscaler/src/com/cloud/network/resource/NetscalerResource.java:[1538,28]
error: cannot find symbol
[ERROR] symbol:   method set_memberport(int)
[ERROR] location: variable serviceGroup of type servicegroup
[ERROR]
/home/anshul/asfCloudStack/incubator-cloudstack/plugins/network-elements/netscaler/src/com/cloud/network/resource/NetscalerResource.java:[1648,23]
error: cannot find symbol
[ERROR] symbol:   method set_minautoscalemembers(int)
[ERROR] location: variable vserver of type lbvserver
[ERROR]
/home/anshul/asfCloudStack/incubator-cloudstack/plugins/network-elements/netscaler/src/com/cloud/network/resource/NetscalerResource.java:[1649,23]
error: cannot find symbol
[ERROR] symbol:   method set_maxautoscalemembers(int)
[ERROR] location: variable vserver of type lbvserver
[ERROR]
/home/anshul/asfCloudStack/incubator-cloudstack/plugins/network-elements/netscaler/src/com/cloud/network/resource/NetscalerResource.java:[1665,12]
error: cannot find symbol
[ERROR] symbol:   class autoscaleprofile
[ERROR] location: class NetscalerResource
[ERROR]
/home/anshul/asfCloudStack/incubator-cloudstack/plugins/network-elements/netscaler/src/com/cloud/network/resource/NetscalerResource.java:[1665,52]
error: cannot find symbol
[ERROR] symbol:   class autoscaleprofile
[ERROR] location: class NetscalerResource
[ERROR]
/home/anshul/asfCloudStack/incubator-cloudstack/plugins/network-elements/netscaler/src/com/cloud/network/resource/NetscalerResource.java:[1680,12]
error: cannot find symbol
[ERROR] symbol:   class nstimer
[ERROR] location: class NetscalerResource
[ERROR]
/home/anshul/asfCloudStack/incubator-cloudstack/plugins/network-elements/netscaler/src/com/cloud/network/resource/NetscalerResource.java:[1680,32]
error: cannot find symbol
[ERROR] symbol:   class nstimer
[ERROR] location: class NetscalerResource
[ERROR]
/home/anshul/asfCloudStack/incubator-cloudstack/plugins/network-elements/netscaler/src/com/cloud/network/resource/NetscalerResource.java:[1716,64]
error: package com.citrix.netscaler.nitro.resource.config.autoscale does
not exist
[ERROR]
/home/anshul/asfCloudStack/incubator-cloudstack/plugins/network-elements/netscaler/src/com/cloud/network/resource/NetscalerResource.java:[1716,153]
error: package com.citrix.netscaler.nitro.resource.config.autoscale does
not exist
[ERROR]
/home/anshul/asfCloudStack/incubator-cloudstack/plugins/network-elements/netscaler/src/com/cloud/network/resource/NetscalerResource.java:[1740,64]
error: package com.citrix.netscaler.nitro.resource.config.autoscale does
not exist
[ERROR]
/home/anshul/asfCloudStack/incubator-cloudstack/plugins/network-elements/netscaler/src/com/cloud/network/resource/NetscalerResource.java:[1740,155]
error: package com.citrix.netscaler.nitro.resource.config.autoscale does
not exist
[ERROR]
/home/anshul/asfCloudStack/incubator-cloudstack/plugins/network-elements/netscaler/src/com/cloud/network/resource/NetscalerResource.java:[1830,60]
error: cannot find symbol
[ERROR] symbol:   method set_passive(boolean)
[ERROR] location: variable servicegroup_monitor_binding of type
servicegroup_lbmonitor_binding
[ERROR]
/home/anshul/asfCloudStack/incubator-cloudstack/plugins/network-elements/netscaler/src/com/cloud/network/resource/NetscalerResource.java:[1832,62]
error: cannot find symbol
[ERROR] symbol:   method add(nitro_service,servicegroup_lbmonitor_binding)
[ERROR] location: class servicegroup_lbmonitor_binding
[ERROR]
/home/anshul/asfCloudStack/incubator-cloudstack/plugins/network-elements/netscaler/src/com/cloud/network/resource/NetscalerResource.java:[1862,28]
error: cannot find symbol
[ERROR] symbol:   class lbmonitor_metric_binding
[ERROR] location: class NetscalerResource
[ERROR]
/home/anshul/asfCloudStack/incubator-cloudstack/plugins/network-elements/netscaler/src/com/cloud/network/resource/NetscalerResource.java:[1862,82]
error: cannot find symbol
[ERROR] symbol:   class lbmonitor_metric_binding
[ERROR] location: class NetscalerResource
[ERROR]
/home/anshul/asfCloudStack/incubator-cloudstack/plugins/network-elements/netscaler/src/com/cloud/network/resource/NetscalerResource.java:[1973,64]
error: package com.citrix.netscaler.nitro.resource.config.autoscale does
not exist
[ERROR]
/home/anshul/asfCloudStack/incubator-cloudstack/plugins/network-elements/netscaler/src/com/cloud/network/resource/NetscalerResource.java:[1973,155]
error: package com.citrix.netscaler.nitro.resource.config.autoscale does
not exist
[ERROR]
/home/anshul/asfCloudStack/incubator-cloudstack/plugins/network-elements/netscaler/src/com/cloud/network/resource/NetscalerResource.java:[1984,64]
error: package com.citrix.netscaler.nitro.resource.config.autoscale does
not exist
[ERROR]
/home/anshul/asfCloudStack/incubator-cloudstack/plugins/network-elements/netscaler/src/com/cloud/network/resource/NetscalerResource.java:[1984,153]
error: package com.citrix.netscaler.nitro.resource.config.autoscale does
not exist
[ERROR]
/home/anshul/asfCloudStack/incubator-cloudstack/plugins/network-elements/netscaler/src/com/cloud/network/resource/NetscalerResource.java:[1995,12]
error: cannot find symbol
[ERROR] symbol:   class nstimer
[ERROR] location: class NetscalerResource
[ERROR]
/home/anshul/asfCloudStack/incubator-cloudstack/plugins/network-elements/netscaler/src/com/cloud/network/resource/NetscalerResource.java:[1995,32]
error: cannot find symbol
[ERROR] symbol:   class nstimer
[ERROR] location: class NetscalerResource
[ERROR]
/home/anshul/asfCloudStack/incubator-cloudstack/plugins/network-elements/netscaler/src/com/cloud/network/resource/NetscalerResource.java:[2006,12]
error: cannot find symbol
[ERROR] symbol:   class autoscaleprofile
[ERROR] location: class NetscalerResource
[ERROR]
/home/anshul/asfCloudStack/incubator-cloudstack/plugins/network-elements/netscaler/src/com/cloud/network/resource/NetscalerResource.java:[2006,52]
error: cannot find symbol
[ERROR] symbol:   class autoscaleprofile
[ERROR] location: class NetscalerResource
[ERROR]
/home/anshul/asfCloudStack/incubator-cloudstack/plugins/network-elements/netscaler/src/com/cloud/network/resource/NetscalerResource.java:[2021,50]
error: cannot find symbol
[ERROR] symbol:   method
delete(nitro_service,servicegroup_lbmonitor_binding)
[ERROR] location: class servicegroup_lbmonitor_binding
[ERROR]
/home/anshul/asfCloudStack/incubator-cloudstack/plugins/network-elements/netscaler/src/com/cloud/network/resource/NetscalerResource.java:[2071,8]
error: cannot find symbol
[ERROR] symbol:   class autoscalepolicy
[ERROR] location: class NetscalerResource
[ERROR]
/home/anshul/asfCloudStack/incubator-cloudstack/plugins/network-elements/netscaler/src/com/cloud/network/resource/NetscalerResource.java:[2071,42]
error: cannot find symbol
[ERROR] symbol:   class autoscalepolicy
[ERROR] location: class NetscalerResource
[ERROR]
/home/anshul/asfCloudStack/incubator-cloudstack/plugins/network-elements/netscaler/src/com/cloud/network/resource/NetscalerResource.java:[2089,8]
error: cannot find symbol
[ERROR] symbol:   class nstimer_autoscalepolicy_binding
[ERROR] location: class NetscalerResource
[ERROR]
/home/anshul/asfCloudStack/incubator-cloudstack/plugins/network-elements/netscaler/src/com/cloud/network/resource/NetscalerResource.java:[2089,67]
error: cannot find symbol
[ERROR] symbol:   class nstimer_autoscalepolicy_binding
[ERROR] location: class NetscalerResource
[ERROR]
/home/anshul/asfCloudStack/incubator-cloudstack/plugins/network-elements/netscaler/src/com/cloud/network/resource/NetscalerResource.java:[2109,8]
error: cannot find symbol
[ERROR] symbol:   class nstimer_autoscalepolicy_binding
[ERROR] location: class NetscalerResource
[ERROR]
/home/anshul/asfCloudStack/incubator-cloudstack/plugins/network-elements/netscaler/src/com/cloud/network/resource/NetscalerResource.java:[2109,67]
error: cannot find symbol
[ERROR] symbol:   class nstimer_autoscalepolicy_binding
[ERROR] location: class NetscalerResource
[ERROR]
/home/anshul/asfCloudStack/incubator-cloudstack/plugins/network-elements/netscaler/src/com/cloud/network/resource/NetscalerResource.java:[2122,8]
error: cannot find symbol
[ERROR] symbol:   class autoscalepolicy
[ERROR] location: class NetscalerResource
[ERROR]
/home/anshul/asfCloudStack/incubator-cloudstack/plugins/network-elements/netscaler/src/com/cloud/network/resource/NetscalerResource.java:[2122,42]
error: cannot find symbol
[ERROR] symbol:   class autoscalepolicy
[ERROR] location: class NetscalerResource
[ERROR]
/home/anshul/asfCloudStack/incubator-cloudstack/plugins/network-elements/netscaler/src/com/cloud/network/resource/NetscalerResource.java:[2135,8]
error: cannot find symbol
[ERROR] symbol:   class autoscaleprofile
[ERROR] location: class NetscalerResource
[ERROR]
/home/anshul/asfCloudStack/incubator-cloudstack/plugins/network-elements/netscaler/src/com/cloud/network/resource/NetscalerResource.java:[2135,48]
error: cannot find symbol

Thanks,
Anshul

On 19/12/12 12:53, Rajesh Battala wrote:
>
> -----Original Message-----
> From: Sateesh Chodapuneedi [mailto:sateesh.chodapuneedi@citrix.com]
> Sent: Wednesday, December 19, 2012 12:01 PM
> To: cloudstack-dev@incubator.apache.org
> Subject: RE: Building Master is failing for nonoss.
>
>> -----Original Message-----
>> From: Rajesh Battala [mailto:rajesh.battala@citrix.com]
>> Sent: 19 December 2012 11:54
>> To: cloudstack-dev@incubator.apache.org
>> Subject: Building Master is failing for nonoss.
>>
>> Hi,
>>
>> Am not able to build master , Am building nonoss.  Using mvn install -
>> Dnonoss.
>> Building is getting failed when mvn tries to build VMWare base.
>>
>> Any workaround?
>
> Please try the following steps.
> 1. Copied the dependencies in deps directory as per document https://cwiki.apache.org/CLOUDSTACK/building-with-maven.html
> 2. Removed ~/.m2/repository and ~/.m2/settings.xml 3. mvn -P deps; 4. mvn clean 5. mvn
-Dnonoss install
>
>>
>> [INFO] Executed tasks
>> [INFO]
>> [INFO] --- maven-install-plugin:2.3.1:install (default-install) @
>> cloud- patches --- [INFO] Installing /home/rajesh/acs/patches/pom.xml
>> to
>> /home/rajesh/.m2/repository/org/apache/cloudstack/cloud-patches/4.1.0-
>> SNAPSHOT/cloud-patches-4.1.0-SNAPSHOT.pom
>> [INFO]
>> [INFO]
>> -----------------------------------------------------------------
>> -------
>> [INFO] Building Apache CloudStack VMware Base 4.1.0-SNAPSHOT [INFO]
>> ----
>> --------------------------------------------------------------------
>> [INFO]
>> -----------------------------------------------------------------
>> -------
>> [INFO] Reactor Summary:
>> [INFO]
>> [INFO] Apache CloudStack ................................. SUCCESS
>> [1.945s] [INFO] Apache CloudStack Utils ...........................
>> SUCCESS [6.840s] [INFO] Apache CloudStack API
>> ............................. SUCCESS [2.929s] [INFO] Apache
>> CloudStack Core ............................ SUCCESS [1.294s] [INFO]
>> Apache CloudStack Agents .......................... SUCCESS [3.194s]
>> [INFO] Apache CloudStack SystemVM Patches ................ SUCCESS
>> [0.779s] [INFO] Apache CloudStack VMware Base .....................
>> FAILURE [0.030s] [INFO] Apache CloudStack Server ..........................
>> SKIPPED [INFO] Apache CloudStack Plugin POM ......................
>> SKIPPED [INFO] Apache CloudStack Plugin - Hypervisor VMware ......
>> SKIPPED [INFO] Apache CloudStack Console Proxy ...................
>> SKIPPED [INFO] Apache CloudStack Usage Server ....................
>> SKIPPED [INFO] Apache XenSource XAPI .............................
>> SKIPPED [INFO] Apache CloudStack Plugin - User Concentrated Pod
>> Deployment Planner  SKIPPED [INFO] Apache CloudStack Plugin - User
>> Dispersing Deployment Planner  SKIPPED [INFO] Apache CloudStack Plugin
>> - Host Allocator Random .. SKIPPED [INFO] Apache CloudStack Plugin -
>> Hypervisor OracleVM .... SKIPPED [INFO] Apache CloudStack Plugin -
>> Open vSwitch ........... SKIPPED [INFO] Apache CloudStack Plugin -
>> Hypervisor Xen ......... SKIPPED [INFO] Apache CloudStack Plugin -
>> Hypervisor KVM ......... SKIPPED [INFO] Apache CloudStack Plugin -
>> Network Elastic Load Balancer  SKIPPED [INFO] Apache CloudStack Plugin
>> - Network Nicira NVP ..... SKIPPED [INFO] Apache CloudStack Plugin -
>> Storage Allocator Random SKIPPED [INFO] Apache CloudStack Plugin -
>> User Authenticator LDAP SKIPPED [INFO] Apache CloudStack Plugin - User Authenticator
MD5 .
>> SKIPPED [INFO] Apache CloudStack Plugin - User Authenticator Plain
>> Text SKIPPED [INFO] Apache CloudStack Plugin - User Authenticator
>> SHA256 Salted  SKIPPED [INFO] CloudStack Dns Notifier Example
>> ................... SKIPPED [INFO] Apache CloudStack Plugin - NetApp
>> File System ..... SKIPPED [INFO] Apache CloudStack Plugin - F5
>> ..................... SKIPPED [INFO] Apache CloudStack Plugin -
>> Network Netscaler ...... SKIPPED [INFO] Apache CloudStack Plugin -
>> Juniper SRX ............ SKIPPED [INFO] Apache CloudStack AWS API
>> Bridge .................. SKIPPED [INFO] Apache CloudStack Client UI
>> ....................... SKIPPED [INFO] Apache CloudStack Test
>> ............................ SKIPPED [INFO]
>> ----------------------------
>> --------------------------------------------
>> [INFO] BUILD FAILURE
>> [INFO]
>> -----------------------------------------------------------------
>> -------
>> [INFO] Total time: 17.767s
>> [INFO] Finished at: Wed Dec 19 11:47:48 IST 2012 [INFO] Final Memory:
>> 15M/36M [INFO]
>> ---------------------------------------------------------
>> ---------------
>> [ERROR] Failed to execute goal on project cloud-vmware-base: Could not
>> resolve dependencies for project org.apache.cloudstack:cloud-vmware-
>> base:jar:4.1.0-SNAPSHOT: The following artifacts could not be resolved:
>> com.cloud.com.vmware:vmware-vim25:jar:4.1,
>> com.cloud.com.vmware:vmware- vim:jar:4.1,
>> com.cloud.com.vmware:vmware-apputils:jar:4.1: Failure to find
>> com.cloud.com.vmware:vmware-vim25:jar:4.1 in
>> http://repo.maven.apache.org/maven2 was cached in the local
>> repository, resolution will not be reattempted until the update
>> interval of central has elapsed or updates are forced -> [Help 1]
>> [ERROR] [ERROR] To see the full stack trace of the errors, re-run Maven with the
-e switch.
>> [ERROR] Re-run Maven using the -X switch to enable full debug logging.
>> [ERROR]
>> [ERROR] For more information about the errors and possible solutions,
>> please read the following articles:
>> [ERROR] [Help 1]
>> http://cwiki.apache.org/confluence/display/MAVEN/DependencyResolutionE
>> xc
>> eption
>> [ERROR]
>> [ERROR] After correcting the problems, you can resume the build with
>> the command
>> [ERROR]   mvn <goals> -rf :cloud-vmware-base
>>
>>
>> Thanks
>> Rajesh Battala
> Regards,
> Sateesh
>
>
> I had followed the steps. Still am getting the error.
>
> Thanks
> Rajesh Battala

Mime
View raw message